mesos-builds mailing list archives

Site index · List index
Message view « Date » · « Thread »
Top « Date » · « Thread »
From Apache Jenkins Server <jenk...@builds.apache.org>
Subject Build failed in Jenkins: Mesos-Buildbot » autotools,clang,--verbose,GLOG_v=1 MESOS_VERBOSE=1,ubuntu:14.04,(ubuntu)&&(!ubuntu-us1)&&(!ubuntu-eu2) #4130
Date Sat, 19 Aug 2017 04:40:47 GMT
See <https://builds.apache.org/job/Mesos-Buildbot/BUILDTOOL=autotools,COMPILER=clang,CONFIGURATION=--verbose,ENVIRONMENT=GLOG_v=1%20MESOS_VERBOSE=1,OS=ubuntu%3A14.04,label_exp=(ubuntu)&&(!ubuntu-us1)&&(!ubuntu-eu2)/4130/display/redirect?page=changes>

Changes:

[yujie.jay] Added a URL parameter to the resource provider driver.

[yujie.jay] Added a stream ID to resource provider manager connections.

[yujie.jay] Implemented HTTP connection handling for the resource provider driver.

[yujie.jay] Added a MockResourceProvider.

[yujie.jay] Added 'devolve' overload for 'ResourceProviderID'.

[yujie.jay] Added a resource providers total resources to the subscribe call.

[yujie.jay] Stored subscribed resources in resource provider manager.

[yujie.jay] Moved and renamed resource provider manager-related tests.

[yujie.jay] Fixed some style issues.

[gregorywmann] Added a heartbeat event to the operator API.

------------------------------------------
[...truncated 30.78 MB...]
I0819 04:40:38.190516  3934 credentials.hpp:86] Loading credential for authentication from
'/tmp/Endpoint_SlaveEndpointTest_AuthorizedRequest_2_9SmurP/credential'
I0819 04:40:38.190758  3934 slave.cpp:285] Agent using credential for: test-principal
I0819 04:40:38.190788  3934 credentials.hpp:37] Loading credentials for authentication from
'/tmp/Endpoint_SlaveEndpointTest_AuthorizedRequest_2_9SmurP/http_credentials'
I0819 04:40:38.191088  3934 http.cpp:1026] Creating default 'basic' HTTP authenticator for
realm 'mesos-agent-readonly'
I0819 04:40:38.191354  3934 http.cpp:1026] Creating default 'basic' HTTP authenticator for
realm 'mesos-agent-readwrite'
I0819 04:40:38.192919  3934 slave.cpp:581] Agent resources: [{"name":"cpus","scalar":{"value":2.0},"type":"SCALAR"},{"name":"mem","scalar":{"value":1024.0},"type":"SCALAR"},{"name":"disk","scalar":{"value":1024.0},"type":"SCALAR"},{"name":"ports","ranges":{"range":[{"begin":31000,"end":32000}]},"type":"RANGES"}]
I0819 04:40:38.193179  3934 slave.cpp:589] Agent attributes: [  ]
I0819 04:40:38.193219  3934 slave.cpp:598] Agent hostname: d2ef1182b4f2
I0819 04:40:38.193369  3938 status_update_manager.cpp:177] Pausing sending status updates
I0819 04:40:38.195026  3932 state.cpp:64] Recovering state from '/tmp/Endpoint_SlaveEndpointTest_AuthorizedRequest_2_X7OvWv/meta'
I0819 04:40:38.195291  3924 status_update_manager.cpp:203] Recovering status update manager
I0819 04:40:38.195613  3927 containerizer.cpp:609] Recovering containerizer
I0819 04:40:38.196967  3926 provisioner.cpp:416] Provisioner recovery complete
I0819 04:40:38.197324  3934 slave.cpp:6226] Finished recovery
I0819 04:40:38.197984  3934 slave.cpp:6408] Querying resource estimator for oversubscribable
resources
I0819 04:40:38.198253  3934 slave.cpp:6422] Received oversubscribable resources {} from the
resource estimator
I0819 04:40:38.200983  3923 process.cpp:3933] Handling HTTP event for process 'slave(799)'
with path: '/slave(799)/containers'
I0819 04:40:38.202682  3926 http.cpp:1166] HTTP GET for /slave(799)/containers from 172.17.0.5:42556
I0819 04:40:38.202769  3926 http.cpp:957] Authorizing principal 'test-principal' to GET the
'/containers' endpoint
I0819 04:40:38.206101  3937 slave.cpp:859] Agent terminating
[       OK ] Endpoint/SlaveEndpointTest.AuthorizedRequest/2 (33 ms)
[ RUN      ] Endpoint/SlaveEndpointTest.UnauthorizedRequest/0
I0819 04:40:38.217582  3905 containerizer.cpp:246] Using isolation: posix/cpu,posix/mem,filesystem/posix,network/cni,environment_secret
W0819 04:40:38.218139  3905 backend.cpp:76] Failed to create 'aufs' backend: AufsBackend requires
root privileges
W0819 04:40:38.218287  3905 backend.cpp:76] Failed to create 'bind' backend: BindBackend requires
root privileges
I0819 04:40:38.218335  3905 provisioner.cpp:255] Using default backend 'copy'
I0819 04:40:38.221864  3931 slave.cpp:252] Mesos agent started on (800)@172.17.0.5:33019
I0819 04:40:38.221956  3931 slave.cpp:253] Flags at startup: --acls="" --appc_simple_discovery_uri_prefix="http://"
--appc_store_dir="/tmp/Endpoint_SlaveEndpointTest_UnauthorizedRequest_0_fKamI5/store/appc"
--authenticate_http_readonly="true" --authenticate_http_readwrite="true" --authenticatee="crammd5"
--authentication_backoff_factor="1secs" --authorizer="local" --cgroups_cpu_enable_pids_and_tids_count="false"
--cgroups_enable_cfs="false" --cgroups_hierarchy="/sys/fs/cgroup" --cgroups_limit_swap="false"
--cgroups_root="mesos" --container_disk_watch_interval="15secs" --containerizers="mesos" --credential="/tmp/Endpoint_SlaveEndpointTest_UnauthorizedRequest_0_fKamI5/credential"
--default_role="*" --disallow_sharing_agent_pid_namespace="false" --disk_watch_interval="1mins"
--docker="docker" --docker_kill_orphans="true" --docker_registry="https://registry-1.docker.io"
--docker_remove_delay="6hrs" --docker_socket="/var/run/docker.sock" --docker_stop_timeout="0ns"
--docker_store_dir="/tmp/Endpoint_SlaveEndpointTest_UnauthorizedRequest_0_fKamI5/store/docker"
--docker_volume_checkpoint_dir="/var/run/mesos/isolators/docker/volume" --enforce_container_disk_quota="false"
--executor_registration_timeout="1mins" --executor_reregistration_timeout="2secs" --executor_shutdown_grace_period="5secs"
--fetcher_cache_dir="/tmp/Endpoint_SlaveEndpointTest_UnauthorizedRequest_0_fKamI5/fetch" --fetcher_cache_size="2GB"
--frameworks_home="" --gc_delay="1weeks" --gc_disk_headroom="0.1" --hadoop_home="" --help="false"
--hostname_lookup="true" --http_command_executor="false" --http_credentials="/tmp/Endpoint_SlaveEndpointTest_UnauthorizedRequest_0_fKamI5/http_credentials"
--http_heartbeat_interval="30secs" --initialize_driver_logging="true" --isolation="posix/cpu,posix/mem"
--launcher="posix" --launcher_dir="/mesos/mesos-1.5.0/_build/src" --logbufsecs="0" --logging_level="INFO"
--max_completed_executors_per_framework="150" --oversubscribed_resources_interval="15secs"
--perf_duration="10secs" --perf_interval="1mins" --port="5051" --qos_correction_interval_min="0ns"
--quiet="false" --recover="reconnect" --recovery_timeout="15mins" --registration_backoff_factor="10ms"
--resources="cpus:2;gpus:0;mem:1024;disk:1024;ports:[31000-32000]" --revocable_cpu_low_priority="true"
--runtime_dir="/tmp/Endpoint_SlaveEndpointTest_UnauthorizedRequest_0_fKamI5" --sandbox_directory="/mnt/mesos/sandbox"
--strict="true" --switch_user="true" --systemd_enable_support="true" --systemd_runtime_directory="/run/systemd/system"
--version="false" --work_dir="/tmp/Endpoint_SlaveEndpointTest_UnauthorizedRequest_0_M3Mp8L"
I0819 04:40:38.222476  3931 credentials.hpp:86] Loading credential for authentication from
'/tmp/Endpoint_SlaveEndpointTest_UnauthorizedRequest_0_fKamI5/credential'
I0819 04:40:38.222688  3931 slave.cpp:285] Agent using credential for: test-principal
I0819 04:40:38.222712  3931 credentials.hpp:37] Loading credentials for authentication from
'/tmp/Endpoint_SlaveEndpointTest_UnauthorizedRequest_0_fKamI5/http_credentials'
I0819 04:40:38.222988  3931 http.cpp:1026] Creating default 'basic' HTTP authenticator for
realm 'mesos-agent-readonly'
I0819 04:40:38.223155  3931 http.cpp:1026] Creating default 'basic' HTTP authenticator for
realm 'mesos-agent-readwrite'
I0819 04:40:38.224643  3931 slave.cpp:581] Agent resources: [{"name":"cpus","scalar":{"value":2.0},"type":"SCALAR"},{"name":"mem","scalar":{"value":1024.0},"type":"SCALAR"},{"name":"disk","scalar":{"value":1024.0},"type":"SCALAR"},{"name":"ports","ranges":{"range":[{"begin":31000,"end":32000}]},"type":"RANGES"}]
I0819 04:40:38.224911  3931 slave.cpp:589] Agent attributes: [  ]
I0819 04:40:38.224952  3931 slave.cpp:598] Agent hostname: d2ef1182b4f2
I0819 04:40:38.225105  3932 status_update_manager.cpp:177] Pausing sending status updates
I0819 04:40:38.226754  3945 state.cpp:64] Recovering state from '/tmp/Endpoint_SlaveEndpointTest_UnauthorizedRequest_0_M3Mp8L/meta'
I0819 04:40:38.227250  3938 status_update_manager.cpp:203] Recovering status update manager
I0819 04:40:38.227445  3938 containerizer.cpp:609] Recovering containerizer
I0819 04:40:38.228715  3930 provisioner.cpp:416] Provisioner recovery complete
I0819 04:40:38.229048  3937 slave.cpp:6226] Finished recovery
I0819 04:40:38.229583  3937 slave.cpp:6408] Querying resource estimator for oversubscribable
resources
I0819 04:40:38.229799  3939 slave.cpp:6422] Received oversubscribable resources {} from the
resource estimator
I0819 04:40:38.232352  3928 process.cpp:3933] Handling HTTP event for process 'slave(800)'
with path: '/slave(800)/monitor/statistics'
I0819 04:40:38.233734  3923 http.cpp:1166] HTTP GET for /slave(800)/monitor/statistics from
172.17.0.5:42558
I0819 04:40:38.233887  3923 http.cpp:957] Authorizing principal 'test-principal' to GET the
'/monitor/statistics' endpoint
I0819 04:40:38.235891  3929 slave.cpp:859] Agent terminating
[       OK ] Endpoint/SlaveEndpointTest.UnauthorizedRequest/0 (34 ms)
[ RUN      ] Endpoint/SlaveEndpointTest.UnauthorizedRequest/1
I0819 04:40:38.251754  3905 containerizer.cpp:246] Using isolation: posix/cpu,posix/mem,filesystem/posix,network/cni,environment_secret
W0819 04:40:38.252248  3905 backend.cpp:76] Failed to create 'aufs' backend: AufsBackend requires
root privileges
W0819 04:40:38.252367  3905 backend.cpp:76] Failed to create 'bind' backend: BindBackend requires
root privileges
I0819 04:40:38.252405  3905 provisioner.cpp:255] Using default backend 'copy'
I0819 04:40:38.256244  3942 slave.cpp:252] Mesos agent started on (801)@172.17.0.5:33019
I0819 04:40:38.256297  3942 slave.cpp:253] Flags at startup: --acls="" --appc_simple_discovery_uri_prefix="http://"
--appc_store_dir="/tmp/Endpoint_SlaveEndpointTest_UnauthorizedRequest_1_gOfljm/store/appc"
--authenticate_http_readonly="true" --authenticate_http_readwrite="true" --authenticatee="crammd5"
--authentication_backoff_factor="1secs" --authorizer="local" --cgroups_cpu_enable_pids_and_tids_count="false"
--cgroups_enable_cfs="false" --cgroups_hierarchy="/sys/fs/cgroup" --cgroups_limit_swap="false"
--cgroups_root="mesos" --container_disk_watch_interval="15secs" --containerizers="mesos" --credential="/tmp/Endpoint_SlaveEndpointTest_UnauthorizedRequest_1_gOfljm/credential"
--default_role="*" --disallow_sharing_agent_pid_namespace="false" --disk_watch_interval="1mins"
--docker="docker" --docker_kill_orphans="true" --docker_registry="https://registry-1.docker.io"
--docker_remove_delay="6hrs" --docker_socket="/var/run/docker.sock" --docker_stop_timeout="0ns"
--docker_store_dir="/tmp/Endpoint_SlaveEndpointTest_UnauthorizedRequest_1_gOfljm/store/docker"
--docker_volume_checkpoint_dir="/var/run/mesos/isolators/docker/volume" --enforce_container_disk_quota="false"
--executor_registration_timeout="1mins" --executor_reregistration_timeout="2secs" --executor_shutdown_grace_period="5secs"
--fetcher_cache_dir="/tmp/Endpoint_SlaveEndpointTest_UnauthorizedRequest_1_gOfljm/fetch" --fetcher_cache_size="2GB"
--frameworks_home="" --gc_delay="1weeks" --gc_disk_headroom="0.1" --hadoop_home="" --help="false"
--hostname_lookup="true" --http_command_executor="false" --http_credentials="/tmp/Endpoint_SlaveEndpointTest_UnauthorizedRequest_1_gOfljm/http_credentials"
--http_heartbeat_interval="30secs" --initialize_driver_logging="true" --isolation="posix/cpu,posix/mem"
--launcher="posix" --launcher_dir="/mesos/mesos-1.5.0/_build/src" --logbufsecs="0" --logging_level="INFO"
--max_completed_executors_per_framework="150" --oversubscribed_resources_interval="15secs"
--perf_duration="10secs" --perf_interval="1mins" --port="5051" --qos_correction_interval_min="0ns"
--quiet="false" --recover="reconnect" --recovery_timeout="15mins" --registration_backoff_factor="10ms"
--resources="cpus:2;gpus:0;mem:1024;disk:1024;ports:[31000-32000]" --revocable_cpu_low_priority="true"
--runtime_dir="/tmp/Endpoint_SlaveEndpointTest_UnauthorizedRequest_1_gOfljm" --sandbox_directory="/mnt/mesos/sandbox"
--strict="true" --switch_user="true" --systemd_enable_support="true" --systemd_runtime_directory="/run/systemd/system"
--version="false" --work_dir="/tmp/Endpoint_SlaveEndpointTest_UnauthorizedRequest_1_oRphE2"
I0819 04:40:38.256639  3942 credentials.hpp:86] Loading credential for authentication from
'/tmp/Endpoint_SlaveEndpointTest_UnauthorizedRequest_1_gOfljm/credential'
I0819 04:40:38.256811  3942 slave.cpp:285] Agent using credential for: test-principal
I0819 04:40:38.256832  3942 credentials.hpp:37] Loading credentials for authentication from
'/tmp/Endpoint_SlaveEndpointTest_UnauthorizedRequest_1_gOfljm/http_credentials'
I0819 04:40:38.257037  3942 http.cpp:1026] Creating default 'basic' HTTP authenticator for
realm 'mesos-agent-readonly'
I0819 04:40:38.257197  3942 http.cpp:1026] Creating default 'basic' HTTP authenticator for
realm 'mesos-agent-readwrite'
I0819 04:40:38.258764  3942 slave.cpp:581] Agent resources: [{"name":"cpus","scalar":{"value":2.0},"type":"SCALAR"},{"name":"mem","scalar":{"value":1024.0},"type":"SCALAR"},{"name":"disk","scalar":{"value":1024.0},"type":"SCALAR"},{"name":"ports","ranges":{"range":[{"begin":31000,"end":32000}]},"type":"RANGES"}]
I0819 04:40:38.259058  3942 slave.cpp:589] Agent attributes: [  ]
I0819 04:40:38.259093  3942 slave.cpp:598] Agent hostname: d2ef1182b4f2
I0819 04:40:38.259259  3936 status_update_manager.cpp:177] Pausing sending status updates
I0819 04:40:38.261005  3941 state.cpp:64] Recovering state from '/tmp/Endpoint_SlaveEndpointTest_UnauthorizedRequest_1_oRphE2/meta'
I0819 04:40:38.261327  3929 status_update_manager.cpp:203] Recovering status update manager
I0819 04:40:38.261556  3933 containerizer.cpp:609] Recovering containerizer
I0819 04:40:38.263011  3937 provisioner.cpp:416] Provisioner recovery complete
I0819 04:40:38.263434  3945 slave.cpp:6226] Finished recovery
I0819 04:40:38.264040  3945 slave.cpp:6408] Querying resource estimator for oversubscribable
resources
I0819 04:40:38.264366  3927 slave.cpp:6422] Received oversubscribable resources {} from the
resource estimator
I0819 04:40:38.267383  3931 process.cpp:3933] Handling HTTP event for process 'slave(801)'
with path: '/slave(801)/monitor/statistics.json'
I0819 04:40:38.268887  3945 http.cpp:1166] HTTP GET for /slave(801)/monitor/statistics.json
from 172.17.0.5:42562
I0819 04:40:38.268998  3945 http.cpp:957] Authorizing principal 'test-principal' to GET the
'/monitor/statistics.json' endpoint
I0819 04:40:38.271390  3938 slave.cpp:859] Agent terminating
[       OK ] Endpoint/SlaveEndpointTest.UnauthorizedRequest/1 (34 ms)
[ RUN      ] Endpoint/SlaveEndpointTest.UnauthorizedRequest/2
I0819 04:40:38.287678  3905 containerizer.cpp:246] Using isolation: posix/cpu,posix/mem,filesystem/posix,network/cni,environment_secret
W0819 04:40:38.288277  3905 backend.cpp:76] Failed to create 'aufs' backend: AufsBackend requires
root privileges
W0819 04:40:38.288398  3905 backend.cpp:76] Failed to create 'bind' backend: BindBackend requires
root privileges
I0819 04:40:38.288463  3905 provisioner.cpp:255] Using default backend 'copy'
I0819 04:40:38.292630  3938 slave.cpp:252] Mesos agent started on (802)@172.17.0.5:33019
I0819 04:40:38.292673  3938 slave.cpp:253] Flags at startup: --acls="" --appc_simple_discovery_uri_prefix="http://"
--appc_store_dir="/tmp/Endpoint_SlaveEndpointTest_UnauthorizedRequest_2_aOD7eD/store/appc"
--authenticate_http_readonly="true" --authenticate_http_readwrite="true" --authenticatee="crammd5"
--authentication_backoff_factor="1secs" --authorizer="local" --cgroups_cpu_enable_pids_and_tids_count="false"
--cgroups_enable_cfs="false" --cgroups_hierarchy="/sys/fs/cgroup" --cgroups_limit_swap="false"
--cgroups_root="mesos" --container_disk_watch_interval="15secs" --containerizers="mesos" --credential="/tmp/Endpoint_SlaveEndpointTest_UnauthorizedRequest_2_aOD7eD/credential"
--default_role="*" --disallow_sharing_agent_pid_namespace="false" --disk_watch_interval="1mins"
--docker="docker" --docker_kill_orphans="true" --docker_registry="https://registry-1.docker.io"
--docker_remove_delay="6hrs" --docker_socket="/var/run/docker.sock" --docker_stop_timeout="0ns"
--docker_store_dir="/tmp/Endpoint_SlaveEndpointTest_UnauthorizedRequest_2_aOD7eD/store/docker"
--docker_volume_checkpoint_dir="/var/run/mesos/isolators/docker/volume" --enforce_container_disk_quota="false"
--executor_registration_timeout="1mins" --executor_reregistration_timeout="2secs" --executor_shutdown_grace_period="5secs"
--fetcher_cache_dir="/tmp/Endpoint_SlaveEndpointTest_UnauthorizedRequest_2_aOD7eD/fetch" --fetcher_cache_size="2GB"
--frameworks_home="" --gc_delay="1weeks" --gc_disk_headroom="0.1" --hadoop_home="" --help="false"
--hostname_lookup="true" --http_command_executor="false" --http_credentials="/tmp/Endpoint_SlaveEndpointTest_UnauthorizedRequest_2_aOD7eD/http_credentials"
--http_heartbeat_interval="30secs" --initialize_driver_logging="true" --isolation="posix/cpu,posix/mem"
--launcher="posix" --launcher_dir="/mesos/mesos-1.5.0/_build/src" --logbufsecs="0" --logging_level="INFO"
--max_completed_executors_per_framework="150" --oversubscribed_resources_interval="15secs"
--perf_duration="10secs" --perf_interval="1mins" --port="5051" --qos_correction_interval_min="0ns"
--quiet="false" --recover="reconnect" --recovery_timeout="15mins" --registration_backoff_factor="10ms"
--resources="cpus:2;gpus:0;mem:1024;disk:1024;ports:[31000-32000]" --revocable_cpu_low_priority="true"
--runtime_dir="/tmp/Endpoint_SlaveEndpointTest_UnauthorizedRequest_2_aOD7eD" --sandbox_directory="/mnt/mesos/sandbox"
--strict="true" --switch_user="true" --systemd_enable_support="true" --systemd_runtime_directory="/run/systemd/system"
--version="false" --work_dir="/tmp/Endpoint_SlaveEndpointTest_UnauthorizedRequest_2_imjOuj"
I0819 04:40:38.293123  3938 credentials.hpp:86] Loading credential for authentication from
'/tmp/Endpoint_SlaveEndpointTest_UnauthorizedRequest_2_aOD7eD/credential'
I0819 04:40:38.293296  3938 slave.cpp:285] Agent using credential for: test-principal
I0819 04:40:38.293316  3938 credentials.hpp:37] Loading credentials for authentication from
'/tmp/Endpoint_SlaveEndpointTest_UnauthorizedRequest_2_aOD7eD/http_credentials'
I0819 04:40:38.293581  3938 http.cpp:1026] Creating default 'basic' HTTP authenticator for
realm 'mesos-agent-readonly'
I0819 04:40:38.293752  3938 http.cpp:1026] Creating default 'basic' HTTP authenticator for
realm 'mesos-agent-readwrite'
I0819 04:40:38.295311  3938 slave.cpp:581] Agent resources: [{"name":"cpus","scalar":{"value":2.0},"type":"SCALAR"},{"name":"mem","scalar":{"value":1024.0},"type":"SCALAR"},{"name":"disk","scalar":{"value":1024.0},"type":"SCALAR"},{"name":"ports","ranges":{"range":[{"begin":31000,"end":32000}]},"type":"RANGES"}]
I0819 04:40:38.295565  3938 slave.cpp:589] Agent attributes: [  ]
I0819 04:40:38.295583  3938 slave.cpp:598] Agent hostname: d2ef1182b4f2
I0819 04:40:38.295807  3936 status_update_manager.cpp:177] Pausing sending status updates
I0819 04:40:38.297286  3940 state.cpp:64] Recovering state from '/tmp/Endpoint_SlaveEndpointTest_UnauthorizedRequest_2_imjOuj/meta'
I0819 04:40:38.297564  3931 status_update_manager.cpp:203] Recovering status update manager
I0819 04:40:38.297740  3933 containerizer.cpp:609] Recovering containerizer
I0819 04:40:38.299167  3934 provisioner.cpp:416] Provisioner recovery complete
I0819 04:40:38.299499  3932 slave.cpp:6226] Finished recovery
I0819 04:40:38.299983  3932 slave.cpp:6408] Querying resource estimator for oversubscribable
resources
I0819 04:40:38.300247  3932 slave.cpp:6422] Received oversubscribable resources {} from the
resource estimator
I0819 04:40:38.302687  3926 process.cpp:3933] Handling HTTP event for process 'slave(802)'
with path: '/slave(802)/containers'
I0819 04:40:38.303998  3941 http.cpp:1166] HTTP GET for /slave(802)/containers from 172.17.0.5:42564
I0819 04:40:38.304072  3941 http.cpp:957] Authorizing principal 'test-principal' to GET the
'/containers' endpoint
I0819 04:40:38.310966  3940 slave.cpp:859] Agent terminating
[       OK ] Endpoint/SlaveEndpointTest.UnauthorizedRequest/2 (35 ms)
[ RUN      ] Endpoint/SlaveEndpointTest.NoAuthorizer/0
I0819 04:40:38.322854  3905 containerizer.cpp:246] Using isolation: posix/cpu,posix/mem,filesystem/posix,network/cni,environment_secret
W0819 04:40:38.323603  3905 backend.cpp:76] Failed to create 'aufs' backend: AufsBackend requires
root privileges
W0819 04:40:38.323873  3905 backend.cpp:76] Failed to create 'bind' backend: BindBackend requires
root privileges
I0819 04:40:38.324048  3905 provisioner.cpp:255] Using default backend 'copy'
I0819 04:40:38.326169  3905 cluster.cpp:448] Creating default 'local' authorizer
I0819 04:40:38.328328  3939 slave.cpp:252] Mesos agent started on (803)@172.17.0.5:33019
I0819 04:40:38.328429  3939 slave.cpp:253] Flags at startup: --acls="" --appc_simple_discovery_uri_prefix="http://"
--appc_store_dir="/tmp/Endpoint_SlaveEndpointTest_NoAuthorizer_0_fXOXvU/store/appc" --authenticate_http_readonly="true"
--authenticate_http_readwrite="true" --authenticatee="crammd5" --authentication_backoff_factor="1secs"
--authorizer="local" --cgroups_cpu_enable_pids_and_tids_count="false" --cgroups_enable_cfs="false"
--cgroups_hierarchy="/sys/fs/cgroup" --cgroups_limit_swap="false" --cgroups_root="mesos" --container_disk_watch_interval="15secs"
--containerizers="mesos" --credential="/tmp/Endpoint_SlaveEndpointTest_NoAuthorizer_0_fXOXvU/credential"
--default_role="*" --disallow_sharing_agent_pid_namespace="false" --disk_watch_interval="1mins"
--docker="docker" --docker_kill_orphans="true" --docker_registry="https://registry-1.docker.io"
--docker_remove_delay="6hrs" --docker_socket="/var/run/docker.sock" --docker_stop_timeout="0ns"
--docker_store_dir="/tmp/Endpoint_SlaveEndpointTest_NoAuthorizer_0_fXOXvU/store/docker" --docker_volume_checkpoint_dir="/var/run/mesos/isolators/docker/volume"
--enforce_container_disk_quota="false" --executor_registration_timeout="1mins" --executor_reregistration_timeout="2secs"
--executor_shutdown_grace_period="5secs" --fetcher_cache_dir="/tmp/Endpoint_SlaveEndpointTest_NoAuthorizer_0_fXOXvU/fetch"
--fetcher_cache_size="2GB" --frameworks_home="" --gc_delay="1weeks" --gc_disk_headroom="0.1"
--hadoop_home="" --help="false" --hostname_lookup="true" --http_command_executor="false" --http_credentials="/tmp/Endpoint_SlaveEndpointTest_NoAuthorizer_0_fXOXvU/http_credentials"
--http_heartbeat_interval="30secs" --initialize_driver_logging="true" --isolation="posix/cpu,posix/mem"
--launcher="posix" --launcher_dir="/mesos/mesos-1.5.0/_build/src" --logbufsecs="0" --logging_level="INFO"
--max_completed_executors_per_framework="150" --oversubscribed_resources_interval="15secs"
--perf_duration="10secs" --perf_interval="1mins" --port="5051" --qos_correction_interval_min="0ns"
--quiet="false" --recover="reconnect" --recovery_timeout="15mins" --registration_backoff_factor="10ms"
--resources="cpus:2;gpus:0;mem:1024;disk:1024;ports:[31000-32000]" --revocable_cpu_low_priority="true"
--runtime_dir="/tmp/Endpoint_SlaveEndpointTest_NoAuthorizer_0_fXOXvU" --sandbox_directory="/mnt/mesos/sandbox"
--strict="true" --switch_user="true" --systemd_enable_support="true" --systemd_runtime_directory="/run/systemd/system"
--version="false" --work_dir="/tmp/Endpoint_SlaveEndpointTest_NoAuthorizer_0_oAqqGA"
I0819 04:40:38.329108  3939 credentials.hpp:86] Loading credential for authentication from
'/tmp/Endpoint_SlaveEndpointTest_NoAuthorizer_0_fXOXvU/credential'
I0819 04:40:38.329418  3939 slave.cpp:285] Agent using credential for: test-principal
I0819 04:40:38.329442  3939 credentials.hpp:37] Loading credentials for authentication from
'/tmp/Endpoint_SlaveEndpointTest_NoAuthorizer_0_fXOXvU/http_credentials'
I0819 04:40:38.329766  3939 http.cpp:1026] Creating default 'basic' HTTP authenticator for
realm 'mesos-agent-readonly'
I0819 04:40:38.330071  3939 http.cpp:1026] Creating default 'basic' HTTP authenticator for
realm 'mesos-agent-readwrite'
I0819 04:40:38.332300  3939 slave.cpp:581] Agent resources: [{"name":"cpus","scalar":{"value":2.0},"type":"SCALAR"},{"name":"mem","scalar":{"value":1024.0},"type":"SCALAR"},{"name":"disk","scalar":{"value":1024.0},"type":"SCALAR"},{"name":"ports","ranges":{"range":[{"begin":31000,"end":32000}]},"type":"RANGES"}]
I0819 04:40:38.332620  3939 slave.cpp:589] Agent attributes: [  ]
I0819 04:40:38.332650  3939 slave.cpp:598] Agent hostname: d2ef1182b4f2
I0819 04:40:38.332855  3926 status_update_manager.cpp:177] Pausing sending status updates
I0819 04:40:38.334971  3938 state.cpp:64] Recovering state from '/tmp/Endpoint_SlaveEndpointTest_NoAuthorizer_0_oAqqGA/meta'
I0819 04:40:38.335309  3945 status_update_manager.cpp:203] Recovering status update manager
I0819 04:40:38.335510  3924 containerizer.cpp:609] Recovering containerizer
I0819 04:40:38.337148  3942 provisioner.cpp:416] Provisioner recovery complete
I0819 04:40:38.337525  3939 slave.cpp:6226] Finished recovery
I0819 04:40:38.338310  3939 slave.cpp:6408] Querying resource estimator for oversubscribable
resources
I0819 04:40:38.338570  3941 slave.cpp:6422] Received oversubscribable resources {} from the
resource estimator
I0819 04:40:38.341259  3934 process.cpp:3933] Handling HTTP event for process 'slave(803)'
with path: '/slave(803)/monitor/statistics'
I0819 04:40:38.342875  3944 http.cpp:1166] HTTP GET for /slave(803)/monitor/statistics from
172.17.0.5:42566
I0819 04:40:38.342963  3944 http.cpp:957] Authorizing principal 'test-principal' to GET the
'/monitor/statistics' endpoint
I0819 04:40:38.352852  3937 slave.cpp:859] Agent terminating
[       OK ] Endpoint/SlaveEndpointTest.NoAuthorizer/0 (44 ms)
[ RUN      ] Endpoint/SlaveEndpointTest.NoAuthorizer/1
I0819 04:40:38.370715  3905 containerizer.cpp:246] Using isolation: posix/cpu,posix/mem,filesystem/posix,network/cni,environment_secret
W0819 04:40:38.371516  3905 backend.cpp:76] Failed to create 'aufs' backend: AufsBackend requires
root privileges
W0819 04:40:38.371672  3905 backend.cpp:76] Failed to create 'bind' backend: BindBackend requires
root privileges
I0819 04:40:38.371724  3905 provisioner.cpp:255] Using default backend 'copy'
I0819 04:40:38.374382  3905 cluster.cpp:448] Creating default 'local' authorizer
I0819 04:40:38.379968  3929 slave.cpp:252] Mesos agent started on (804)@172.17.0.5:33019
I0819 04:40:38.380056  3929 slave.cpp:253] Flags at startup: --acls="" --appc_simple_discovery_uri_prefix="http://"
--appc_store_dir="/tmp/Endpoint_SlaveEndpointTest_NoAuthorizer_1_JFTRcc/store/appc" --authenticate_http_readonly="true"
--authenticate_http_readwrite="true" --authenticatee="crammd5" --authentication_backoff_factor="1secs"
--authorizer="local" --cgroups_cpu_enable_pids_and_tids_count="false" --cgroups_enable_cfs="false"
--cgroups_hierarchy="/sys/fs/cgroup" --cgroups_limit_swap="false" --cgroups_root="mesos" --container_disk_watch_interval="15secs"
--containerizers="mesos" --credential="/tmp/Endpoint_SlaveEndpointTest_NoAuthorizer_1_JFTRcc/credential"
--default_role="*" --disallow_sharing_agent_pid_namespace="false" --disk_watch_interval="1mins"
--docker="docker" --docker_kill_orphans="true" --docker_registry="https://registry-1.docker.io"
--docker_remove_delay="6hrs" --docker_socket="/var/run/docker.sock" --docker_stop_timeout="0ns"
--docker_store_dir="/tmp/Endpoint_SlaveEndpointTest_NoAuthorizer_1_JFTRcc/store/docker" --docker_volume_checkpoint_dir="/var/run/mesos/isolators/docker/volume"
--enforce_container_disk_quota="false" --executor_registration_timeout="1mins" --executor_reregistration_timeout="2secs"
--executor_shutdown_grace_period="5secs" --fetcher_cache_dir="/tmp/Endpoint_SlaveEndpointTest_NoAuthorizer_1_JFTRcc/fetch"
--fetcher_cache_size="2GB" --frameworks_home="" --gc_delay="1weeks" --gc_disk_headroom="0.1"
--hadoop_home="" --help="false" --hostname_lookup="true" --http_command_executor="false" --http_credentials="/tmp/Endpoint_SlaveEndpointTest_NoAuthorizer_1_JFTRcc/http_credentials"
--http_heartbeat_interval="30secs" --initialize_driver_logging="true" --isolation="posix/cpu,posix/mem"
--launcher="posix" --launcher_dir="/mesos/mesos-1.5.0/_build/src" --logbufsecs="0" --logging_level="INFO"
--max_completed_executors_per_framework="150" --oversubscribed_resources_interval="15secs"
--perf_duration="10secs" --perf_interval="1mins" --port="5051" --qos_correction_interval_min="0ns"
--quiet="false" --recover="reconnect" --recovery_timeout="15mins" --registration_backoff_factor="10ms"
--resources="cpus:2;gpus:0;mem:1024;disk:1024;ports:[31000-32000]" --revocable_cpu_low_priority="true"
--runtime_dir="/tmp/Endpoint_SlaveEndpointTest_NoAuthorizer_1_JFTRcc" --sandbox_directory="/mnt/mesos/sandbox"
--strict="true" --switch_user="true" --systemd_enable_support="true" --systemd_runtime_directory="/run/systemd/system"
--version="false" --work_dir="/tmp/Endpoint_SlaveEndpointTest_NoAuthorizer_1_icbugS"
I0819 04:40:38.380615  3929 credentials.hpp:86] Loading credential for authentication from
'/tmp/Endpoint_SlaveEndpointTest_NoAuthorizer_1_JFTRcc/credential'
I0819 04:40:38.380919  3929 slave.cpp:285] Agent using credential for: test-principal
I0819 04:40:38.380945  3929 credentials.hpp:37] Loading credentials for authentication from
'/tmp/Endpoint_SlaveEndpointTest_NoAuthorizer_1_JFTRcc/http_credentials'
I0819 04:40:38.381216  3929 http.cpp:1026] Creating default 'basic' HTTP authenticator for
realm 'mesos-agent-readonly'
I0819 04:40:38.381492  3929 http.cpp:1026] Creating default 'basic' HTTP authenticator for
realm 'mesos-agent-readwrite'
I0819 04:40:38.383021  3929 slave.cpp:581] Agent resources: [{"name":"cpus","scalar":{"value":2.0},"type":"SCALAR"},{"name":"mem","scalar":{"value":1024.0},"type":"SCALAR"},{"name":"disk","scalar":{"value":1024.0},"type":"SCALAR"},{"name":"ports","ranges":{"range":[{"begin":31000,"end":32000}]},"type":"RANGES"}]
I0819 04:40:38.383260  3929 slave.cpp:589] Agent attributes: [  ]
I0819 04:40:38.383278  3929 slave.cpp:598] Agent hostname: d2ef1182b4f2
I0819 04:40:38.383473  3935 status_update_manager.cpp:177] Pausing sending status updates
I0819 04:40:38.385259  3941 state.cpp:64] Recovering state from '/tmp/Endpoint_SlaveEndpointTest_NoAuthorizer_1_icbugS/meta'
I0819 04:40:38.385654  3936 status_update_manager.cpp:203] Recovering status update manager
I0819 04:40:38.385861  3936 containerizer.cpp:609] Recovering containerizer
I0819 04:40:38.387457  3937 provisioner.cpp:416] Provisioner recovery complete
I0819 04:40:38.387799  3926 slave.cpp:6226] Finished recovery
I0819 04:40:38.388484  3926 slave.cpp:6408] Querying resource estimator for oversubscribable
resources
I0819 04:40:38.388801  3928 slave.cpp:6422] Received oversubscribable resources {} from the
resource estimator
I0819 04:40:38.392133  3935 process.cpp:3933] Handling HTTP event for process 'slave(804)'
with path: '/slave(804)/monitor/statistics.json'
I0819 04:40:38.393689  3924 http.cpp:1166] HTTP GET for /slave(804)/monitor/statistics.json
from 172.17.0.5:42568
I0819 04:40:38.393786  3924 http.cpp:957] Authorizing principal 'test-principal' to GET the
'/monitor/statistics.json' endpoint
I0819 04:40:38.397174  3926 slave.cpp:859] Agent terminating
[       OK ] Endpoint/SlaveEndpointTest.NoAuthorizer/1 (41 ms)
[ RUN      ] Endpoint/SlaveEndpointTest.NoAuthorizer/2
I0819 04:40:38.409718  3905 containerizer.cpp:246] Using isolation: posix/cpu,posix/mem,filesystem/posix,network/cni,environment_secret
W0819 04:40:38.410300  3905 backend.cpp:76] Failed to create 'aufs' backend: AufsBackend requires
root privileges
W0819 04:40:38.410439  3905 backend.cpp:76] Failed to create 'bind' backend: BindBackend requires
root privileges
I0819 04:40:38.410480  3905 provisioner.cpp:255] Using default backend 'copy'
I0819 04:40:38.412655  3905 cluster.cpp:448] Creating default 'local' authorizer
I0819 04:40:38.414708  3945 slave.cpp:252] Mesos agent started on (805)@172.17.0.5:33019
I0819 04:40:38.414757  3945 slave.cpp:253] Flags at startup: --acls="" --appc_simple_discovery_uri_prefix="http://"
--appc_store_dir="/tmp/Endpoint_SlaveEndpointTest_NoAuthorizer_2_ZvXyju/store/appc" --authenticate_http_readonly="true"
--authenticate_http_readwrite="true" --authenticatee="crammd5" --authentication_backoff_factor="1secs"
--authorizer="local" --cgroups_cpu_enable_pids_and_tids_count="false" --cgroups_enable_cfs="false"
--cgroups_hierarchy="/sys/fs/cgroup" --cgroups_limit_swap="false" --cgroups_root="mesos" --container_disk_watch_interval="15secs"
--containerizers="mesos" --credential="/tmp/Endpoint_SlaveEndpointTest_NoAuthorizer_2_ZvXyju/credential"
--default_role="*" --disallow_sharing_agent_pid_namespace="false" --disk_watch_interval="1mins"
--docker="docker" --docker_kill_orphans="true" --docker_registry="https://registry-1.docker.io"
--docker_remove_delay="6hrs" --docker_socket="/var/run/docker.sock" --docker_stop_timeout="0ns"
--docker_store_dir="/tmp/Endpoint_SlaveEndpointTest_NoAuthorizer_2_ZvXyju/store/docker" --docker_volume_checkpoint_dir="/var/run/mesos/isolators/docker/volume"
--enforce_container_disk_quota="false" --executor_registration_timeout="1mins" --executor_reregistration_timeout="2secs"
--executor_shutdown_grace_period="5secs" --fetcher_cache_dir="/tmp/Endpoint_SlaveEndpointTest_NoAuthorizer_2_ZvXyju/fetch"
--fetcher_cache_size="2GB" --frameworks_home="" --gc_delay="1weeks" --gc_disk_headroom="0.1"
--hadoop_home="" --help="false" --hostname_lookup="true" --http_command_executor="false" --http_credentials="/tmp/Endpoint_SlaveEndpointTest_NoAuthorizer_2_ZvXyju/http_credentials"
--http_heartbeat_interval="30secs" --initialize_driver_logging="true" --isolation="posix/cpu,posix/mem"
--launcher="posix" --launcher_dir="/mesos/mesos-1.5.0/_build/src" --logbufsecs="0" --logging_level="INFO"
--max_completed_executors_per_framework="150" --oversubscribed_resources_interval="15secs"
--perf_duration="10secs" --perf_interval="1mins" --port="5051" --qos_correction_interval_min="0ns"
--quiet="false" --recover="reconnect" --recovery_timeout="15mins" --registration_backoff_factor="10ms"
--resources="cpus:2;gpus:0;mem:1024;disk:1024;ports:[31000-32000]" --revocable_cpu_low_priority="true"
--runtime_dir="/tmp/Endpoint_SlaveEndpointTest_NoAuthorizer_2_ZvXyju" --sandbox_directory="/mnt/mesos/sandbox"
--strict="true" --switch_user="true" --systemd_enable_support="true" --systemd_runtime_directory="/run/systemd/system"
--version="false" --work_dir="/tmp/Endpoint_SlaveEndpointTest_NoAuthorizer_2_WvB7ga"
I0819 04:40:38.415194  3945 credentials.hpp:86] Loading credential for authentication from
'/tmp/Endpoint_SlaveEndpointTest_NoAuthorizer_2_ZvXyju/credential'
I0819 04:40:38.415472  3945 slave.cpp:285] Agent using credential for: test-principal
I0819 04:40:38.415500  3945 credentials.hpp:37] Loading credentials for authentication from
'/tmp/Endpoint_SlaveEndpointTest_NoAuthorizer_2_ZvXyju/http_credentials'
I0819 04:40:38.415766  3945 http.cpp:1026] Creating default 'basic' HTTP authenticator for
realm 'mesos-agent-readonly'
I0819 04:40:38.415976  3945 http.cpp:1026] Creating default 'basic' HTTP authenticator for
realm 'mesos-agent-readwrite'
I0819 04:40:38.417474  3945 slave.cpp:581] Agent resources: [{"name":"cpus","scalar":{"value":2.0},"type":"SCALAR"},{"name":"mem","scalar":{"value":1024.0},"type":"SCALAR"},{"name":"disk","scalar":{"value":1024.0},"type":"SCALAR"},{"name":"ports","ranges":{"range":[{"begin":31000,"end":32000}]},"type":"RANGES"}]
I0819 04:40:38.417712  3945 slave.cpp:589] Agent attributes: [  ]
I0819 04:40:38.417739  3945 slave.cpp:598] Agent hostname: d2ef1182b4f2
I0819 04:40:38.417929  3936 status_update_manager.cpp:177] Pausing sending status updates
I0819 04:40:38.419728  3926 state.cpp:64] Recovering state from '/tmp/Endpoint_SlaveEndpointTest_NoAuthorizer_2_WvB7ga/meta'
I0819 04:40:38.420100  3942 status_update_manager.cpp:203] Recovering status update manager
I0819 04:40:38.420327  3928 containerizer.cpp:609] Recovering containerizer
I0819 04:40:38.421890  3930 provisioner.cpp:416] Provisioner recovery complete
I0819 04:40:38.422308  3939 slave.cpp:6226] Finished recovery
I0819 04:40:38.423038  3939 slave.cpp:6408] Querying resource estimator for oversubscribable
resources
I0819 04:40:38.423295  3941 slave.cpp:6422] Received oversubscribable resources {} from the
resource estimator
I0819 04:40:38.426407  3933 process.cpp:3933] Handling HTTP event for process 'slave(805)'
with path: '/slave(805)/containers'
I0819 04:40:38.427839  3942 http.cpp:1166] HTTP GET for /slave(805)/containers from 172.17.0.5:42572
I0819 04:40:38.427927  3942 http.cpp:957] Authorizing principal 'test-principal' to GET the
'/containers' endpoint
I0819 04:40:38.432039  3929 slave.cpp:859] Agent terminating
[       OK ] Endpoint/SlaveEndpointTest.NoAuthorizer/2 (35 ms)
[----------] 9 tests from Endpoint/SlaveEndpointTest (319 ms total)

[----------] 2 tests from ContainerizerType/DefaultContainerDNSFlagTest
[ RUN      ] ContainerizerType/DefaultContainerDNSFlagTest.ValidateFlag/0
[       OK ] ContainerizerType/DefaultContainerDNSFlagTest.ValidateFlag/0 (11 ms)
[ RUN      ] ContainerizerType/DefaultContainerDNSFlagTest.ValidateFlag/1
[       OK ] ContainerizerType/DefaultContainerDNSFlagTest.ValidateFlag/1 (16 ms)
[----------] 2 tests from ContainerizerType/DefaultContainerDNSFlagTest (27 ms total)

[----------] Global test environment tear-down
[==========] 1657 tests from 182 test cases ran. (479835 ms total)
[  PASSED  ] 1656 tests.
[  FAILED  ] 1 test, listed below:
[  FAILED  ] ExamplesTest.JavaFramework

 1 FAILED TEST
  YOU HAVE 20 DISABLED TESTS

I0819 04:40:38.545653  3947 process.cpp:1072] Failed to accept socket: future discarded
make[4]: *** [check-local] Error 1
make[4]: Leaving directory `/mesos/mesos-1.5.0/_build/src'
make[3]: *** [check-am] Error 2
make[3]: Leaving directory `/mesos/mesos-1.5.0/_build/src'
make[2]: *** [check] Error 2
make[2]: Leaving directory `/mesos/mesos-1.5.0/_build/src'
make[1]: *** [check-recursive] Error 1
make[1]: Leaving directory `/mesos/mesos-1.5.0/_build'
make: *** [distcheck] Error 1
+ docker rmi mesos-1503114434-25771
Untagged: mesos-1503114434-25771:latest
Deleted: sha256:3d6984a9533dad935dd5952b768514439ba8098f76d6f853f98930e7769737aa
Deleted: sha256:ef987913a11444273fc7b81decb650f8d1775c4c531b35956c7118f70ddc54ef
Deleted: sha256:51d5137daf50cf4a8731fd77238a113ffc35f57a784a7e74a5337fb7f9d3d651
Deleted: sha256:f7fdd1c94ddf93051cee8b23f54d8005b356dc0c35cc2bd78eafaee47b6b47a8
Deleted: sha256:19d69d804df109e04c65e97227448de654c19964b1821762cd47da1c380b978f
Deleted: sha256:39e15c31024c037b2e7033ce6bbd535c42d973ea8ccb47e3a6738828a6c1bcbd
Deleted: sha256:d12b91394cdd827b49be4d6f4f1aafd65130eb34b3e1c48f16ed1b99d2415b62
Deleted: sha256:5fc403163ceb2dc1de74c239adb3b8c888a4f3453b8f22d16368dde1af0f7277
Deleted: sha256:4e7d1b77a3cb859a7a87c67c70715b13b6a58d05e0e26770cceff14f1856cc6e
Deleted: sha256:0207094d896dc32155ac34c2a4fe2b3330e961ac18e1ee5fffa64b7d0bd7f7b3
Deleted: sha256:d17c90bcffbc0fd4f788339b830138cd5f5efe0166cd48180fa82eeaf0b3db3a
Deleted: sha256:b66974a82665a1ddaa70c611075e4977a7c7875690a985aca618f953d0bcf30c
Deleted: sha256:62b0dd6628f64531efb7b02328d6604bc6d0cc3daa1a733ea80a4832745e7107
Deleted: sha256:efe0070b9dbaa0ed84b785828b967d51416fb965aa0d0d6aef5e5756b8eb80ff
Deleted: sha256:669c8a134bfe262aa48edee5113bad6ccab9b7ea7624e795187c35d8a753f594
Deleted: sha256:988a0ecd09cb4513f9da1493b435e4695d22725625d7ed6a691506df9420dce9
Deleted: sha256:668bfc49e574eb93767c6f831ff82250e46523252a174183f4003d1c443bbf7d
Deleted: sha256:c200bed5e0bcf248b6317baa92fa2b1236d8aaa31fd0a3ca8a6bf3cca4bf6992
Deleted: sha256:0cc20397c44acbd403b632bec0487cddd9a16c7279fa329848b7a9fb0f97f911
Deleted: sha256:854c757c0199cf1483ca47f2a6f7b774416984e3860c6c8d1f6fdd3aebf05d51
Deleted: sha256:ed71c503d2c905a7528b16a8aebb7ec77f47ff9d73e0913d84148a9ba0607813
Deleted: sha256:d59128abee7d9388ea192d17884004702da13cec83a93fb1e5f19950037a5716
Deleted: sha256:6c24078eb2c22f2c4c84a87c1eeefe1d15b1d30cbc21d4afaacda245ae6ada53
Deleted: sha256:05d879d7601474032cb44e57bdd50b20deb1b2b9a129e4c05a1670b80bd0bece
Build step 'Execute shell' marked build as failure
Not sending mail to unregistered user yujie.jay@gmail.com
Not sending mail to unregistered user gregorywmann@gmail.com

Mime
View raw message