mesos-builds mailing list archives

Site index · List index
Message view « Date » · « Thread »
Top « Date » · « Thread »
From Apache Jenkins Server <jenk...@builds.apache.org>
Subject Build failed in Jenkins: Mesos-Reviewbot #18894
Date Thu, 17 Aug 2017 00:26:23 GMT
See <https://builds.apache.org/job/Mesos-Reviewbot/18894/display/redirect>

------------------------------------------
[...truncated 31.02 MB...]
I0817 00:26:16.107053  5274 slave.cpp:283] Agent using credential for: test-principal
I0817 00:26:16.107090  5274 credentials.hpp:37] Loading credentials for authentication from
'/tmp/Endpoint_SlaveEndpointTest_AuthorizedRequest_2_jWTAnx/http_credentials'
I0817 00:26:16.107622  5274 http.cpp:1026] Creating default 'basic' HTTP authenticator for
realm 'mesos-agent-readonly'
I0817 00:26:16.108041  5274 http.cpp:1026] Creating default 'basic' HTTP authenticator for
realm 'mesos-agent-readwrite'
I0817 00:26:16.110440  5274 slave.cpp:565] Agent resources: [{"name":"cpus","scalar":{"value":2.0},"type":"SCALAR"},{"name":"mem","scalar":{"value":1024.0},"type":"SCALAR"},{"name":"disk","scalar":{"value":1024.0},"type":"SCALAR"},{"name":"ports","ranges":{"range":[{"begin":31000,"end":32000}]},"type":"RANGES"}]
I0817 00:26:16.110875  5274 slave.cpp:573] Agent attributes: [  ]
I0817 00:26:16.110895  5274 slave.cpp:582] Agent hostname: 3520da11d3fa
I0817 00:26:16.111085  5272 status_update_manager.cpp:177] Pausing sending status updates
I0817 00:26:16.113411  5279 state.cpp:64] Recovering state from '/tmp/Endpoint_SlaveEndpointTest_AuthorizedRequest_2_oBads2/meta'
I0817 00:26:16.113953  5275 status_update_manager.cpp:203] Recovering status update manager
I0817 00:26:16.114253  5273 containerizer.cpp:609] Recovering containerizer
I0817 00:26:16.116763  5275 provisioner.cpp:416] Provisioner recovery complete
I0817 00:26:16.117480  5275 slave.cpp:6210] Finished recovery
I0817 00:26:16.118180  5275 slave.cpp:6392] Querying resource estimator for oversubscribable
resources
I0817 00:26:16.118592  5276 slave.cpp:6406] Received oversubscribable resources {} from the
resource estimator
I0817 00:26:16.123193  5278 process.cpp:3933] Handling HTTP event for process 'slave(799)'
with path: '/slave(799)/containers'
I0817 00:26:16.125380  5272 http.cpp:1166] HTTP GET for /slave(799)/containers from 172.17.0.2:36378
I0817 00:26:16.125500  5272 http.cpp:957] Authorizing principal 'test-principal' to GET the
'/containers' endpoint
I0817 00:26:16.132030  5253 slave.cpp:843] Agent terminating
[       OK ] Endpoint/SlaveEndpointTest.AuthorizedRequest/2 (57 ms)
[ RUN      ] Endpoint/SlaveEndpointTest.UnauthorizedRequest/0
I0817 00:26:16.156081  5253 containerizer.cpp:246] Using isolation: posix/cpu,posix/mem,filesystem/posix,network/cni,environment_secret
W0817 00:26:16.156883  5253 backend.cpp:76] Failed to create 'overlay' backend: OverlayBackend
requires root privileges
W0817 00:26:16.157099  5253 backend.cpp:76] Failed to create 'bind' backend: BindBackend requires
root privileges
I0817 00:26:16.157147  5253 provisioner.cpp:255] Using default backend 'copy'
I0817 00:26:16.162793  5276 slave.cpp:250] Mesos agent started on (800)@172.17.0.2:42535
I0817 00:26:16.162834  5276 slave.cpp:251] Flags at startup: --acls="" --appc_simple_discovery_uri_prefix="http://"
--appc_store_dir="/tmp/Endpoint_SlaveEndpointTest_UnauthorizedRequest_0_VvddAx/store/appc"
--authenticate_http_readonly="true" --authenticate_http_readwrite="true" --authenticatee="crammd5"
--authentication_backoff_factor="1secs" --authorizer="local" --cgroups_cpu_enable_pids_and_tids_count="false"
--cgroups_enable_cfs="false" --cgroups_hierarchy="/sys/fs/cgroup" --cgroups_limit_swap="false"
--cgroups_root="mesos" --container_disk_watch_interval="15secs" --containerizers="mesos" --credential="/tmp/Endpoint_SlaveEndpointTest_UnauthorizedRequest_0_VvddAx/credential"
--default_role="*" --disallow_sharing_agent_pid_namespace="false" --disk_watch_interval="1mins"
--docker="docker" --docker_kill_orphans="true" --docker_registry="https://registry-1.docker.io"
--docker_remove_delay="6hrs" --docker_socket="/var/run/docker.sock" --docker_stop_timeout="0ns"
--docker_store_dir="/tmp/Endpoint_SlaveEndpointTest_UnauthorizedRequest_0_VvddAx/store/docker"
--docker_volume_checkpoint_dir="/var/run/mesos/isolators/docker/volume" --enforce_container_disk_quota="false"
--executor_registration_timeout="1mins" --executor_reregistration_timeout="2secs" --executor_shutdown_grace_period="5secs"
--fetcher_cache_dir="/tmp/Endpoint_SlaveEndpointTest_UnauthorizedRequest_0_VvddAx/fetch" --fetcher_cache_size="2GB"
--frameworks_home="" --gc_delay="1weeks" --gc_disk_headroom="0.1" --hadoop_home="" --help="false"
--hostname_lookup="true" --http_command_executor="false" --http_credentials="/tmp/Endpoint_SlaveEndpointTest_UnauthorizedRequest_0_VvddAx/http_credentials"
--http_heartbeat_interval="30secs" --initialize_driver_logging="true" --isolation="posix/cpu,posix/mem"
--launcher="posix" --launcher_dir="/mesos/mesos-1.4.0/_build/src" --logbufsecs="0" --logging_level="INFO"
--max_completed_executors_per_framework="150" --oversubscribed_resources_interval="15secs"
--perf_duration="10secs" --perf_interval="1mins" --port="5051" --qos_correction_interval_min="0ns"
--quiet="false" --recover="reconnect" --recovery_timeout="15mins" --registration_backoff_factor="10ms"
--resources="cpus:2;gpus:0;mem:1024;disk:1024;ports:[31000-32000]" --revocable_cpu_low_priority="true"
--runtime_dir="/tmp/Endpoint_SlaveEndpointTest_UnauthorizedRequest_0_VvddAx" --sandbox_directory="/mnt/mesos/sandbox"
--strict="true" --switch_user="true" --systemd_enable_support="true" --systemd_runtime_directory="/run/systemd/system"
--version="false" --work_dir="/tmp/Endpoint_SlaveEndpointTest_UnauthorizedRequest_0_0I3yv2"
I0817 00:26:16.163575  5276 credentials.hpp:86] Loading credential for authentication from
'/tmp/Endpoint_SlaveEndpointTest_UnauthorizedRequest_0_VvddAx/credential'
I0817 00:26:16.163836  5276 slave.cpp:283] Agent using credential for: test-principal
I0817 00:26:16.163882  5276 credentials.hpp:37] Loading credentials for authentication from
'/tmp/Endpoint_SlaveEndpointTest_UnauthorizedRequest_0_VvddAx/http_credentials'
I0817 00:26:16.164235  5276 http.cpp:1026] Creating default 'basic' HTTP authenticator for
realm 'mesos-agent-readonly'
I0817 00:26:16.164511  5276 http.cpp:1026] Creating default 'basic' HTTP authenticator for
realm 'mesos-agent-readwrite'
I0817 00:26:16.166663  5276 slave.cpp:565] Agent resources: [{"name":"cpus","scalar":{"value":2.0},"type":"SCALAR"},{"name":"mem","scalar":{"value":1024.0},"type":"SCALAR"},{"name":"disk","scalar":{"value":1024.0},"type":"SCALAR"},{"name":"ports","ranges":{"range":[{"begin":31000,"end":32000}]},"type":"RANGES"}]
I0817 00:26:16.167094  5276 slave.cpp:573] Agent attributes: [  ]
I0817 00:26:16.167114  5276 slave.cpp:582] Agent hostname: 3520da11d3fa
I0817 00:26:16.167433  5273 status_update_manager.cpp:177] Pausing sending status updates
I0817 00:26:16.169490  5274 state.cpp:64] Recovering state from '/tmp/Endpoint_SlaveEndpointTest_UnauthorizedRequest_0_0I3yv2/meta'
I0817 00:26:16.170056  5279 status_update_manager.cpp:203] Recovering status update manager
I0817 00:26:16.170333  5279 containerizer.cpp:609] Recovering containerizer
I0817 00:26:16.172509  5276 provisioner.cpp:416] Provisioner recovery complete
I0817 00:26:16.172946  5279 slave.cpp:6210] Finished recovery
I0817 00:26:16.173539  5279 slave.cpp:6392] Querying resource estimator for oversubscribable
resources
I0817 00:26:16.173995  5279 slave.cpp:6406] Received oversubscribable resources {} from the
resource estimator
I0817 00:26:16.179144  5272 process.cpp:3933] Handling HTTP event for process 'slave(800)'
with path: '/slave(800)/monitor/statistics'
I0817 00:26:16.181018  5277 http.cpp:1166] HTTP GET for /slave(800)/monitor/statistics from
172.17.0.2:36380
I0817 00:26:16.181134  5277 http.cpp:957] Authorizing principal 'test-principal' to GET the
'/monitor/statistics' endpoint
I0817 00:26:16.194409  5253 slave.cpp:843] Agent terminating
[       OK ] Endpoint/SlaveEndpointTest.UnauthorizedRequest/0 (55 ms)
[ RUN      ] Endpoint/SlaveEndpointTest.UnauthorizedRequest/1
I0817 00:26:16.211949  5253 containerizer.cpp:246] Using isolation: posix/cpu,posix/mem,filesystem/posix,network/cni,environment_secret
W0817 00:26:16.212725  5253 backend.cpp:76] Failed to create 'overlay' backend: OverlayBackend
requires root privileges
W0817 00:26:16.212931  5253 backend.cpp:76] Failed to create 'bind' backend: BindBackend requires
root privileges
I0817 00:26:16.212975  5253 provisioner.cpp:255] Using default backend 'copy'
I0817 00:26:16.218699  5273 slave.cpp:250] Mesos agent started on (801)@172.17.0.2:42535
I0817 00:26:16.218847  5273 slave.cpp:251] Flags at startup: --acls="" --appc_simple_discovery_uri_prefix="http://"
--appc_store_dir="/tmp/Endpoint_SlaveEndpointTest_UnauthorizedRequest_1_VnIVmy/store/appc"
--authenticate_http_readonly="true" --authenticate_http_readwrite="true" --authenticatee="crammd5"
--authentication_backoff_factor="1secs" --authorizer="local" --cgroups_cpu_enable_pids_and_tids_count="false"
--cgroups_enable_cfs="false" --cgroups_hierarchy="/sys/fs/cgroup" --cgroups_limit_swap="false"
--cgroups_root="mesos" --container_disk_watch_interval="15secs" --containerizers="mesos" --credential="/tmp/Endpoint_SlaveEndpointTest_UnauthorizedRequest_1_VnIVmy/credential"
--default_role="*" --disallow_sharing_agent_pid_namespace="false" --disk_watch_interval="1mins"
--docker="docker" --docker_kill_orphans="true" --docker_registry="https://registry-1.docker.io"
--docker_remove_delay="6hrs" --docker_socket="/var/run/docker.sock" --docker_stop_timeout="0ns"
--docker_store_dir="/tmp/Endpoint_SlaveEndpointTest_UnauthorizedRequest_1_VnIVmy/store/docker"
--docker_volume_checkpoint_dir="/var/run/mesos/isolators/docker/volume" --enforce_container_disk_quota="false"
--executor_registration_timeout="1mins" --executor_reregistration_timeout="2secs" --executor_shutdown_grace_period="5secs"
--fetcher_cache_dir="/tmp/Endpoint_SlaveEndpointTest_UnauthorizedRequest_1_VnIVmy/fetch" --fetcher_cache_size="2GB"
--frameworks_home="" --gc_delay="1weeks" --gc_disk_headroom="0.1" --hadoop_home="" --help="false"
--hostname_lookup="true" --http_command_executor="false" --http_credentials="/tmp/Endpoint_SlaveEndpointTest_UnauthorizedRequest_1_VnIVmy/http_credentials"
--http_heartbeat_interval="30secs" --initialize_driver_logging="true" --isolation="posix/cpu,posix/mem"
--launcher="posix" --launcher_dir="/mesos/mesos-1.4.0/_build/src" --logbufsecs="0" --logging_level="INFO"
--max_completed_executors_per_framework="150" --oversubscribed_resources_interval="15secs"
--perf_duration="10secs" --perf_interval="1mins" --port="5051" --qos_correction_interval_min="0ns"
--quiet="false" --recover="reconnect" --recovery_timeout="15mins" --registration_backoff_factor="10ms"
--resources="cpus:2;gpus:0;mem:1024;disk:1024;ports:[31000-32000]" --revocable_cpu_low_priority="true"
--runtime_dir="/tmp/Endpoint_SlaveEndpointTest_UnauthorizedRequest_1_VnIVmy" --sandbox_directory="/mnt/mesos/sandbox"
--strict="true" --switch_user="true" --systemd_enable_support="true" --systemd_runtime_directory="/run/systemd/system"
--version="false" --work_dir="/tmp/Endpoint_SlaveEndpointTest_UnauthorizedRequest_1_Oc9e92"
I0817 00:26:16.219969  5273 credentials.hpp:86] Loading credential for authentication from
'/tmp/Endpoint_SlaveEndpointTest_UnauthorizedRequest_1_VnIVmy/credential'
I0817 00:26:16.220675  5273 slave.cpp:283] Agent using credential for: test-principal
I0817 00:26:16.221040  5273 credentials.hpp:37] Loading credentials for authentication from
'/tmp/Endpoint_SlaveEndpointTest_UnauthorizedRequest_1_VnIVmy/http_credentials'
I0817 00:26:16.221711  5273 http.cpp:1026] Creating default 'basic' HTTP authenticator for
realm 'mesos-agent-readonly'
I0817 00:26:16.222247  5273 http.cpp:1026] Creating default 'basic' HTTP authenticator for
realm 'mesos-agent-readwrite'
I0817 00:26:16.224951  5273 slave.cpp:565] Agent resources: [{"name":"cpus","scalar":{"value":2.0},"type":"SCALAR"},{"name":"mem","scalar":{"value":1024.0},"type":"SCALAR"},{"name":"disk","scalar":{"value":1024.0},"type":"SCALAR"},{"name":"ports","ranges":{"range":[{"begin":31000,"end":32000}]},"type":"RANGES"}]
I0817 00:26:16.225813  5273 slave.cpp:573] Agent attributes: [  ]
I0817 00:26:16.226001  5273 slave.cpp:582] Agent hostname: 3520da11d3fa
I0817 00:26:16.226487  5276 status_update_manager.cpp:177] Pausing sending status updates
I0817 00:26:16.229734  5277 state.cpp:64] Recovering state from '/tmp/Endpoint_SlaveEndpointTest_UnauthorizedRequest_1_Oc9e92/meta'
I0817 00:26:16.230229  5275 status_update_manager.cpp:203] Recovering status update manager
I0817 00:26:16.230473  5275 containerizer.cpp:609] Recovering containerizer
I0817 00:26:16.232529  5278 provisioner.cpp:416] Provisioner recovery complete
I0817 00:26:16.233170  5273 slave.cpp:6210] Finished recovery
I0817 00:26:16.234266  5273 slave.cpp:6392] Querying resource estimator for oversubscribable
resources
I0817 00:26:16.235190  5278 slave.cpp:6406] Received oversubscribable resources {} from the
resource estimator
I0817 00:26:16.239760  5278 process.cpp:3933] Handling HTTP event for process 'slave(801)'
with path: '/slave(801)/monitor/statistics.json'
I0817 00:26:16.242136  5273 http.cpp:1166] HTTP GET for /slave(801)/monitor/statistics.json
from 172.17.0.2:36382
I0817 00:26:16.242691  5273 http.cpp:957] Authorizing principal 'test-principal' to GET the
'/monitor/statistics.json' endpoint
I0817 00:26:16.247004  5273 slave.cpp:843] Agent terminating
[       OK ] Endpoint/SlaveEndpointTest.UnauthorizedRequest/1 (53 ms)
[ RUN      ] Endpoint/SlaveEndpointTest.UnauthorizedRequest/2
I0817 00:26:16.265377  5253 containerizer.cpp:246] Using isolation: posix/cpu,posix/mem,filesystem/posix,network/cni,environment_secret
W0817 00:26:16.266166  5253 backend.cpp:76] Failed to create 'overlay' backend: OverlayBackend
requires root privileges
W0817 00:26:16.266378  5253 backend.cpp:76] Failed to create 'bind' backend: BindBackend requires
root privileges
I0817 00:26:16.266425  5253 provisioner.cpp:255] Using default backend 'copy'
I0817 00:26:16.272059  5277 slave.cpp:250] Mesos agent started on (802)@172.17.0.2:42535
I0817 00:26:16.272100  5277 slave.cpp:251] Flags at startup: --acls="" --appc_simple_discovery_uri_prefix="http://"
--appc_store_dir="/tmp/Endpoint_SlaveEndpointTest_UnauthorizedRequest_2_Fh4oJz/store/appc"
--authenticate_http_readonly="true" --authenticate_http_readwrite="true" --authenticatee="crammd5"
--authentication_backoff_factor="1secs" --authorizer="local" --cgroups_cpu_enable_pids_and_tids_count="false"
--cgroups_enable_cfs="false" --cgroups_hierarchy="/sys/fs/cgroup" --cgroups_limit_swap="false"
--cgroups_root="mesos" --container_disk_watch_interval="15secs" --containerizers="mesos" --credential="/tmp/Endpoint_SlaveEndpointTest_UnauthorizedRequest_2_Fh4oJz/credential"
--default_role="*" --disallow_sharing_agent_pid_namespace="false" --disk_watch_interval="1mins"
--docker="docker" --docker_kill_orphans="true" --docker_registry="https://registry-1.docker.io"
--docker_remove_delay="6hrs" --docker_socket="/var/run/docker.sock" --docker_stop_timeout="0ns"
--docker_store_dir="/tmp/Endpoint_SlaveEndpointTest_UnauthorizedRequest_2_Fh4oJz/store/docker"
--docker_volume_checkpoint_dir="/var/run/mesos/isolators/docker/volume" --enforce_container_disk_quota="false"
--executor_registration_timeout="1mins" --executor_reregistration_timeout="2secs" --executor_shutdown_grace_period="5secs"
--fetcher_cache_dir="/tmp/Endpoint_SlaveEndpointTest_UnauthorizedRequest_2_Fh4oJz/fetch" --fetcher_cache_size="2GB"
--frameworks_home="" --gc_delay="1weeks" --gc_disk_headroom="0.1" --hadoop_home="" --help="false"
--hostname_lookup="true" --http_command_executor="false" --http_credentials="/tmp/Endpoint_SlaveEndpointTest_UnauthorizedRequest_2_Fh4oJz/http_credentials"
--http_heartbeat_interval="30secs" --initialize_driver_logging="true" --isolation="posix/cpu,posix/mem"
--launcher="posix" --launcher_dir="/mesos/mesos-1.4.0/_build/src" --logbufsecs="0" --logging_level="INFO"
--max_completed_executors_per_framework="150" --oversubscribed_resources_interval="15secs"
--perf_duration="10secs" --perf_interval="1mins" --port="5051" --qos_correction_interval_min="0ns"
--quiet="false" --recover="reconnect" --recovery_timeout="15mins" --registration_backoff_factor="10ms"
--resources="cpus:2;gpus:0;mem:1024;disk:1024;ports:[31000-32000]" --revocable_cpu_low_priority="true"
--runtime_dir="/tmp/Endpoint_SlaveEndpointTest_UnauthorizedRequest_2_Fh4oJz" --sandbox_directory="/mnt/mesos/sandbox"
--strict="true" --switch_user="true" --systemd_enable_support="true" --systemd_runtime_directory="/run/systemd/system"
--version="false" --work_dir="/tmp/Endpoint_SlaveEndpointTest_UnauthorizedRequest_2_AHH4m4"
I0817 00:26:16.272840  5277 credentials.hpp:86] Loading credential for authentication from
'/tmp/Endpoint_SlaveEndpointTest_UnauthorizedRequest_2_Fh4oJz/credential'
I0817 00:26:16.273106  5277 slave.cpp:283] Agent using credential for: test-principal
I0817 00:26:16.273134  5277 credentials.hpp:37] Loading credentials for authentication from
'/tmp/Endpoint_SlaveEndpointTest_UnauthorizedRequest_2_Fh4oJz/http_credentials'
I0817 00:26:16.273516  5277 http.cpp:1026] Creating default 'basic' HTTP authenticator for
realm 'mesos-agent-readonly'
I0817 00:26:16.273783  5277 http.cpp:1026] Creating default 'basic' HTTP authenticator for
realm 'mesos-agent-readwrite'
I0817 00:26:16.276103  5277 slave.cpp:565] Agent resources: [{"name":"cpus","scalar":{"value":2.0},"type":"SCALAR"},{"name":"mem","scalar":{"value":1024.0},"type":"SCALAR"},{"name":"disk","scalar":{"value":1024.0},"type":"SCALAR"},{"name":"ports","ranges":{"range":[{"begin":31000,"end":32000}]},"type":"RANGES"}]
I0817 00:26:16.276535  5277 slave.cpp:573] Agent attributes: [  ]
I0817 00:26:16.276556  5277 slave.cpp:582] Agent hostname: 3520da11d3fa
I0817 00:26:16.276792  5279 status_update_manager.cpp:177] Pausing sending status updates
I0817 00:26:16.278988  5278 state.cpp:64] Recovering state from '/tmp/Endpoint_SlaveEndpointTest_UnauthorizedRequest_2_AHH4m4/meta'
I0817 00:26:16.279539  5272 status_update_manager.cpp:203] Recovering status update manager
I0817 00:26:16.279947  5276 containerizer.cpp:609] Recovering containerizer
I0817 00:26:16.282275  5278 provisioner.cpp:416] Provisioner recovery complete
I0817 00:26:16.282903  5273 slave.cpp:6210] Finished recovery
I0817 00:26:16.284004  5273 slave.cpp:6392] Querying resource estimator for oversubscribable
resources
I0817 00:26:16.284756  5275 slave.cpp:6406] Received oversubscribable resources {} from the
resource estimator
I0817 00:26:16.289158  5278 process.cpp:3933] Handling HTTP event for process 'slave(802)'
with path: '/slave(802)/containers'
I0817 00:26:16.291383  5275 http.cpp:1166] HTTP GET for /slave(802)/containers from 172.17.0.2:36384
I0817 00:26:16.291504  5275 http.cpp:957] Authorizing principal 'test-principal' to GET the
'/containers' endpoint
I0817 00:26:16.295534  5253 slave.cpp:843] Agent terminating
[       OK ] Endpoint/SlaveEndpointTest.UnauthorizedRequest/2 (47 ms)
[ RUN      ] Endpoint/SlaveEndpointTest.NoAuthorizer/0
I0817 00:26:16.314168  5253 containerizer.cpp:246] Using isolation: posix/cpu,posix/mem,filesystem/posix,network/cni,environment_secret
W0817 00:26:16.314956  5253 backend.cpp:76] Failed to create 'overlay' backend: OverlayBackend
requires root privileges
W0817 00:26:16.315168  5253 backend.cpp:76] Failed to create 'bind' backend: BindBackend requires
root privileges
I0817 00:26:16.315215  5253 provisioner.cpp:255] Using default backend 'copy'
I0817 00:26:16.317911  5253 cluster.cpp:448] Creating default 'local' authorizer
I0817 00:26:16.321051  5272 slave.cpp:250] Mesos agent started on (803)@172.17.0.2:42535
I0817 00:26:16.321094  5272 slave.cpp:251] Flags at startup: --acls="" --appc_simple_discovery_uri_prefix="http://"
--appc_store_dir="/tmp/Endpoint_SlaveEndpointTest_NoAuthorizer_0_RnjcBB/store/appc" --authenticate_http_readonly="true"
--authenticate_http_readwrite="true" --authenticatee="crammd5" --authentication_backoff_factor="1secs"
--authorizer="local" --cgroups_cpu_enable_pids_and_tids_count="false" --cgroups_enable_cfs="false"
--cgroups_hierarchy="/sys/fs/cgroup" --cgroups_limit_swap="false" --cgroups_root="mesos" --container_disk_watch_interval="15secs"
--containerizers="mesos" --credential="/tmp/Endpoint_SlaveEndpointTest_NoAuthorizer_0_RnjcBB/credential"
--default_role="*" --disallow_sharing_agent_pid_namespace="false" --disk_watch_interval="1mins"
--docker="docker" --docker_kill_orphans="true" --docker_registry="https://registry-1.docker.io"
--docker_remove_delay="6hrs" --docker_socket="/var/run/docker.sock" --docker_stop_timeout="0ns"
--docker_store_dir="/tmp/Endpoint_SlaveEndpointTest_NoAuthorizer_0_RnjcBB/store/docker" --docker_volume_checkpoint_dir="/var/run/mesos/isolators/docker/volume"
--enforce_container_disk_quota="false" --executor_registration_timeout="1mins" --executor_reregistration_timeout="2secs"
--executor_shutdown_grace_period="5secs" --fetcher_cache_dir="/tmp/Endpoint_SlaveEndpointTest_NoAuthorizer_0_RnjcBB/fetch"
--fetcher_cache_size="2GB" --frameworks_home="" --gc_delay="1weeks" --gc_disk_headroom="0.1"
--hadoop_home="" --help="false" --hostname_lookup="true" --http_command_executor="false" --http_credentials="/tmp/Endpoint_SlaveEndpointTest_NoAuthorizer_0_RnjcBB/http_credentials"
--http_heartbeat_interval="30secs" --initialize_driver_logging="true" --isolation="posix/cpu,posix/mem"
--launcher="posix" --launcher_dir="/mesos/mesos-1.4.0/_build/src" --logbufsecs="0" --logging_level="INFO"
--max_completed_executors_per_framework="150" --oversubscribed_resources_interval="15secs"
--perf_duration="10secs" --perf_interval="1mins" --port="5051" --qos_correction_interval_min="0ns"
--quiet="false" --recover="reconnect" --recovery_timeout="15mins" --registration_backoff_factor="10ms"
--resources="cpus:2;gpus:0;mem:1024;disk:1024;ports:[31000-32000]" --revocable_cpu_low_priority="true"
--runtime_dir="/tmp/Endpoint_SlaveEndpointTest_NoAuthorizer_0_RnjcBB" --sandbox_directory="/mnt/mesos/sandbox"
--strict="true" --switch_user="true" --systemd_enable_support="true" --systemd_runtime_directory="/run/systemd/system"
--version="false" --work_dir="/tmp/Endpoint_SlaveEndpointTest_NoAuthorizer_0_YTe765"
I0817 00:26:16.321828  5272 credentials.hpp:86] Loading credential for authentication from
'/tmp/Endpoint_SlaveEndpointTest_NoAuthorizer_0_RnjcBB/credential'
I0817 00:26:16.322093  5272 slave.cpp:283] Agent using credential for: test-principal
I0817 00:26:16.322118  5272 credentials.hpp:37] Loading credentials for authentication from
'/tmp/Endpoint_SlaveEndpointTest_NoAuthorizer_0_RnjcBB/http_credentials'
I0817 00:26:16.322466  5272 http.cpp:1026] Creating default 'basic' HTTP authenticator for
realm 'mesos-agent-readonly'
I0817 00:26:16.322747  5272 http.cpp:1026] Creating default 'basic' HTTP authenticator for
realm 'mesos-agent-readwrite'
I0817 00:26:16.324965  5272 slave.cpp:565] Agent resources: [{"name":"cpus","scalar":{"value":2.0},"type":"SCALAR"},{"name":"mem","scalar":{"value":1024.0},"type":"SCALAR"},{"name":"disk","scalar":{"value":1024.0},"type":"SCALAR"},{"name":"ports","ranges":{"range":[{"begin":31000,"end":32000}]},"type":"RANGES"}]
I0817 00:26:16.325397  5272 slave.cpp:573] Agent attributes: [  ]
I0817 00:26:16.325419  5272 slave.cpp:582] Agent hostname: 3520da11d3fa
I0817 00:26:16.325655  5275 status_update_manager.cpp:177] Pausing sending status updates
I0817 00:26:16.327689  5275 state.cpp:64] Recovering state from '/tmp/Endpoint_SlaveEndpointTest_NoAuthorizer_0_YTe765/meta'
I0817 00:26:16.328250  5275 status_update_manager.cpp:203] Recovering status update manager
I0817 00:26:16.328482  5279 containerizer.cpp:609] Recovering containerizer
I0817 00:26:16.330791  5274 provisioner.cpp:416] Provisioner recovery complete
I0817 00:26:16.331334  5272 slave.cpp:6210] Finished recovery
I0817 00:26:16.332126  5272 slave.cpp:6392] Querying resource estimator for oversubscribable
resources
I0817 00:26:16.332473  5279 slave.cpp:6406] Received oversubscribable resources {} from the
resource estimator
I0817 00:26:16.336987  5277 process.cpp:3933] Handling HTTP event for process 'slave(803)'
with path: '/slave(803)/monitor/statistics'
I0817 00:26:16.339506  5276 http.cpp:1166] HTTP GET for /slave(803)/monitor/statistics from
172.17.0.2:36386
I0817 00:26:16.339629  5276 http.cpp:957] Authorizing principal 'test-principal' to GET the
'/monitor/statistics' endpoint
I0817 00:26:16.345302  5275 slave.cpp:843] Agent terminating
[       OK ] Endpoint/SlaveEndpointTest.NoAuthorizer/0 (49 ms)
[ RUN      ] Endpoint/SlaveEndpointTest.NoAuthorizer/1
I0817 00:26:16.363654  5253 containerizer.cpp:246] Using isolation: posix/cpu,posix/mem,filesystem/posix,network/cni,environment_secret
W0817 00:26:16.364516  5253 backend.cpp:76] Failed to create 'overlay' backend: OverlayBackend
requires root privileges
W0817 00:26:16.364730  5253 backend.cpp:76] Failed to create 'bind' backend: BindBackend requires
root privileges
I0817 00:26:16.364778  5253 provisioner.cpp:255] Using default backend 'copy'
I0817 00:26:16.367483  5253 cluster.cpp:448] Creating default 'local' authorizer
I0817 00:26:16.370698  5275 slave.cpp:250] Mesos agent started on (804)@172.17.0.2:42535
I0817 00:26:16.370740  5275 slave.cpp:251] Flags at startup: --acls="" --appc_simple_discovery_uri_prefix="http://"
--appc_store_dir="/tmp/Endpoint_SlaveEndpointTest_NoAuthorizer_1_X0o6YD/store/appc" --authenticate_http_readonly="true"
--authenticate_http_readwrite="true" --authenticatee="crammd5" --authentication_backoff_factor="1secs"
--authorizer="local" --cgroups_cpu_enable_pids_and_tids_count="false" --cgroups_enable_cfs="false"
--cgroups_hierarchy="/sys/fs/cgroup" --cgroups_limit_swap="false" --cgroups_root="mesos" --container_disk_watch_interval="15secs"
--containerizers="mesos" --credential="/tmp/Endpoint_SlaveEndpointTest_NoAuthorizer_1_X0o6YD/credential"
--default_role="*" --disallow_sharing_agent_pid_namespace="false" --disk_watch_interval="1mins"
--docker="docker" --docker_kill_orphans="true" --docker_registry="https://registry-1.docker.io"
--docker_remove_delay="6hrs" --docker_socket="/var/run/docker.sock" --docker_stop_timeout="0ns"
--docker_store_dir="/tmp/Endpoint_SlaveEndpointTest_NoAuthorizer_1_X0o6YD/store/docker" --docker_volume_checkpoint_dir="/var/run/mesos/isolators/docker/volume"
--enforce_container_disk_quota="false" --executor_registration_timeout="1mins" --executor_reregistration_timeout="2secs"
--executor_shutdown_grace_period="5secs" --fetcher_cache_dir="/tmp/Endpoint_SlaveEndpointTest_NoAuthorizer_1_X0o6YD/fetch"
--fetcher_cache_size="2GB" --frameworks_home="" --gc_delay="1weeks" --gc_disk_headroom="0.1"
--hadoop_home="" --help="false" --hostname_lookup="true" --http_command_executor="false" --http_credentials="/tmp/Endpoint_SlaveEndpointTest_NoAuthorizer_1_X0o6YD/http_credentials"
--http_heartbeat_interval="30secs" --initialize_driver_logging="true" --isolation="posix/cpu,posix/mem"
--launcher="posix" --launcher_dir="/mesos/mesos-1.4.0/_build/src" --logbufsecs="0" --logging_level="INFO"
--max_completed_executors_per_framework="150" --oversubscribed_resources_interval="15secs"
--perf_duration="10secs" --perf_interval="1mins" --port="5051" --qos_correction_interval_min="0ns"
--quiet="false" --recover="reconnect" --recovery_timeout="15mins" --registration_backoff_factor="10ms"
--resources="cpus:2;gpus:0;mem:1024;disk:1024;ports:[31000-32000]" --revocable_cpu_low_priority="true"
--runtime_dir="/tmp/Endpoint_SlaveEndpointTest_NoAuthorizer_1_X0o6YD" --sandbox_directory="/mnt/mesos/sandbox"
--strict="true" --switch_user="true" --systemd_enable_support="true" --systemd_runtime_directory="/run/systemd/system"
--version="false" --work_dir="/tmp/Endpoint_SlaveEndpointTest_NoAuthorizer_1_eEfVm8"
I0817 00:26:16.371498  5275 credentials.hpp:86] Loading credential for authentication from
'/tmp/Endpoint_SlaveEndpointTest_NoAuthorizer_1_X0o6YD/credential'
I0817 00:26:16.371764  5275 slave.cpp:283] Agent using credential for: test-principal
I0817 00:26:16.371795  5275 credentials.hpp:37] Loading credentials for authentication from
'/tmp/Endpoint_SlaveEndpointTest_NoAuthorizer_1_X0o6YD/http_credentials'
I0817 00:26:16.372176  5275 http.cpp:1026] Creating default 'basic' HTTP authenticator for
realm 'mesos-agent-readonly'
I0817 00:26:16.372445  5275 http.cpp:1026] Creating default 'basic' HTTP authenticator for
realm 'mesos-agent-readwrite'
I0817 00:26:16.374631  5275 slave.cpp:565] Agent resources: [{"name":"cpus","scalar":{"value":2.0},"type":"SCALAR"},{"name":"mem","scalar":{"value":1024.0},"type":"SCALAR"},{"name":"disk","scalar":{"value":1024.0},"type":"SCALAR"},{"name":"ports","ranges":{"range":[{"begin":31000,"end":32000}]},"type":"RANGES"}]
I0817 00:26:16.375059  5275 slave.cpp:573] Agent attributes: [  ]
I0817 00:26:16.375079  5275 slave.cpp:582] Agent hostname: 3520da11d3fa
I0817 00:26:16.375310  5272 status_update_manager.cpp:177] Pausing sending status updates
I0817 00:26:16.377399  5274 state.cpp:64] Recovering state from '/tmp/Endpoint_SlaveEndpointTest_NoAuthorizer_1_eEfVm8/meta'
I0817 00:26:16.378000  5272 status_update_manager.cpp:203] Recovering status update manager
I0817 00:26:16.378448  5276 containerizer.cpp:609] Recovering containerizer
I0817 00:26:16.380821  5275 provisioner.cpp:416] Provisioner recovery complete
I0817 00:26:16.381331  5274 slave.cpp:6210] Finished recovery
I0817 00:26:16.382120  5274 slave.cpp:6392] Querying resource estimator for oversubscribable
resources
I0817 00:26:16.382678  5274 slave.cpp:6406] Received oversubscribable resources {} from the
resource estimator
I0817 00:26:16.387059  5273 process.cpp:3933] Handling HTTP event for process 'slave(804)'
with path: '/slave(804)/monitor/statistics.json'
I0817 00:26:16.389374  5278 http.cpp:1166] HTTP GET for /slave(804)/monitor/statistics.json
from 172.17.0.2:36388
I0817 00:26:16.389493  5278 http.cpp:957] Authorizing principal 'test-principal' to GET the
'/monitor/statistics.json' endpoint
I0817 00:26:16.395345  5253 slave.cpp:843] Agent terminating
[       OK ] Endpoint/SlaveEndpointTest.NoAuthorizer/1 (49 ms)
[ RUN      ] Endpoint/SlaveEndpointTest.NoAuthorizer/2
I0817 00:26:16.413508  5253 containerizer.cpp:246] Using isolation: posix/cpu,posix/mem,filesystem/posix,network/cni,environment_secret
W0817 00:26:16.414342  5253 backend.cpp:76] Failed to create 'overlay' backend: OverlayBackend
requires root privileges
W0817 00:26:16.414561  5253 backend.cpp:76] Failed to create 'bind' backend: BindBackend requires
root privileges
I0817 00:26:16.414610  5253 provisioner.cpp:255] Using default backend 'copy'
I0817 00:26:16.417294  5253 cluster.cpp:448] Creating default 'local' authorizer
I0817 00:26:16.420413  5276 slave.cpp:250] Mesos agent started on (805)@172.17.0.2:42535
I0817 00:26:16.420456  5276 slave.cpp:251] Flags at startup: --acls="" --appc_simple_discovery_uri_prefix="http://"
--appc_store_dir="/tmp/Endpoint_SlaveEndpointTest_NoAuthorizer_2_9YtkTG/store/appc" --authenticate_http_readonly="true"
--authenticate_http_readwrite="true" --authenticatee="crammd5" --authentication_backoff_factor="1secs"
--authorizer="local" --cgroups_cpu_enable_pids_and_tids_count="false" --cgroups_enable_cfs="false"
--cgroups_hierarchy="/sys/fs/cgroup" --cgroups_limit_swap="false" --cgroups_root="mesos" --container_disk_watch_interval="15secs"
--containerizers="mesos" --credential="/tmp/Endpoint_SlaveEndpointTest_NoAuthorizer_2_9YtkTG/credential"
--default_role="*" --disallow_sharing_agent_pid_namespace="false" --disk_watch_interval="1mins"
--docker="docker" --docker_kill_orphans="true" --docker_registry="https://registry-1.docker.io"
--docker_remove_delay="6hrs" --docker_socket="/var/run/docker.sock" --docker_stop_timeout="0ns"
--docker_store_dir="/tmp/Endpoint_SlaveEndpointTest_NoAuthorizer_2_9YtkTG/store/docker" --docker_volume_checkpoint_dir="/var/run/mesos/isolators/docker/volume"
--enforce_container_disk_quota="false" --executor_registration_timeout="1mins" --executor_reregistration_timeout="2secs"
--executor_shutdown_grace_period="5secs" --fetcher_cache_dir="/tmp/Endpoint_SlaveEndpointTest_NoAuthorizer_2_9YtkTG/fetch"
--fetcher_cache_size="2GB" --frameworks_home="" --gc_delay="1weeks" --gc_disk_headroom="0.1"
--hadoop_home="" --help="false" --hostname_lookup="true" --http_command_executor="false" --http_credentials="/tmp/Endpoint_SlaveEndpointTest_NoAuthorizer_2_9YtkTG/http_credentials"
--http_heartbeat_interval="30secs" --initialize_driver_logging="true" --isolation="posix/cpu,posix/mem"
--launcher="posix" --launcher_dir="/mesos/mesos-1.4.0/_build/src" --logbufsecs="0" --logging_level="INFO"
--max_completed_executors_per_framework="150" --oversubscribed_resources_interval="15secs"
--perf_duration="10secs" --perf_interval="1mins" --port="5051" --qos_correction_interval_min="0ns"
--quiet="false" --recover="reconnect" --recovery_timeout="15mins" --registration_backoff_factor="10ms"
--resources="cpus:2;gpus:0;mem:1024;disk:1024;ports:[31000-32000]" --revocable_cpu_low_priority="true"
--runtime_dir="/tmp/Endpoint_SlaveEndpointTest_NoAuthorizer_2_9YtkTG" --sandbox_directory="/mnt/mesos/sandbox"
--strict="true" --switch_user="true" --systemd_enable_support="true" --systemd_runtime_directory="/run/systemd/system"
--version="false" --work_dir="/tmp/Endpoint_SlaveEndpointTest_NoAuthorizer_2_wXp48a"
I0817 00:26:16.421185  5276 credentials.hpp:86] Loading credential for authentication from
'/tmp/Endpoint_SlaveEndpointTest_NoAuthorizer_2_9YtkTG/credential'
I0817 00:26:16.421456  5276 slave.cpp:283] Agent using credential for: test-principal
I0817 00:26:16.421488  5276 credentials.hpp:37] Loading credentials for authentication from
'/tmp/Endpoint_SlaveEndpointTest_NoAuthorizer_2_9YtkTG/http_credentials'
I0817 00:26:16.421857  5276 http.cpp:1026] Creating default 'basic' HTTP authenticator for
realm 'mesos-agent-readonly'
I0817 00:26:16.422134  5276 http.cpp:1026] Creating default 'basic' HTTP authenticator for
realm 'mesos-agent-readwrite'
I0817 00:26:16.424345  5276 slave.cpp:565] Agent resources: [{"name":"cpus","scalar":{"value":2.0},"type":"SCALAR"},{"name":"mem","scalar":{"value":1024.0},"type":"SCALAR"},{"name":"disk","scalar":{"value":1024.0},"type":"SCALAR"},{"name":"ports","ranges":{"range":[{"begin":31000,"end":32000}]},"type":"RANGES"}]
I0817 00:26:16.424777  5276 slave.cpp:573] Agent attributes: [  ]
I0817 00:26:16.424798  5276 slave.cpp:582] Agent hostname: 3520da11d3fa
I0817 00:26:16.425025  5277 status_update_manager.cpp:177] Pausing sending status updates
I0817 00:26:16.427100  5274 state.cpp:64] Recovering state from '/tmp/Endpoint_SlaveEndpointTest_NoAuthorizer_2_wXp48a/meta'
I0817 00:26:16.427685  5277 status_update_manager.cpp:203] Recovering status update manager
I0817 00:26:16.428059  5276 containerizer.cpp:609] Recovering containerizer
I0817 00:26:16.430294  5272 provisioner.cpp:416] Provisioner recovery complete
I0817 00:26:16.430835  5274 slave.cpp:6210] Finished recovery
I0817 00:26:16.431602  5274 slave.cpp:6392] Querying resource estimator for oversubscribable
resources
I0817 00:26:16.431967  5274 slave.cpp:6406] Received oversubscribable resources {} from the
resource estimator
I0817 00:26:16.436673  5277 process.cpp:3933] Handling HTTP event for process 'slave(805)'
with path: '/slave(805)/containers'
I0817 00:26:16.438657  5278 http.cpp:1166] HTTP GET for /slave(805)/containers from 172.17.0.2:36390
I0817 00:26:16.438778  5278 http.cpp:957] Authorizing principal 'test-principal' to GET the
'/containers' endpoint
I0817 00:26:16.444603  5273 slave.cpp:843] Agent terminating
[       OK ] Endpoint/SlaveEndpointTest.NoAuthorizer/2 (49 ms)
[----------] 9 tests from Endpoint/SlaveEndpointTest (462 ms total)

[----------] 2 tests from ContainerizerType/DefaultContainerDNSFlagTest
[ RUN      ] ContainerizerType/DefaultContainerDNSFlagTest.ValidateFlag/0
[       OK ] ContainerizerType/DefaultContainerDNSFlagTest.ValidateFlag/0 (18 ms)
[ RUN      ] ContainerizerType/DefaultContainerDNSFlagTest.ValidateFlag/1
[       OK ] ContainerizerType/DefaultContainerDNSFlagTest.ValidateFlag/1 (20 ms)
[----------] 2 tests from ContainerizerType/DefaultContainerDNSFlagTest (38 ms total)

[----------] Global test environment tear-down
[==========] 1655 tests from 182 test cases ran. (755458 ms total)
[  PASSED  ] 1651 tests.
[  FAILED  ] 4 tests, listed below:
[  FAILED  ] DefaultExecutorCheckTest.CommandCheckDeliveredAndReconciled
[  FAILED  ] DefaultExecutorCheckTest.CommandCheckStatusChange
[  FAILED  ] DefaultExecutorCheckTest.CommandCheckSeesParentsEnv
[  FAILED  ] DefaultExecutorCheckTest.CommandCheckSharesWorkDirWithTask

 4 FAILED TESTS
  YOU HAVE 20 DISABLED TESTS

I0817 00:26:16.630874  5280 process.cpp:1072] Failed to accept socket: future discarded
make[4]: *** [check-local] Error 1
make[4]: Leaving directory `/mesos/mesos-1.4.0/_build/src'
make[3]: *** [check-am] Error 2
make[3]: Leaving directory `/mesos/mesos-1.4.0/_build/src'
make[2]: *** [check] Error 2
make[2]: Leaving directory `/mesos/mesos-1.4.0/_build/src'
make[1]: *** [check-recursive] Error 1
make[1]: Leaving directory `/mesos/mesos-1.4.0/_build'
make: *** [distcheck] Error 1
+ docker rmi mesos-1502923478-11363
Untagged: mesos-1502923478-11363:latest
Deleted: sha256:dc0199e4f3ded77a3349686d870565140e1f383ec797ff7824c454764b950826
Deleted: sha256:a1f303e376580ffcb5dea16cc909aa6e5d43a96d79b8a36ba4f1046ecf88b058
Deleted: sha256:2548b5f09070be80c182cd0463534141ed2123c74e7924e23b9a31bb3603014d
Deleted: sha256:2fe25e70c47673674d18b280b3da1898b174b511f1b833ae4cf1b83800fc3946
Deleted: sha256:ff573871076a3c0fbcf056f692d6acbeaadf92d4d729f16c1035d339836fa963
Deleted: sha256:84ef56f2533322515627b78d3f234595a635611084f55439823bc92f25c2cba6
Deleted: sha256:34ec537ad244bd3152baae4b6bb20b866ae8d06493ef3126cd456d17237b673c
Deleted: sha256:ea38a0500c1dcaffd85772686e64b9f1317a7b1837ad07224ec8a39c86ecef48
Deleted: sha256:4569f8e3fde670a5ac1e51b7d252f36ac3485f482267fd1287cc750039b75cd7
Deleted: sha256:87f1be02c07570a08611ebe73ef6dc784381e4fa10a048148dc5d270f0853533
Deleted: sha256:a858e811c62a2933123ac3d4116adc893d2880f38a58ec55bf1d7d80ccf5638f
Deleted: sha256:3e9bbb7e68edc99b0734e35528224d9726af7d4ae21c18c37a441d44cc3ddc0c
Deleted: sha256:52b202c1ead77860993aac7d2467a68f07e490d11e328c41e54a588f4d85dc35
Deleted: sha256:886a3d8ee9ce5920ce8aad2cec5cb76ba296a996c9a0721eb880f827e553cb5f
Deleted: sha256:6850cab73e785261a901b4c2c82f6d523c889407531a17bb8f63fc8c782dbcd5
Deleted: sha256:ce8b8e5dc9460e8ede5ad7e557ae57651d3b6933788da86f387c13d9bdff3707
Deleted: sha256:b2670282858d546820e02b8e83450f997e41b7f5f3b8a7e78d33a9dfd58b73a9
Deleted: sha256:ab7cd87188e2042e9aef13c38362cc60ed6fd05706bc706cbc26580f1e369cbd
Deleted: sha256:fc3fa79bafc9cbbd3e102b053178b4067a1b8ab3ab9e381e6f1e0109dd8f4012
Deleted: sha256:bbb6e963380f6d8b30dd78da1cdde8498ae116a1a914cd140d0b3bb319ad2ac1
Deleted: sha256:8a8fba5ea2d9edb0d66718b52b592d5ce09e1e26d54d944e116424c588f9461c
Deleted: sha256:4376d3fa9948a52c72382f9633ac8f2a9d334a4d72d2e4847ad6415a7a1f6227
Deleted: sha256:3d7edb1a14d876c208b9e3983d5a4daf9b181e133f0d83c136da13c236cc7cfa
Deleted: sha256:38cdb957020817ae1df31d36ee00eac946bb67e2b7d6e3cb7e44ff7736d124f0
Build step 'Execute shell' marked build as failure

Mime
View raw message