mesos-builds mailing list archives

Site index · List index
Message view « Date » · « Thread »
Top « Date » · « Thread »
From Apache Jenkins Server <jenk...@builds.apache.org>
Subject Build failed in Jenkins: Mesos-Reviewbot #18978
Date Tue, 22 Aug 2017 16:49:37 GMT
See <https://builds.apache.org/job/Mesos-Reviewbot/18978/display/redirect>

------------------------------------------
[...truncated 2.78 MB...]
as: BFD (GNU Binutils for Ubuntu) 2.24 assertion fail ../../bfd/elf.c:2636
as: BFD (GNU Binutils for Ubuntu) 2.24 assertion fail ../../bfd/elf.c:2636
as: BFD (GNU Binutils for Ubuntu) 2.24 assertion fail ../../bfd/elf.c:2636
as: BFD (GNU Binutils for Ubuntu) 2.24 assertion fail ../../bfd/elf.c:2636
as: BFD (GNU Binutils for Ubuntu) 2.24 assertion fail ../../bfd/elf.c:2636
as: BFD (GNU Binutils for Ubuntu) 2.24 assertion fail ../../bfd/elf.c:2636
as: BFD (GNU Binutils for Ubuntu) 2.24 assertion fail ../../bfd/elf.c:2636
as: BFD (GNU Binutils for Ubuntu) 2.24 assertion fail ../../bfd/elf.c:2636
as: BFD (GNU Binutils for Ubuntu) 2.24 assertion fail ../../bfd/elf.c:2636
as: BFD (GNU Binutils for Ubuntu) 2.24 assertion fail ../../bfd/elf.c:2636
as: BFD (GNU Binutils for Ubuntu) 2.24 assertion fail ../../bfd/elf.c:2636
as: BFD (GNU Binutils for Ubuntu) 2.24 assertion fail ../../bfd/elf.c:2636
as: BFD (GNU Binutils for Ubuntu) 2.24 assertion fail ../../bfd/elf.c:2636
as: BFD (GNU Binutils for Ubuntu) 2.24 assertion fail ../../bfd/elf.c:2636
as: BFD (GNU Binutils for Ubuntu) 2.24 assertion fail ../../bfd/elf.c:2636
as: BFD (GNU Binutils for Ubuntu) 2.24 assertion fail ../../bfd/elf.c:2636
as: BFD (GNU Binutils for Ubuntu) 2.24 assertion fail ../../bfd/elf.c:2636
as: BFD (GNU Binutils for Ubuntu) 2.24 assertion fail ../../bfd/elf.c:2636
as: BFD (GNU Binutils for Ubuntu) 2.24 assertion fail ../../bfd/elf.c:2636
as: BFD (GNU Binutils for Ubuntu) 2.24 assertion fail ../../bfd/elf.c:2636
as: BFD (GNU Binutils for Ubuntu) 2.24 assertion fail ../../bfd/elf.c:2636
as: BFD (GNU Binutils for Ubuntu) 2.24 assertion fail ../../bfd/elf.c:2636
as: BFD (GNU Binutils for Ubuntu) 2.24 assertion fail ../../bfd/elf.c:2636
as: BFD (GNU Binutils for Ubuntu) 2.24 assertion fail ../../bfd/elf.c:2636
as: BFD (GNU Binutils for Ubuntu) 2.24 assertion fail ../../bfd/elf.c:2636
as: BFD (GNU Binutils for Ubuntu) 2.24 assertion fail ../../bfd/elf.c:2636
as: BFD (GNU Binutils for Ubuntu) 2.24 assertion fail ../../bfd/elf.c:2636
as: BFD (GNU Binutils for Ubuntu) 2.24 assertion fail ../../bfd/elf.c:2636
as: BFD (GNU Binutils for Ubuntu) 2.24 assertion fail ../../bfd/elf.c:2636
as: BFD (GNU Binutils for Ubuntu) 2.24 assertion fail ../../bfd/elf.c:2636
as: BFD (GNU Binutils for Ubuntu) 2.24 assertion fail ../../bfd/elf.c:2636
as: BFD (GNU Binutils for Ubuntu) 2.24 assertion fail ../../bfd/elf.c:2636
as: BFD (GNU Binutils for Ubuntu) 2.24 assertion fail ../../bfd/elf.c:2636
as: BFD (GNU Binutils for Ubuntu) 2.24 assertion fail ../../bfd/elf.c:2636
as: BFD (GNU Binutils for Ubuntu) 2.24 assertion fail ../../bfd/elf.c:2636
as: BFD (GNU Binutils for Ubuntu) 2.24 assertion fail ../../bfd/elf.c:2636
as: BFD (GNU Binutils for Ubuntu) 2.24 assertion fail ../../bfd/elf.c:2636
as: BFD (GNU Binutils for Ubuntu) 2.24 assertion fail ../../bfd/elf.c:2636
as: BFD (GNU Binutils for Ubuntu) 2.24 assertion fail ../../bfd/elf.c:2636
as: BFD (GNU Binutils for Ubuntu) 2.24 assertion fail ../../bfd/elf.c:2636
as: BFD (GNU Binutils for Ubuntu) 2.24 assertion fail ../../bfd/elf.c:2636
as: BFD (GNU Binutils for Ubuntu) 2.24 assertion fail ../../bfd/elf.c:2636
as: BFD (GNU Binutils for Ubuntu) 2.24 assertion fail ../../bfd/elf.c:2636
as: BFD (GNU Binutils for Ubuntu) 2.24 assertion fail ../../bfd/elf.c:2636
as: BFD (GNU Binutils for Ubuntu) 2.24 assertion fail ../../bfd/elf.c:2636
as: BFD (GNU Binutils for Ubuntu) 2.24 assertion fail ../../bfd/elf.c:2636
as: BFD (GNU Binutils for Ubuntu) 2.24 assertion fail ../../bfd/elf.c:2636
as: BFD (GNU Binutils for Ubuntu) 2.24 assertion fail ../../bfd/elf.c:2636
as: BFD (GNU Binutils for Ubuntu) 2.24 assertion fail ../../bfd/elf.c:2636
as: BFD (GNU Binutils for Ubuntu) 2.24 assertion fail ../../bfd/elf.c:2636
as: BFD (GNU Binutils for Ubuntu) 2.24 assertion fail ../../bfd/elf.c:2636
as: BFD (GNU Binutils for Ubuntu) 2.24 assertion fail ../../bfd/elf.c:2636
as: BFD (GNU Binutils for Ubuntu) 2.24 assertion fail ../../bfd/elf.c:2636
as: BFD (GNU Binutils for Ubuntu) 2.24 assertion fail ../../bfd/elf.c:2636
as: BFD (GNU Binutils for Ubuntu) 2.24 assertion fail ../../bfd/elf.c:2636
as: BFD (GNU Binutils for Ubuntu) 2.24 assertion fail ../../bfd/elf.c:2636
as: BFD (GNU Binutils for Ubuntu) 2.24 assertion fail ../../bfd/elf.c:2636
as: BFD (GNU Binutils for Ubuntu) 2.24 assertion fail ../../bfd/elf.c:2636
as: BFD (GNU Binutils for Ubuntu) 2.24 assertion fail ../../bfd/elf.c:2636
as: BFD (GNU Binutils for Ubuntu) 2.24 assertion fail ../../bfd/elf.c:2636
as: BFD (GNU Binutils for Ubuntu) 2.24 assertion fail ../../bfd/elf.c:2636
as: BFD (GNU Binutils for Ubuntu) 2.24 assertion fail ../../bfd/elf.c:2636
as: BFD (GNU Binutils for Ubuntu) 2.24 assertion fail ../../bfd/elf.c:2636
as: BFD (GNU Binutils for Ubuntu) 2.24 assertion fail ../../bfd/elf.c:2636
as: BFD (GNU Binutils for Ubuntu) 2.24 assertion fail ../../bfd/elf.c:2636
as: BFD (GNU Binutils for Ubuntu) 2.24 assertion fail ../../bfd/elf.c:2636
as: BFD (GNU Binutils for Ubuntu) 2.24 assertion fail ../../bfd/elf.c:2636
as: BFD (GNU Binutils for Ubuntu) 2.24 assertion fail ../../bfd/elf.c:2636
as: BFD (GNU Binutils for Ubuntu) 2.24 assertion fail ../../bfd/elf.c:2636
as: BFD (GNU Binutils for Ubuntu) 2.24 assertion fail ../../bfd/elf.c:2636
as: BFD (GNU Binutils for Ubuntu) 2.24 assertion fail ../../bfd/elf.c:2636
as: BFD (GNU Binutils for Ubuntu) 2.24 assertion fail ../../bfd/elf.c:2636
as: BFD (GNU Binutils for Ubuntu) 2.24 assertion fail ../../bfd/elf.c:2636
as: BFD (GNU Binutils for Ubuntu) 2.24 assertion fail ../../bfd/elf.c:2636
as: BFD (GNU Binutils for Ubuntu) 2.24 assertion fail ../../bfd/elf.c:2636
as: BFD (GNU Binutils for Ubuntu) 2.24 assertion fail ../../bfd/elf.c:2636
as: BFD (GNU Binutils for Ubuntu) 2.24 assertion fail ../../bfd/elf.c:2636
as: BFD (GNU Binutils for Ubuntu) 2.24 assertion fail ../../bfd/elf.c:2636
as: BFD (GNU Binutils for Ubuntu) 2.24 assertion fail ../../bfd/elf.c:2636
as: BFD (GNU Binutils for Ubuntu) 2.24 assertion fail ../../bfd/elf.c:2636
as: BFD (GNU Binutils for Ubuntu) 2.24 assertion fail ../../bfd/elf.c:2636
as: BFD (GNU Binutils for Ubuntu) 2.24 assertion fail ../../bfd/elf.c:2636
as: BFD (GNU Binutils for Ubuntu) 2.24 assertion fail ../../bfd/elf.c:2636
as: BFD (GNU Binutils for Ubuntu) 2.24 assertion fail ../../bfd/elf.c:2636
as: BFD (GNU Binutils for Ubuntu) 2.24 assertion fail ../../bfd/elf.c:2636
as: BFD (GNU Binutils for Ubuntu) 2.24 assertion fail ../../bfd/elf.c:2636
as: BFD (GNU Binutils for Ubuntu) 2.24 assertion fail ../../bfd/elf.c:2636
as: BFD (GNU Binutils for Ubuntu) 2.24 assertion fail ../../bfd/elf.c:2636
as: BFD (GNU Binutils for Ubuntu) 2.24 assertion fail ../../bfd/elf.c:2636
as: BFD (GNU Binutils for Ubuntu) 2.24 assertion fail ../../bfd/elf.c:2636
as: BFD (GNU Binutils for Ubuntu) 2.24 assertion fail ../../bfd/elf.c:2636
as: BFD (GNU Binutils for Ubuntu) 2.24 assertion fail ../../bfd/elf.c:2636
as: BFD (GNU Binutils for Ubuntu) 2.24 assertion fail ../../bfd/elf.c:2636
as: BFD (GNU Binutils for Ubuntu) 2.24 assertion fail ../../bfd/elf.c:2636
as: BFD (GNU Binutils for Ubuntu) 2.24 assertion fail ../../bfd/elf.c:2636
as: BFD (GNU Binutils for Ubuntu) 2.24 assertion fail ../../bfd/elf.c:2636
as: BFD (GNU Binutils for Ubuntu) 2.24 assertion fail ../../bfd/elf.c:2636
as: BFD (GNU Binutils for Ubuntu) 2.24 assertion fail ../../bfd/elf.c:2636
as: BFD (GNU Binutils for Ubuntu) 2.24 assertion fail ../../bfd/elf.c:2636
as: BFD (GNU Binutils for Ubuntu) 2.24 assertion fail ../../bfd/elf.c:2636
as: BFD (GNU Binutils for Ubuntu) 2.24 assertion fail ../../bfd/elf.c:2636
as: BFD (GNU Binutils for Ubuntu) 2.24 assertion fail ../../bfd/elf.c:2636
as: BFD (GNU Binutils for Ubuntu) 2.24 assertion fail ../../bfd/elf.c:2636
as: BFD (GNU Binutils for Ubuntu) 2.24 assertion fail ../../bfd/elf.c:2636
as: BFD (GNU Binutils for Ubuntu) 2.24 assertion fail ../../bfd/elf.c:2636
as: BFD (GNU Binutils for Ubuntu) 2.24 assertion fail ../../bfd/elf.c:2636
as: BFD (GNU Binutils for Ubuntu) 2.24 assertion fail ../../bfd/elf.c:2636
as: BFD (GNU Binutils for Ubuntu) 2.24 assertion fail ../../bfd/elf.c:2636
as: BFD (GNU Binutils for Ubuntu) 2.24 assertion fail ../../bfd/elf.c:2636
as: BFD (GNU Binutils for Ubuntu) 2.24 assertion fail ../../bfd/elf.c:2636
as: BFD (GNU Binutils for Ubuntu) 2.24 assertion fail ../../bfd/elf.c:2636
as: BFD (GNU Binutils for Ubuntu) 2.24 assertion fail ../../bfd/elf.c:2636
as: BFD (GNU Binutils for Ubuntu) 2.24 assertion fail ../../bfd/elf.c:2636
as: BFD (GNU Binutils for Ubuntu) 2.24 assertion fail ../../bfd/elf.c:2636
as: BFD (GNU Binutils for Ubuntu) 2.24 assertion fail ../../bfd/elf.c:2636
as: BFD (GNU Binutils for Ubuntu) 2.24 assertion fail ../../bfd/elf.c:2636
as: BFD (GNU Binutils for Ubuntu) 2.24 assertion fail ../../bfd/elf.c:2636
as: BFD (GNU Binutils for Ubuntu) 2.24 assertion fail ../../bfd/elf.c:2636
as: BFD (GNU Binutils for Ubuntu) 2.24 assertion fail ../../bfd/elf.c:2636
as: BFD (GNU Binutils for Ubuntu) 2.24 assertion fail ../../bfd/elf.c:2636
as: BFD (GNU Binutils for Ubuntu) 2.24 assertion fail ../../bfd/elf.c:2636
as: BFD (GNU Binutils for Ubuntu) 2.24 assertion fail ../../bfd/elf.c:2636
as: BFD (GNU Binutils for Ubuntu) 2.24 assertion fail ../../bfd/elf.c:2636
as: BFD (GNU Binutils for Ubuntu) 2.24 assertion fail ../../bfd/elf.c:2636
as: BFD (GNU Binutils for Ubuntu) 2.24 assertion fail ../../bfd/elf.c:2636
as: BFD (GNU Binutils for Ubuntu) 2.24 assertion fail ../../bfd/elf.c:2636
as: BFD (GNU Binutils for Ubuntu) 2.24 assertion fail ../../bfd/elf.c:2636
as: BFD (GNU Binutils for Ubuntu) 2.24 assertion fail ../../bfd/elf.c:2636
as: BFD (GNU Binutils for Ubuntu) 2.24 assertion fail ../../bfd/elf.c:2636
as: BFD (GNU Binutils for Ubuntu) 2.24 assertion fail ../../bfd/elf.c:2636
as: BFD (GNU Binutils for Ubuntu) 2.24 assertion fail ../../bfd/elf.c:2636
as: BFD (GNU Binutils for Ubuntu) 2.24 assertion fail ../../bfd/elf.c:2636
as: BFD (GNU Binutils for Ubuntu) 2.24 assertion fail ../../bfd/elf.c:2636
as: BFD (GNU Binutils for Ubuntu) 2.24 assertion fail ../../bfd/elf.c:2636
as: BFD (GNU Binutils for Ubuntu) 2.24 assertion fail ../../bfd/elf.c:2636
as: BFD (GNU Binutils for Ubuntu) 2.24 assertion fail ../../bfd/elf.c:2636
as: BFD (GNU Binutils for Ubuntu) 2.24 assertion fail ../../bfd/elf.c:2636
as: BFD (GNU Binutils for Ubuntu) 2.24 assertion fail ../../bfd/elf.c:2636
as: BFD (GNU Binutils for Ubuntu) 2.24 assertion fail ../../bfd/elf.c:2636
as: BFD (GNU Binutils for Ubuntu) 2.24 assertion fail ../../bfd/elf.c:2636
as: BFD (GNU Binutils for Ubuntu) 2.24 assertion fail ../../bfd/elf.c:2636
as: BFD (GNU Binutils for Ubuntu) 2.24 assertion fail ../../bfd/elf.c:2636
as: BFD (GNU Binutils for Ubuntu) 2.24 assertion fail ../../bfd/elf.c:2636
as: BFD (GNU Binutils for Ubuntu) 2.24 assertion fail ../../bfd/elf.c:2636
as: BFD (GNU Binutils for Ubuntu) 2.24 assertion fail ../../bfd/elf.c:2636
as: BFD (GNU Binutils for Ubuntu) 2.24 assertion fail ../../bfd/elf.c:2636
as: BFD (GNU Binutils for Ubuntu) 2.24 assertion fail ../../bfd/elf.c:2636
as: BFD (GNU Binutils for Ubuntu) 2.24 assertion fail ../../bfd/elf.c:2636
as: BFD (GNU Binutils for Ubuntu) 2.24 assertion fail ../../bfd/elf.c:2636
as: BFD (GNU Binutils for Ubuntu) 2.24 assertion fail ../../bfd/elf.c:2636
as: BFD (GNU Binutils for Ubuntu) 2.24 assertion fail ../../bfd/elf.c:2636
as: BFD (GNU Binutils for Ubuntu) 2.24 assertion fail ../../bfd/elf.c:2636
as: BFD (GNU Binutils for Ubuntu) 2.24 assertion fail ../../bfd/elf.c:2636
as: BFD (GNU Binutils for Ubuntu) 2.24 assertion fail ../../bfd/elf.c:2636
as: BFD (GNU Binutils for Ubuntu) 2.24 assertion fail ../../bfd/elf.c:2636
as: BFD (GNU Binutils for Ubuntu) 2.24 assertion fail ../../bfd/elf.c:2636
as: BFD (GNU Binutils for Ubuntu) 2.24 assertion fail ../../bfd/elf.c:2636
as: BFD (GNU Binutils for Ubuntu) 2.24 assertion fail ../../bfd/elf.c:2636
as: BFD (GNU Binutils for Ubuntu) 2.24 assertion fail ../../bfd/elf.c:2636
as: BFD (GNU Binutils for Ubuntu) 2.24 assertion fail ../../bfd/elf.c:2636
as: BFD (GNU Binutils for Ubuntu) 2.24 assertion fail ../../bfd/elf.c:2636
as: BFD (GNU Binutils for Ubuntu) 2.24 assertion fail ../../bfd/elf.c:2636
as: BFD (GNU Binutils for Ubuntu) 2.24 assertion fail ../../bfd/elf.c:2636
as: BFD (GNU Binutils for Ubuntu) 2.24 assertion fail ../../bfd/elf.c:2636
as: BFD (GNU Binutils for Ubuntu) 2.24 assertion fail ../../bfd/elf.c:2636
as: BFD (GNU Binutils for Ubuntu) 2.24 assertion fail ../../bfd/elf.c:2636
as: BFD (GNU Binutils for Ubuntu) 2.24 assertion fail ../../bfd/elf.c:2636
as: BFD (GNU Binutils for Ubuntu) 2.24 assertion fail ../../bfd/elf.c:2636
as: BFD (GNU Binutils for Ubuntu) 2.24 assertion fail ../../bfd/elf.c:2636
as: BFD (GNU Binutils for Ubuntu) 2.24 assertion fail ../../bfd/elf.c:2636
as: BFD (GNU Binutils for Ubuntu) 2.24 assertion fail ../../bfd/elf.c:2636
as: BFD (GNU Binutils for Ubuntu) 2.24 assertion fail ../../bfd/elf.c:2636
as: BFD (GNU Binutils for Ubuntu) 2.24 assertion fail ../../bfd/elf.c:2636
as: BFD (GNU Binutils for Ubuntu) 2.24 assertion fail ../../bfd/elf.c:2636
as: BFD (GNU Binutils for Ubuntu) 2.24 assertion fail ../../bfd/elf.c:2636
as: BFD (GNU Binutils for Ubuntu) 2.24 assertion fail ../../bfd/elf.c:2636
as: BFD (GNU Binutils for Ubuntu) 2.24 assertion fail ../../bfd/elf.c:2636
as: BFD (GNU Binutils for Ubuntu) 2.24 assertion fail ../../bfd/elf.c:2636
as: BFD (GNU Binutils for Ubuntu) 2.24 assertion fail ../../bfd/elf.c:2636
as: BFD (GNU Binutils for Ubuntu) 2.24 assertion fail ../../bfd/elf.c:2636
as: BFD (GNU Binutils for Ubuntu) 2.24 assertion fail ../../bfd/elf.c:2636
as: BFD (GNU Binutils for Ubuntu) 2.24 assertion fail ../../bfd/elf.c:2636
as: BFD (GNU Binutils for Ubuntu) 2.24 assertion fail ../../bfd/elf.c:2636
as: BFD (GNU Binutils for Ubuntu) 2.24 assertion fail ../../bfd/elf.c:2636
as: BFD (GNU Binutils for Ubuntu) 2.24 assertion fail ../../bfd/elf.c:2636
as: BFD (GNU Binutils for Ubuntu) 2.24 assertion fail ../../bfd/elf.c:2636
as: BFD (GNU Binutils for Ubuntu) 2.24 assertion fail ../../bfd/elf.c:2636
as: BFD (GNU Binutils for Ubuntu) 2.24 assertion fail ../../bfd/elf.c:2636
as: BFD (GNU Binutils for Ubuntu) 2.24 assertion fail ../../bfd/elf.c:2636
as: BFD (GNU Binutils for Ubuntu) 2.24 assertion fail ../../bfd/elf.c:2636
as: BFD (GNU Binutils for Ubuntu) 2.24 assertion fail ../../bfd/elf.c:2636
as: BFD (GNU Binutils for Ubuntu) 2.24 assertion fail ../../bfd/elf.c:2636
as: BFD (GNU Binutils for Ubuntu) 2.24 assertion fail ../../bfd/elf.c:2636
as: BFD (GNU Binutils for Ubuntu) 2.24 assertion fail ../../bfd/elf.c:2636
as: BFD (GNU Binutils for Ubuntu) 2.24 assertion fail ../../bfd/elf.c:2636
as: BFD (GNU Binutils for Ubuntu) 2.24 assertion fail ../../bfd/elf.c:2636
as: BFD (GNU Binutils for Ubuntu) 2.24 assertion fail ../../bfd/elf.c:2636
as: BFD (GNU Binutils for Ubuntu) 2.24 assertion fail ../../bfd/elf.c:2636
as: BFD (GNU Binutils for Ubuntu) 2.24 assertion fail ../../bfd/elf.c:2636
as: BFD (GNU Binutils for Ubuntu) 2.24 assertion fail ../../bfd/elf.c:2636
as: BFD (GNU Binutils for Ubuntu) 2.24 assertion fail ../../bfd/elf.c:2636
/tmp/ccmRagMR.s: Fatal error: can't close slave/containerizer/mesos/.libs/libmesos_no_3rdparty_la-containerizer.o:
No space left on device
make[3]: *** [slave/containerizer/mesos/libmesos_no_3rdparty_la-containerizer.lo] Error 1
make[3]: *** Waiting for unfinished jobs....
../../src/slave/containerizer/mesos/io/switchboard.cpp:1753:1: fatal error: error writing
to /tmp/cc3FQRc2.s: No space left on device
 } // namespace mesos {
 ^
compilation terminated.
mv -f slave/containerizer/mesos/provisioner/.deps/libmesos_no_3rdparty_la-paths.Tpo slave/containerizer/mesos/provisioner/.deps/libmesos_no_3rdparty_la-paths.Plo
mv -f slave/containerizer/mesos/isolators/posix/.deps/libmesos_no_3rdparty_la-disk.Tpo slave/containerizer/mesos/isolators/posix/.deps/libmesos_no_3rdparty_la-disk.Plo
The bug is not reproducible, so it is likely a hardware or OS problem.
make[3]: *** [slave/containerizer/mesos/isolators/posix/libmesos_no_3rdparty_la-rlimits.lo]
Error 1
The bug is not reproducible, so it is likely a hardware or OS problem.
make[3]: *** [slave/containerizer/mesos/isolators/volume/libmesos_no_3rdparty_la-sandbox_path.lo]
Error 1
The bug is not reproducible, so it is likely a hardware or OS problem.
make[3]: *** [slave/containerizer/mesos/io/libmesos_no_3rdparty_la-switchboard.lo] Error 1
make[3]: Leaving directory `/mesos/mesos-1.5.0/_build/src'
make[2]: *** [all] Error 2
make[2]: Leaving directory `/mesos/mesos-1.5.0/_build/src'
make[1]: *** [all-recursive] Error 1
make[1]: Leaving directory `/mesos/mesos-1.5.0/_build'
make: *** [distcheck] Error 1
+ docker rmi mesos-1503417889-1726
Untagged: mesos-1503417889-1726:latest
Deleted: sha256:64b5ba131da530af9f2021dede5db0c7abcb3a7b690e4eb2d10fac71b077223f
Deleted: sha256:108534bb3e31ce712990b32df51834922614d732a272890af52f7381a7dc9ee9
Deleted: sha256:0006d664f0e59b6fa2ad49bbeeb3da0844159047832cae1ed7771873b694f7ef
Deleted: sha256:728ed34c5a2e80c4f94ecfcaca247ae23dda1e2cd13ecd2c00c7860f5b663dd6
Deleted: sha256:588b5e04b7a0232b24eedbac15f83932f6e69691903f00e1e9936ecd9cf973a3
Deleted: sha256:ef308a873823fb9678b1fc0de944895773442fa78b0db161b05727452f8688db
Deleted: sha256:b1d5fbbb355ca614edd8cf98d8cefdeeeef4f77a5637561ff35021c7b017096e
Deleted: sha256:6651a1a912a6bfd0a32e647d929342bea68f9ebb426cd9aa822ffaa4b3d78094
Deleted: sha256:843ecb97f1e4b2fb8d420b3a288ed176aa11644cb83f3d078f8300506992f76e
Deleted: sha256:475bdec58b82ece1512114bcf884e8f8a3c8122f29ab4368c81a800211d82478
Deleted: sha256:0ed128d3ad2d46c18df24aef0f83a1fabab7d8195f2184a61334291d7137d119
Deleted: sha256:eca66557c5806fe71937d25a330bca89a5fff7d6db98e41c1d546cbe6c3305fa
Deleted: sha256:ffdf8b58006bc72b530970dc1d8f8058324947ba46cac6b593c74cab722f86d7
Deleted: sha256:fafc51bf9e77c4f04c84e3a22103aa415c039c618ee976fe23ad195c651a5acb
Deleted: sha256:f22e500566d68e5f458ca90f003f76a34ecc5ce921d958678becaafba402e18c
Deleted: sha256:5b2fbfb8a1a8c5f0acdd9f9290e1f72c963e9f1a999d51be4b5c84df40723b38
Deleted: sha256:25cfde2536074f5dd29352eaccd5e4bd4368a5a369feae258787c6859bd372b0
Deleted: sha256:4a67ef6923f40d2a872c4ba93e72743a65541d29b297b6ad6e20fc9d48739c70
Deleted: sha256:05b83ead6019122a5c10eaaf455bad73857af7afb7c3646c4b99e13fb4d19b71
Deleted: sha256:c9978c492fbd796da2a68bb94b585fc318a1e9006f03f45b292971c0669bcd64
Deleted: sha256:6d424c4eeebacf9e191e98e2768305b5995f7c52f824db8e208e82131984c7df
Deleted: sha256:16bbd87f26eb0d74546a52d2c0b0f00ccd321a0b0c8fba27cb1fb39d0b1f7df4
Deleted: sha256:06385b13180e8418b844c3ac50f1db0c7ddce2b98d7199e93c1ab8f32665abbf
Deleted: sha256:14174d3cb59235b9c2cb6dd83bc690d68476a94c913c1c5246d18c35bc2d4a51
Build step 'Execute shell' marked build as failure

Mime
View raw message