mesos-builds mailing list archives

Site index · List index
Message view « Date » · « Thread »
Top « Date » · « Thread »
From Apache Jenkins Server <jenk...@builds.apache.org>
Subject Build failed in Jenkins: Mesos-Buildbot » cmake,gcc,--verbose --enable-libevent --enable-ssl,GLOG_v=1 MESOS_VERBOSE=1,ubuntu:14.04,(ubuntu)&&(!ubuntu-us1)&&(!ubuntu-eu2) #4028
Date Tue, 01 Aug 2017 01:50:16 GMT
See <https://builds.apache.org/job/Mesos-Buildbot/BUILDTOOL=cmake,COMPILER=gcc,CONFIGURATION=--verbose%20--enable-libevent%20--enable-ssl,ENVIRONMENT=GLOG_v=1%20MESOS_VERBOSE=1,OS=ubuntu%3A14.04,label_exp=(ubuntu)&&(!ubuntu-us1)&&(!ubuntu-eu2)/4028/display/redirect>

------------------------------------------
[...truncated 1.52 MB...]
make[3]: Entering directory `/mesos/build'
cd /mesos/build && /usr/bin/cmake -E cmake_depends "Unix Makefiles" /mesos /mesos/src/examples /mesos/build /mesos/build/src/examples /mesos/build/src/examples/CMakeFiles/test-http-framework.dir/DependInfo.cmake --color=
Scanning dependencies of target test-http-framework
make[3]: Leaving directory `/mesos/build'
make -f src/examples/CMakeFiles/test-http-framework.dir/build.make src/examples/CMakeFiles/test-http-framework.dir/build
make[3]: Entering directory `/mesos/build'
/usr/bin/cmake -E cmake_progress_report /mesos/build/CMakeFiles 
[ 78%] Building CXX object src/examples/CMakeFiles/test-http-framework.dir/test_http_framework.cpp.o
cd /mesos/build/src/examples && /usr/bin/g++   -DBUILD_FLAGS=\"\" -DBUILD_JAVA_JVM_LIBRARY=\"\" -DHAS_AUTHENTICATION=1 -DLIBDIR=\"/usr/local/libmesos\" -DPICOJSON_USE_INT64 -DPKGDATADIR=\"/usr/local/share/mesos\" -DPKGLIBEXECDIR=\"/usr/local/libexec/mesos\" -DUSE_CMAKE_BUILD_CONFIG -DUSE_SSL_SOCKET=1 -DUSE_STATIC_LIB -DVERSION=\"1.4.0\" -D__STDC_FORMAT_MACROS -std=c++11 -fPIE -I/mesos/build/include -I/mesos/build/include/mesos -I/mesos/build/src -I/mesos/src -isystem /mesos/build/3rdparty/protobuf-3.3.0/src/protobuf-3.3.0-lib/lib/include -isystem /mesos/3rdparty/libprocess/include -isystem /usr/include/apr-1.0 -isystem /mesos/build/3rdparty/boost-1.53.0/src/boost-1.53.0 -isystem /mesos/build/3rdparty/elfio-3.2/src/elfio-3.2 -isystem /mesos/build/3rdparty/glog-0.3.3/src/glog-0.3.3-lib/lib/include -isystem /mesos/build/3rdparty/nvml-352.79/src/nvml-352.79 -isystem /mesos/build/3rdparty/picojson-1.3.0/src/picojson-1.3.0 -isystem /usr/include/subversion-1 -isystem /mesos/3rdparty/stout/include -isystem /mesos/build/3rdparty/http_parser-2.6.2/src/http_parser-2.6.2 -isystem /mesos/build/3rdparty/concurrentqueue-1.0.0-beta/src/concurrentqueue-1.0.0-beta -isystem /mesos/build/3rdparty/libevent-2.1.5-beta/src/libevent-2.1.5-beta-lib/lib/include -isystem /mesos/build/3rdparty/zookeeper-3.4.8/src/zookeeper-3.4.8/src/c/include -isystem /mesos/build/3rdparty/zookeeper-3.4.8/src/zookeeper-3.4.8/src/c/generated -isystem /mesos/build/3rdparty/leveldb-1.19/src/leveldb-1.19/include -I/mesos/include    -o CMakeFiles/test-http-framework.dir/test_http_framework.cpp.o -c /mesos/src/examples/test_http_framework.cpp
make[3]: Leaving directory `/mesos/build'
/usr/bin/cmake -E cmake_progress_report /mesos/build/CMakeFiles 
[ 78%] Built target test-executor
make -f src/slave/container_loggers/CMakeFiles/logrotate_container_logger.dir/build.make src/slave/container_loggers/CMakeFiles/logrotate_container_logger.dir/depend
make[3]: Entering directory `/mesos/build'
cd /mesos/build && /usr/bin/cmake -E cmake_depends "Unix Makefiles" /mesos /mesos/src/slave/container_loggers /mesos/build /mesos/build/src/slave/container_loggers /mesos/build/src/slave/container_loggers/CMakeFiles/logrotate_container_logger.dir/DependInfo.cmake --color=
make[3]: Leaving directory `/mesos/build'
/usr/bin/cmake -E cmake_progress_report /mesos/build/CMakeFiles 
[ 78%] Built target persistent-volume-framework
Scanning dependencies of target logrotate_container_logger
make[3]: Leaving directory `/mesos/build'
make -f src/slave/container_loggers/CMakeFiles/logrotate_container_logger.dir/build.make src/slave/container_loggers/CMakeFiles/logrotate_container_logger.dir/build
make[3]: Entering directory `/mesos/build'
/usr/bin/cmake -E cmake_progress_report /mesos/build/CMakeFiles 
[ 78%] Building CXX object src/slave/container_loggers/CMakeFiles/logrotate_container_logger.dir/lib_logrotate.cpp.o
cd /mesos/build/src/slave/container_loggers && /usr/bin/g++   -DBUILD_FLAGS=\"\" -DBUILD_JAVA_JVM_LIBRARY=\"\" -DHAS_AUTHENTICATION=1 -DLIBDIR=\"/usr/local/libmesos\" -DPICOJSON_USE_INT64 -DPKGDATADIR=\"/usr/local/share/mesos\" -DPKGLIBEXECDIR=\"/usr/local/libexec/mesos\" -DUSE_CMAKE_BUILD_CONFIG -DUSE_SSL_SOCKET=1 -DUSE_STATIC_LIB -DVERSION=\"1.4.0\" -D__STDC_FORMAT_MACROS -Dlogrotate_container_logger_EXPORTS -std=c++11 -fPIC -I/mesos/build/include -I/mesos/build/include/mesos -I/mesos/build/src -I/mesos/src -isystem /mesos/build/3rdparty/protobuf-3.3.0/src/protobuf-3.3.0-lib/lib/include -isystem /mesos/3rdparty/libprocess/include -isystem /usr/include/apr-1.0 -isystem /mesos/build/3rdparty/boost-1.53.0/src/boost-1.53.0 -isystem /mesos/build/3rdparty/elfio-3.2/src/elfio-3.2 -isystem /mesos/build/3rdparty/glog-0.3.3/src/glog-0.3.3-lib/lib/include -isystem /mesos/build/3rdparty/nvml-352.79/src/nvml-352.79 -isystem /mesos/build/3rdparty/picojson-1.3.0/src/picojson-1.3.0 -isystem /usr/include/subversion-1 -isystem /mesos/3rdparty/stout/include -isystem /mesos/build/3rdparty/http_parser-2.6.2/src/http_parser-2.6.2 -isystem /mesos/build/3rdparty/concurrentqueue-1.0.0-beta/src/concurrentqueue-1.0.0-beta -isystem /mesos/build/3rdparty/libevent-2.1.5-beta/src/libevent-2.1.5-beta-lib/lib/include -isystem /mesos/build/3rdparty/zookeeper-3.4.8/src/zookeeper-3.4.8/src/c/include -isystem /mesos/build/3rdparty/zookeeper-3.4.8/src/zookeeper-3.4.8/src/c/generated -isystem /mesos/build/3rdparty/leveldb-1.19/src/leveldb-1.19/include -I/mesos/include    -o CMakeFiles/logrotate_container_logger.dir/lib_logrotate.cpp.o -c /mesos/src/slave/container_loggers/lib_logrotate.cpp
make[3]: Leaving directory `/mesos/build'
/usr/bin/cmake -E cmake_progress_report /mesos/build/CMakeFiles  95
[ 78%] Built target test-framework
make[3]: Leaving directory `/mesos/build'
/usr/bin/cmake -E cmake_progress_report /mesos/build/CMakeFiles 
[ 78%] Built target long-lived-framework
make[3]: Leaving directory `/mesos/build'
/usr/bin/cmake -E cmake_progress_report /mesos/build/CMakeFiles 
[ 78%] Built target test-http-executor
Linking CXX executable ../test-http-framework
cd /mesos/build/src/examples && /usr/bin/cmake -E cmake_link_script CMakeFiles/test-http-framework.dir/link.txt --verbose=1
/usr/bin/g++    -std=c++11    CMakeFiles/test-http-framework.dir/test_http_framework.cpp.o  -o ../test-http-framework  -L/mesos/build/3rdparty/protobuf-3.3.0/src/protobuf-3.3.0-lib/lib/lib  -L/mesos/build/3rdparty/glog-0.3.3/src/glog-0.3.3-lib/lib/lib  -L/mesos/build/3rdparty/http_parser-2.6.2/src/http_parser-2.6.2-build  -L/mesos/build/3rdparty/libevent-2.1.5-beta/src/libevent-2.1.5-beta-lib/lib/lib  -L/mesos/build/3rdparty/zookeeper-3.4.8/src/zookeeper-3.4.8/src/c  -L/mesos/build/3rdparty/zookeeper-3.4.8/src/zookeeper-3.4.8/src/c/lib -rdynamic ../.libs/libmesos-1.4.0.so.1.4.0 ../libmesos-protobufs.so -lzookeeper_mt ../../3rdparty/libprocess/src/libprocess-0.0.1.so.0.0.1 -lapr-1 -lcurl -lglog -lsvn_delta-1 -lsvn_diff-1 -lsvn_subr-1 -lprotobuf -ldl -lapr-1 ../../3rdparty/leveldb-1.19/src/leveldb-1.19/out-static/libleveldb.a -lsasl2 -lrt -lhttp_parser -levent -lssl -lcrypto -lrt -lhttp_parser -levent -lssl -lcrypto -lz -lpthread -Wl,-rpath,/mesos/build/3rdparty/protobuf-3.3.0/src/protobuf-3.3.0-lib/lib/lib:/mesos/build/3rdparty/glog-0.3.3/src/glog-0.3.3-lib/lib/lib:/mesos/build/3rdparty/http_parser-2.6.2/src/http_parser-2.6.2-build:/mesos/build/3rdparty/libevent-2.1.5-beta/src/libevent-2.1.5-beta-lib/lib/lib:/mesos/build/3rdparty/zookeeper-3.4.8/src/zookeeper-3.4.8/src/c:/mesos/build/src/.libs:/mesos/build/src:/mesos/build/3rdparty/zookeeper-3.4.8/src/zookeeper-3.4.8/src/c/lib:/mesos/build/3rdparty/libprocess/src 
Linking CXX shared library ../../.libs/liblogrotate_container_logger.so
cd /mesos/build/src/slave/container_loggers && /usr/bin/cmake -E cmake_link_script CMakeFiles/logrotate_container_logger.dir/link.txt --verbose=1
/usr/bin/g++  -fPIC  -std=c++11   -shared -Wl,-soname,liblogrotate_container_logger.so -o ../../.libs/liblogrotate_container_logger.so CMakeFiles/logrotate_container_logger.dir/lib_logrotate.cpp.o  -L/mesos/build/3rdparty/protobuf-3.3.0/src/protobuf-3.3.0-lib/lib/lib  -L/mesos/build/3rdparty/glog-0.3.3/src/glog-0.3.3-lib/lib/lib  -L/mesos/build/3rdparty/http_parser-2.6.2/src/http_parser-2.6.2-build  -L/mesos/build/3rdparty/libevent-2.1.5-beta/src/libevent-2.1.5-beta-lib/lib/lib  -L/mesos/build/3rdparty/zookeeper-3.4.8/src/zookeeper-3.4.8/src/c  -L/mesos/build/3rdparty/zookeeper-3.4.8/src/zookeeper-3.4.8/src/c/lib ../../.libs/libmesos-1.4.0.so.1.4.0 ../../libmesos-protobufs.so -lzookeeper_mt ../../../3rdparty/libprocess/src/libprocess-0.0.1.so.0.0.1 -lapr-1 -lcurl -lglog -lsvn_delta-1 -lsvn_diff-1 -lsvn_subr-1 -lprotobuf -ldl -lapr-1 ../../../3rdparty/leveldb-1.19/src/leveldb-1.19/out-static/libleveldb.a -lsasl2 -lrt -lhttp_parser -levent -lssl -lcrypto -lrt -lhttp_parser -levent -lssl -lcrypto -lz -lpthread -Wl,-rpath,/mesos/build/3rdparty/protobuf-3.3.0/src/protobuf-3.3.0-lib/lib/lib:/mesos/build/3rdparty/glog-0.3.3/src/glog-0.3.3-lib/lib/lib:/mesos/build/3rdparty/http_parser-2.6.2/src/http_parser-2.6.2-build:/mesos/build/3rdparty/libevent-2.1.5-beta/src/libevent-2.1.5-beta-lib/lib/lib:/mesos/build/3rdparty/zookeeper-3.4.8/src/zookeeper-3.4.8/src/c:/mesos/build/src/.libs:/mesos/build/src:/mesos/build/3rdparty/zookeeper-3.4.8/src/zookeeper-3.4.8/src/c/lib:/mesos/build/3rdparty/libprocess/src 
make[3]: Leaving directory `/mesos/build'
/usr/bin/cmake -E cmake_progress_report /mesos/build/CMakeFiles 
[ 78%] Built target test-http-framework
make[3]: Leaving directory `/mesos/build'
/usr/bin/cmake -E cmake_progress_report /mesos/build/CMakeFiles 
[ 78%] Built target logrotate_container_logger
make -f CMakeFiles/mesos-and-binaries.dir/build.make CMakeFiles/mesos-and-binaries.dir/depend
make[3]: Entering directory `/mesos/build'
cd /mesos/build && /usr/bin/cmake -E cmake_depends "Unix Makefiles" /mesos /mesos /mesos/build /mesos/build /mesos/build/CMakeFiles/mesos-and-binaries.dir/DependInfo.cmake --color=
Scanning dependencies of target mesos-and-binaries
make[3]: Leaving directory `/mesos/build'
make -f CMakeFiles/mesos-and-binaries.dir/build.make CMakeFiles/mesos-and-binaries.dir/build
make[3]: Entering directory `/mesos/build'
make[3]: Nothing to be done for `CMakeFiles/mesos-and-binaries.dir/build'.
make[3]: Leaving directory `/mesos/build'
/usr/bin/cmake -E cmake_progress_report /mesos/build/CMakeFiles 
[ 78%] Built target mesos-and-binaries
make -f src/tests/CMakeFiles/test-helper.dir/build.make src/tests/CMakeFiles/test-helper.dir/depend
make[3]: Entering directory `/mesos/build'
cd /mesos/build && /usr/bin/cmake -E cmake_depends "Unix Makefiles" /mesos /mesos/src/tests /mesos/build /mesos/build/src/tests /mesos/build/src/tests/CMakeFiles/test-helper.dir/DependInfo.cmake --color=
Scanning dependencies of target test-helper
make[3]: Leaving directory `/mesos/build'
make -f src/tests/CMakeFiles/test-helper.dir/build.make src/tests/CMakeFiles/test-helper.dir/build
make[3]: Entering directory `/mesos/build'
/usr/bin/cmake -E cmake_progress_report /mesos/build/CMakeFiles 
[ 78%] /usr/bin/cmake -E cmake_progress_report /mesos/build/CMakeFiles 
/usr/bin/cmake -E cmake_progress_report /mesos/build/CMakeFiles 
/usr/bin/cmake -E cmake_progress_report /mesos/build/CMakeFiles 
[ 78%] [ 78%] Building CXX object src/tests/CMakeFiles/test-helper.dir/active_user_test_helper.cpp.o
[ 78%] cd /mesos/build/src/tests && /usr/bin/g++   -DBUILD_DIR=\"/mesos/build\" -DBUILD_FLAGS=\"\" -DBUILD_JAVA_JVM_LIBRARY=\"\" -DHAS_AUTHENTICATION=1 -DLIBDIR=\"/usr/local/libmesos\" -DPICOJSON_USE_INT64 -DPKGDATADIR=\"/usr/local/share/mesos\" -DPKGLIBEXECDIR=\"/usr/local/libexec/mesos\" -DPKGMODULEDIR=\"\" -DSBINDIR=\"\" -DSOURCE_DIR=\"/mesos\" -DTESTLIBEXECDIR=\"\" -DUSE_CMAKE_BUILD_CONFIG -DUSE_SSL_SOCKET=1 -DUSE_STATIC_LIB -DVERSION=\"1.4.0\" -D__STDC_FORMAT_MACROS -std=c++11 -fPIE -I/mesos/build/include -I/mesos/build/include/mesos -I/mesos/build/src -I/mesos/src -isystem /mesos/build/3rdparty/protobuf-3.3.0/src/protobuf-3.3.0-lib/lib/include -isystem /mesos/3rdparty/libprocess/include -isystem /usr/include/apr-1.0 -isystem /mesos/build/3rdparty/boost-1.53.0/src/boost-1.53.0 -isystem /mesos/build/3rdparty/elfio-3.2/src/elfio-3.2 -isystem /mesos/build/3rdparty/glog-0.3.3/src/glog-0.3.3-lib/lib/include -isystem /mesos/build/3rdparty/nvml-352.79/src/nvml-352.79 -isystem /mesos/build/3rdparty/picojson-1.3.0/src/picojson-1.3.0 -isystem /usr/include/subversion-1 -isystem /mesos/3rdparty/stout/include -isystem /mesos/build/3rdparty/http_parser-2.6.2/src/http_parser-2.6.2 -isystem /mesos/build/3rdparty/concurrentqueue-1.0.0-beta/src/concurrentqueue-1.0.0-beta -isystem /mesos/build/3rdparty/libevent-2.1.5-beta/src/libevent-2.1.5-beta-lib/lib/include -isystem /mesos/build/3rdparty/zookeeper-3.4.8/src/zookeeper-3.4.8/src/c/include -isystem /mesos/build/3rdparty/zookeeper-3.4.8/src/zookeeper-3.4.8/src/c/generated -isystem /mesos/build/3rdparty/leveldb-1.19/src/leveldb-1.19/include -I/mesos/include -isystem /mesos/build/3rdparty/googletest-1.8.0/src/googletest-1.8.0/googlemock/include -isystem /mesos/build/3rdparty/googletest-1.8.0/src/googletest-1.8.0/googletest/include    -o CMakeFiles/test-helper.dir/active_user_test_helper.cpp.o -c /mesos/src/tests/active_user_test_helper.cpp
Building CXX object src/tests/CMakeFiles/test-helper.dir/flags.cpp.o
cd /mesos/build/src/tests && /usr/bin/g++   -DBUILD_DIR=\"/mesos/build\" -DBUILD_FLAGS=\"\" -DBUILD_JAVA_JVM_LIBRARY=\"\" -DHAS_AUTHENTICATION=1 -DLIBDIR=\"/usr/local/libmesos\" -DPICOJSON_USE_INT64 -DPKGDATADIR=\"/usr/local/share/mesos\" -DPKGLIBEXECDIR=\"/usr/local/libexec/mesos\" -DPKGMODULEDIR=\"\" -DSBINDIR=\"\" -DSOURCE_DIR=\"/mesos\" -DTESTLIBEXECDIR=\"\" -DUSE_CMAKE_BUILD_CONFIG -DUSE_SSL_SOCKET=1 -DUSE_STATIC_LIB -DVERSION=\"1.4.0\" -D__STDC_FORMAT_MACROS -std=c++11 -fPIE -I/mesos/build/include -I/mesos/build/include/mesos -I/mesos/build/src -I/mesos/src -isystem /mesos/build/3rdparty/protobuf-3.3.0/src/protobuf-3.3.0-lib/lib/include -isystem /mesos/3rdparty/libprocess/include -isystem /usr/include/apr-1.0 -isystem /mesos/build/3rdparty/boost-1.53.0/src/boost-1.53.0 -isystem /mesos/build/3rdparty/elfio-3.2/src/elfio-3.2 -isystem /mesos/build/3rdparty/glog-0.3.3/src/glog-0.3.3-lib/lib/include -isystem /mesos/build/3rdparty/nvml-352.79/src/nvml-352.79 -isystem /mesos/build/3rdparty/picojson-1.3.0/src/picojson-1.3.0 -isystem /usr/include/subversion-1 -isystem /mesos/3rdparty/stout/include -isystem /mesos/build/3rdparty/http_parser-2.6.2/src/http_parser-2.6.2 -isystem /mesos/build/3rdparty/concurrentqueue-1.0.0-beta/src/concurrentqueue-1.0.0-beta -isystem /mesos/build/3rdparty/libevent-2.1.5-beta/src/libevent-2.1.5-beta-lib/lib/include -isystem /mesos/build/3rdparty/zookeeper-3.4.8/src/zookeeper-3.4.8/src/c/include -isystem /mesos/build/3rdparty/zookeeper-3.4.8/src/zookeeper-3.4.8/src/c/generated -isystem /mesos/build/3rdparty/leveldb-1.19/src/leveldb-1.19/include -I/mesos/include -isystem /mesos/build/3rdparty/googletest-1.8.0/src/googletest-1.8.0/googlemock/include -isystem /mesos/build/3rdparty/googletest-1.8.0/src/googletest-1.8.0/googletest/include    -o CMakeFiles/test-helper.dir/flags.cpp.o -c /mesos/src/tests/flags.cpp
Building CXX object src/tests/CMakeFiles/test-helper.dir/http_server_test_helper.cpp.o
Building CXX object src/tests/CMakeFiles/test-helper.dir/resources_utils.cpp.o
cd /mesos/build/src/tests && /usr/bin/g++   -DBUILD_DIR=\"/mesos/build\" -DBUILD_FLAGS=\"\" -DBUILD_JAVA_JVM_LIBRARY=\"\" -DHAS_AUTHENTICATION=1 -DLIBDIR=\"/usr/local/libmesos\" -DPICOJSON_USE_INT64 -DPKGDATADIR=\"/usr/local/share/mesos\" -DPKGLIBEXECDIR=\"/usr/local/libexec/mesos\" -DPKGMODULEDIR=\"\" -DSBINDIR=\"\" -DSOURCE_DIR=\"/mesos\" -DTESTLIBEXECDIR=\"\" -DUSE_CMAKE_BUILD_CONFIG -DUSE_SSL_SOCKET=1 -DUSE_STATIC_LIB -DVERSION=\"1.4.0\" -D__STDC_FORMAT_MACROS -std=c++11 -fPIE -I/mesos/build/include -I/mesos/build/include/mesos -I/mesos/build/src -I/mesos/src -isystem /mesos/build/3rdparty/protobuf-3.3.0/src/protobuf-3.3.0-lib/lib/include -isystem /mesos/3rdparty/libprocess/include -isystem /usr/include/apr-1.0 -isystem /mesos/build/3rdparty/boost-1.53.0/src/boost-1.53.0 -isystem /mesos/build/3rdparty/elfio-3.2/src/elfio-3.2 -isystem /mesos/build/3rdparty/glog-0.3.3/src/glog-0.3.3-lib/lib/include -isystem /mesos/build/3rdparty/nvml-352.79/src/nvml-352.79 -isystem /mesos/build/3rdparty/picojson-1.3.0/src/picojson-1.3.0 -isystem /usr/include/subversion-1 -isystem /mesos/3rdparty/stout/include -isystem /mesos/build/3rdparty/http_parser-2.6.2/src/http_parser-2.6.2 -isystem /mesos/build/3rdparty/concurrentqueue-1.0.0-beta/src/concurrentqueue-1.0.0-beta -isystem /mesos/build/3rdparty/libevent-2.1.5-beta/src/libevent-2.1.5-beta-lib/lib/include -isystem /mesos/build/3rdparty/zookeeper-3.4.8/src/zookeeper-3.4.8/src/c/include -isystem /mesos/build/3rdparty/zookeeper-3.4.8/src/zookeeper-3.4.8/src/c/generated -isystem /mesos/build/3rdparty/leveldb-1.19/src/leveldb-1.19/include -I/mesos/include -isystem /mesos/build/3rdparty/googletest-1.8.0/src/googletest-1.8.0/googlemock/include -isystem /mesos/build/3rdparty/googletest-1.8.0/src/googletest-1.8.0/googletest/include    -o CMakeFiles/test-helper.dir/http_server_test_helper.cpp.o -c /mesos/src/tests/http_server_test_helper.cpp
cd /mesos/build/src/tests && /usr/bin/g++   -DBUILD_DIR=\"/mesos/build\" -DBUILD_FLAGS=\"\" -DBUILD_JAVA_JVM_LIBRARY=\"\" -DHAS_AUTHENTICATION=1 -DLIBDIR=\"/usr/local/libmesos\" -DPICOJSON_USE_INT64 -DPKGDATADIR=\"/usr/local/share/mesos\" -DPKGLIBEXECDIR=\"/usr/local/libexec/mesos\" -DPKGMODULEDIR=\"\" -DSBINDIR=\"\" -DSOURCE_DIR=\"/mesos\" -DTESTLIBEXECDIR=\"\" -DUSE_CMAKE_BUILD_CONFIG -DUSE_SSL_SOCKET=1 -DUSE_STATIC_LIB -DVERSION=\"1.4.0\" -D__STDC_FORMAT_MACROS -std=c++11 -fPIE -I/mesos/build/include -I/mesos/build/include/mesos -I/mesos/build/src -I/mesos/src -isystem /mesos/build/3rdparty/protobuf-3.3.0/src/protobuf-3.3.0-lib/lib/include -isystem /mesos/3rdparty/libprocess/include -isystem /usr/include/apr-1.0 -isystem /mesos/build/3rdparty/boost-1.53.0/src/boost-1.53.0 -isystem /mesos/build/3rdparty/elfio-3.2/src/elfio-3.2 -isystem /mesos/build/3rdparty/glog-0.3.3/src/glog-0.3.3-lib/lib/include -isystem /mesos/build/3rdparty/nvml-352.79/src/nvml-352.79 -isystem /mesos/build/3rdparty/picojson-1.3.0/src/picojson-1.3.0 -isystem /usr/include/subversion-1 -isystem /mesos/3rdparty/stout/include -isystem /mesos/build/3rdparty/http_parser-2.6.2/src/http_parser-2.6.2 -isystem /mesos/build/3rdparty/concurrentqueue-1.0.0-beta/src/concurrentqueue-1.0.0-beta -isystem /mesos/build/3rdparty/libevent-2.1.5-beta/src/libevent-2.1.5-beta-lib/lib/include -isystem /mesos/build/3rdparty/zookeeper-3.4.8/src/zookeeper-3.4.8/src/c/include -isystem /mesos/build/3rdparty/zookeeper-3.4.8/src/zookeeper-3.4.8/src/c/generated -isystem /mesos/build/3rdparty/leveldb-1.19/src/leveldb-1.19/include -I/mesos/include -isystem /mesos/build/3rdparty/googletest-1.8.0/src/googletest-1.8.0/googlemock/include -isystem /mesos/build/3rdparty/googletest-1.8.0/src/googletest-1.8.0/googletest/include    -o CMakeFiles/test-helper.dir/resources_utils.cpp.o -c /mesos/src/tests/resources_utils.cpp
/usr/bin/cmake -E cmake_progress_report /mesos/build/CMakeFiles 
[ 78%] /usr/bin/cmake -E cmake_progress_report /mesos/build/CMakeFiles 96
[ 79%] Building CXX object src/tests/CMakeFiles/test-helper.dir/test_helper_main.cpp.o
cd /mesos/build/src/tests && /usr/bin/g++   -DBUILD_DIR=\"/mesos/build\" -DBUILD_FLAGS=\"\" -DBUILD_JAVA_JVM_LIBRARY=\"\" -DHAS_AUTHENTICATION=1 -DLIBDIR=\"/usr/local/libmesos\" -DPICOJSON_USE_INT64 -DPKGDATADIR=\"/usr/local/share/mesos\" -DPKGLIBEXECDIR=\"/usr/local/libexec/mesos\" -DPKGMODULEDIR=\"\" -DSBINDIR=\"\" -DSOURCE_DIR=\"/mesos\" -DTESTLIBEXECDIR=\"\" -DUSE_CMAKE_BUILD_CONFIG -DUSE_SSL_SOCKET=1 -DUSE_STATIC_LIB -DVERSION=\"1.4.0\" -D__STDC_FORMAT_MACROS -std=c++11 -fPIE -I/mesos/build/include -I/mesos/build/include/mesos -I/mesos/build/src -I/mesos/src -isystem /mesos/build/3rdparty/protobuf-3.3.0/src/protobuf-3.3.0-lib/lib/include -isystem /mesos/3rdparty/libprocess/include -isystem /usr/include/apr-1.0 -isystem /mesos/build/3rdparty/boost-1.53.0/src/boost-1.53.0 -isystem /mesos/build/3rdparty/elfio-3.2/src/elfio-3.2 -isystem /mesos/build/3rdparty/glog-0.3.3/src/glog-0.3.3-lib/lib/include -isystem /mesos/build/3rdparty/nvml-352.79/src/nvml-352.79 -isystem /mesos/build/3rdparty/picojson-1.3.0/src/picojson-1.3.0 -isystem /usr/include/subversion-1 -isystem /mesos/3rdparty/stout/include -isystem /mesos/build/3rdparty/http_parser-2.6.2/src/http_parser-2.6.2 -isystem /mesos/build/3rdparty/concurrentqueue-1.0.0-beta/src/concurrentqueue-1.0.0-beta -isystem /mesos/build/3rdparty/libevent-2.1.5-beta/src/libevent-2.1.5-beta-lib/lib/include -isystem /mesos/build/3rdparty/zookeeper-3.4.8/src/zookeeper-3.4.8/src/c/include -isystem /mesos/build/3rdparty/zookeeper-3.4.8/src/zookeeper-3.4.8/src/c/generated -isystem /mesos/build/3rdparty/leveldb-1.19/src/leveldb-1.19/include -I/mesos/include -isystem /mesos/build/3rdparty/googletest-1.8.0/src/googletest-1.8.0/googlemock/include -isystem /mesos/build/3rdparty/googletest-1.8.0/src/googletest-1.8.0/googletest/include    -o CMakeFiles/test-helper.dir/test_helper_main.cpp.o -c /mesos/src/tests/test_helper_main.cpp
Building CXX object src/tests/CMakeFiles/test-helper.dir/utils.cpp.o
cd /mesos/build/src/tests && /usr/bin/g++   -DBUILD_DIR=\"/mesos/build\" -DBUILD_FLAGS=\"\" -DBUILD_JAVA_JVM_LIBRARY=\"\" -DHAS_AUTHENTICATION=1 -DLIBDIR=\"/usr/local/libmesos\" -DPICOJSON_USE_INT64 -DPKGDATADIR=\"/usr/local/share/mesos\" -DPKGLIBEXECDIR=\"/usr/local/libexec/mesos\" -DPKGMODULEDIR=\"\" -DSBINDIR=\"\" -DSOURCE_DIR=\"/mesos\" -DTESTLIBEXECDIR=\"\" -DUSE_CMAKE_BUILD_CONFIG -DUSE_SSL_SOCKET=1 -DUSE_STATIC_LIB -DVERSION=\"1.4.0\" -D__STDC_FORMAT_MACROS -std=c++11 -fPIE -I/mesos/build/include -I/mesos/build/include/mesos -I/mesos/build/src -I/mesos/src -isystem /mesos/build/3rdparty/protobuf-3.3.0/src/protobuf-3.3.0-lib/lib/include -isystem /mesos/3rdparty/libprocess/include -isystem /usr/include/apr-1.0 -isystem /mesos/build/3rdparty/boost-1.53.0/src/boost-1.53.0 -isystem /mesos/build/3rdparty/elfio-3.2/src/elfio-3.2 -isystem /mesos/build/3rdparty/glog-0.3.3/src/glog-0.3.3-lib/lib/include -isystem /mesos/build/3rdparty/nvml-352.79/src/nvml-352.79 -isystem /mesos/build/3rdparty/picojson-1.3.0/src/picojson-1.3.0 -isystem /usr/include/subversion-1 -isystem /mesos/3rdparty/stout/include -isystem /mesos/build/3rdparty/http_parser-2.6.2/src/http_parser-2.6.2 -isystem /mesos/build/3rdparty/concurrentqueue-1.0.0-beta/src/concurrentqueue-1.0.0-beta -isystem /mesos/build/3rdparty/libevent-2.1.5-beta/src/libevent-2.1.5-beta-lib/lib/include -isystem /mesos/build/3rdparty/zookeeper-3.4.8/src/zookeeper-3.4.8/src/c/include -isystem /mesos/build/3rdparty/zookeeper-3.4.8/src/zookeeper-3.4.8/src/c/generated -isystem /mesos/build/3rdparty/leveldb-1.19/src/leveldb-1.19/include -I/mesos/include -isystem /mesos/build/3rdparty/googletest-1.8.0/src/googletest-1.8.0/googlemock/include -isystem /mesos/build/3rdparty/googletest-1.8.0/src/googletest-1.8.0/googletest/include    -o CMakeFiles/test-helper.dir/utils.cpp.o -c /mesos/src/tests/utils.cpp
/usr/bin/cmake -E cmake_progress_report /mesos/build/CMakeFiles 
[ 79%] Building CXX object src/tests/CMakeFiles/test-helper.dir/kill_policy_test_helper.cpp.o
cd /mesos/build/src/tests && /usr/bin/g++   -DBUILD_DIR=\"/mesos/build\" -DBUILD_FLAGS=\"\" -DBUILD_JAVA_JVM_LIBRARY=\"\" -DHAS_AUTHENTICATION=1 -DLIBDIR=\"/usr/local/libmesos\" -DPICOJSON_USE_INT64 -DPKGDATADIR=\"/usr/local/share/mesos\" -DPKGLIBEXECDIR=\"/usr/local/libexec/mesos\" -DPKGMODULEDIR=\"\" -DSBINDIR=\"\" -DSOURCE_DIR=\"/mesos\" -DTESTLIBEXECDIR=\"\" -DUSE_CMAKE_BUILD_CONFIG -DUSE_SSL_SOCKET=1 -DUSE_STATIC_LIB -DVERSION=\"1.4.0\" -D__STDC_FORMAT_MACROS -std=c++11 -fPIE -I/mesos/build/include -I/mesos/build/include/mesos -I/mesos/build/src -I/mesos/src -isystem /mesos/build/3rdparty/protobuf-3.3.0/src/protobuf-3.3.0-lib/lib/include -isystem /mesos/3rdparty/libprocess/include -isystem /usr/include/apr-1.0 -isystem /mesos/build/3rdparty/boost-1.53.0/src/boost-1.53.0 -isystem /mesos/build/3rdparty/elfio-3.2/src/elfio-3.2 -isystem /mesos/build/3rdparty/glog-0.3.3/src/glog-0.3.3-lib/lib/include -isystem /mesos/build/3rdparty/nvml-352.79/src/nvml-352.79 -isystem /mesos/build/3rdparty/picojson-1.3.0/src/picojson-1.3.0 -isystem /usr/include/subversion-1 -isystem /mesos/3rdparty/stout/include -isystem /mesos/build/3rdparty/http_parser-2.6.2/src/http_parser-2.6.2 -isystem /mesos/build/3rdparty/concurrentqueue-1.0.0-beta/src/concurrentqueue-1.0.0-beta -isystem /mesos/build/3rdparty/libevent-2.1.5-beta/src/libevent-2.1.5-beta-lib/lib/include -isystem /mesos/build/3rdparty/zookeeper-3.4.8/src/zookeeper-3.4.8/src/c/include -isystem /mesos/build/3rdparty/zookeeper-3.4.8/src/zookeeper-3.4.8/src/c/generated -isystem /mesos/build/3rdparty/leveldb-1.19/src/leveldb-1.19/include -I/mesos/include -isystem /mesos/build/3rdparty/googletest-1.8.0/src/googletest-1.8.0/googlemock/include -isystem /mesos/build/3rdparty/googletest-1.8.0/src/googletest-1.8.0/googletest/include    -o CMakeFiles/test-helper.dir/kill_policy_test_helper.cpp.o -c /mesos/src/tests/kill_policy_test_helper.cpp
/usr/bin/cmake -E cmake_progress_report /mesos/build/CMakeFiles 
[ 79%] Building CXX object src/tests/CMakeFiles/test-helper.dir/containerizer/memory_test_helper.cpp.o
cd /mesos/build/src/tests && /usr/bin/g++   -DBUILD_DIR=\"/mesos/build\" -DBUILD_FLAGS=\"\" -DBUILD_JAVA_JVM_LIBRARY=\"\" -DHAS_AUTHENTICATION=1 -DLIBDIR=\"/usr/local/libmesos\" -DPICOJSON_USE_INT64 -DPKGDATADIR=\"/usr/local/share/mesos\" -DPKGLIBEXECDIR=\"/usr/local/libexec/mesos\" -DPKGMODULEDIR=\"\" -DSBINDIR=\"\" -DSOURCE_DIR=\"/mesos\" -DTESTLIBEXECDIR=\"\" -DUSE_CMAKE_BUILD_CONFIG -DUSE_SSL_SOCKET=1 -DUSE_STATIC_LIB -DVERSION=\"1.4.0\" -D__STDC_FORMAT_MACROS -std=c++11 -fPIE -I/mesos/build/include -I/mesos/build/include/mesos -I/mesos/build/src -I/mesos/src -isystem /mesos/build/3rdparty/protobuf-3.3.0/src/protobuf-3.3.0-lib/lib/include -isystem /mesos/3rdparty/libprocess/include -isystem /usr/include/apr-1.0 -isystem /mesos/build/3rdparty/boost-1.53.0/src/boost-1.53.0 -isystem /mesos/build/3rdparty/elfio-3.2/src/elfio-3.2 -isystem /mesos/build/3rdparty/glog-0.3.3/src/glog-0.3.3-lib/lib/include -isystem /mesos/build/3rdparty/nvml-352.79/src/nvml-352.79 -isystem /mesos/build/3rdparty/picojson-1.3.0/src/picojson-1.3.0 -isystem /usr/include/subversion-1 -isystem /mesos/3rdparty/stout/include -isystem /mesos/build/3rdparty/http_parser-2.6.2/src/http_parser-2.6.2 -isystem /mesos/build/3rdparty/concurrentqueue-1.0.0-beta/src/concurrentqueue-1.0.0-beta -isystem /mesos/build/3rdparty/libevent-2.1.5-beta/src/libevent-2.1.5-beta-lib/lib/include -isystem /mesos/build/3rdparty/zookeeper-3.4.8/src/zookeeper-3.4.8/src/c/include -isystem /mesos/build/3rdparty/zookeeper-3.4.8/src/zookeeper-3.4.8/src/c/generated -isystem /mesos/build/3rdparty/leveldb-1.19/src/leveldb-1.19/include -I/mesos/include -isystem /mesos/build/3rdparty/googletest-1.8.0/src/googletest-1.8.0/googlemock/include -isystem /mesos/build/3rdparty/googletest-1.8.0/src/googletest-1.8.0/googletest/include    -o CMakeFiles/test-helper.dir/containerizer/memory_test_helper.cpp.o -c /mesos/src/tests/containerizer/memory_test_helper.cpp
/usr/bin/cmake -E cmake_progress_report /mesos/build/CMakeFiles 
[ 79%] Building CXX object src/tests/CMakeFiles/test-helper.dir/containerizer/capabilities_test_helper.cpp.o
cd /mesos/build/src/tests && /usr/bin/g++   -DBUILD_DIR=\"/mesos/build\" -DBUILD_FLAGS=\"\" -DBUILD_JAVA_JVM_LIBRARY=\"\" -DHAS_AUTHENTICATION=1 -DLIBDIR=\"/usr/local/libmesos\" -DPICOJSON_USE_INT64 -DPKGDATADIR=\"/usr/local/share/mesos\" -DPKGLIBEXECDIR=\"/usr/local/libexec/mesos\" -DPKGMODULEDIR=\"\" -DSBINDIR=\"\" -DSOURCE_DIR=\"/mesos\" -DTESTLIBEXECDIR=\"\" -DUSE_CMAKE_BUILD_CONFIG -DUSE_SSL_SOCKET=1 -DUSE_STATIC_LIB -DVERSION=\"1.4.0\" -D__STDC_FORMAT_MACROS -std=c++11 -fPIE -I/mesos/build/include -I/mesos/build/include/mesos -I/mesos/build/src -I/mesos/src -isystem /mesos/build/3rdparty/protobuf-3.3.0/src/protobuf-3.3.0-lib/lib/include -isystem /mesos/3rdparty/libprocess/include -isystem /usr/include/apr-1.0 -isystem /mesos/build/3rdparty/boost-1.53.0/src/boost-1.53.0 -isystem /mesos/build/3rdparty/elfio-3.2/src/elfio-3.2 -isystem /mesos/build/3rdparty/glog-0.3.3/src/glog-0.3.3-lib/lib/include -isystem /mesos/build/3rdparty/nvml-352.79/src/nvml-352.79 -isystem /mesos/build/3rdparty/picojson-1.3.0/src/picojson-1.3.0 -isystem /usr/include/subversion-1 -isystem /mesos/3rdparty/stout/include -isystem /mesos/build/3rdparty/http_parser-2.6.2/src/http_parser-2.6.2 -isystem /mesos/build/3rdparty/concurrentqueue-1.0.0-beta/src/concurrentqueue-1.0.0-beta -isystem /mesos/build/3rdparty/libevent-2.1.5-beta/src/libevent-2.1.5-beta-lib/lib/include -isystem /mesos/build/3rdparty/zookeeper-3.4.8/src/zookeeper-3.4.8/src/c/include -isystem /mesos/build/3rdparty/zookeeper-3.4.8/src/zookeeper-3.4.8/src/c/generated -isystem /mesos/build/3rdparty/leveldb-1.19/src/leveldb-1.19/include -I/mesos/include -isystem /mesos/build/3rdparty/googletest-1.8.0/src/googletest-1.8.0/googlemock/include -isystem /mesos/build/3rdparty/googletest-1.8.0/src/googletest-1.8.0/googletest/include    -o CMakeFiles/test-helper.dir/containerizer/capabilities_test_helper.cpp.o -c /mesos/src/tests/containerizer/capabilities_test_helper.cpp
/usr/bin/cmake -E cmake_progress_report /mesos/build/CMakeFiles 
[ 79%] Building CXX object src/tests/CMakeFiles/test-helper.dir/containerizer/setns_test_helper.cpp.o
cd /mesos/build/src/tests && /usr/bin/g++   -DBUILD_DIR=\"/mesos/build\" -DBUILD_FLAGS=\"\" -DBUILD_JAVA_JVM_LIBRARY=\"\" -DHAS_AUTHENTICATION=1 -DLIBDIR=\"/usr/local/libmesos\" -DPICOJSON_USE_INT64 -DPKGDATADIR=\"/usr/local/share/mesos\" -DPKGLIBEXECDIR=\"/usr/local/libexec/mesos\" -DPKGMODULEDIR=\"\" -DSBINDIR=\"\" -DSOURCE_DIR=\"/mesos\" -DTESTLIBEXECDIR=\"\" -DUSE_CMAKE_BUILD_CONFIG -DUSE_SSL_SOCKET=1 -DUSE_STATIC_LIB -DVERSION=\"1.4.0\" -D__STDC_FORMAT_MACROS -std=c++11 -fPIE -I/mesos/build/include -I/mesos/build/include/mesos -I/mesos/build/src -I/mesos/src -isystem /mesos/build/3rdparty/protobuf-3.3.0/src/protobuf-3.3.0-lib/lib/include -isystem /mesos/3rdparty/libprocess/include -isystem /usr/include/apr-1.0 -isystem /mesos/build/3rdparty/boost-1.53.0/src/boost-1.53.0 -isystem /mesos/build/3rdparty/elfio-3.2/src/elfio-3.2 -isystem /mesos/build/3rdparty/glog-0.3.3/src/glog-0.3.3-lib/lib/include -isystem /mesos/build/3rdparty/nvml-352.79/src/nvml-352.79 -isystem /mesos/build/3rdparty/picojson-1.3.0/src/picojson-1.3.0 -isystem /usr/include/subversion-1 -isystem /mesos/3rdparty/stout/include -isystem /mesos/build/3rdparty/http_parser-2.6.2/src/http_parser-2.6.2 -isystem /mesos/build/3rdparty/concurrentqueue-1.0.0-beta/src/concurrentqueue-1.0.0-beta -isystem /mesos/build/3rdparty/libevent-2.1.5-beta/src/libevent-2.1.5-beta-lib/lib/include -isystem /mesos/build/3rdparty/zookeeper-3.4.8/src/zookeeper-3.4.8/src/c/include -isystem /mesos/build/3rdparty/zookeeper-3.4.8/src/zookeeper-3.4.8/src/c/generated -isystem /mesos/build/3rdparty/leveldb-1.19/src/leveldb-1.19/include -I/mesos/include -isystem /mesos/build/3rdparty/googletest-1.8.0/src/googletest-1.8.0/googlemock/include -isystem /mesos/build/3rdparty/googletest-1.8.0/src/googletest-1.8.0/googletest/include    -o CMakeFiles/test-helper.dir/containerizer/setns_test_helper.cpp.o -c /mesos/src/tests/containerizer/setns_test_helper.cpp
Linking CXX executable ../test-helper
cd /mesos/build/src/tests && /usr/bin/cmake -E cmake_link_script CMakeFiles/test-helper.dir/link.txt --verbose=1
/usr/bin/g++    -std=c++11    CMakeFiles/test-helper.dir/active_user_test_helper.cpp.o CMakeFiles/test-helper.dir/flags.cpp.o CMakeFiles/test-helper.dir/http_server_test_helper.cpp.o CMakeFiles/test-helper.dir/resources_utils.cpp.o CMakeFiles/test-helper.dir/test_helper_main.cpp.o CMakeFiles/test-helper.dir/utils.cpp.o CMakeFiles/test-helper.dir/kill_policy_test_helper.cpp.o CMakeFiles/test-helper.dir/containerizer/memory_test_helper.cpp.o CMakeFiles/test-helper.dir/containerizer/capabilities_test_helper.cpp.o CMakeFiles/test-helper.dir/containerizer/setns_test_helper.cpp.o  -o ../test-helper  -L/mesos/build/3rdparty/protobuf-3.3.0/src/protobuf-3.3.0-lib/lib/lib  -L/mesos/build/3rdparty/glog-0.3.3/src/glog-0.3.3-lib/lib/lib  -L/mesos/build/3rdparty/http_parser-2.6.2/src/http_parser-2.6.2-build  -L/mesos/build/3rdparty/libevent-2.1.5-beta/src/libevent-2.1.5-beta-lib/lib/lib  -L/mesos/build/3rdparty/zookeeper-3.4.8/src/zookeeper-3.4.8/src/c  -L/mesos/build/3rdparty/googletest-1.8.0/src/googletest-1.8.0-lib/lib  -L/mesos/build/3rdparty/googletest-1.8.0/src/googletest-1.8.0-lib/lib/gtest  -L/mesos/build/3rdparty/zookeeper-3.4.8/src/zookeeper-3.4.8/src/c/lib -rdynamic ../.libs/libmesos-1.4.0.so.1.4.0 ../../3rdparty/libprocess/src/libprocess-0.0.1.so.0.0.1 -lgmock -lgtest ../.libs/libload_qos_controller.so ../.libs/libfixed_resource_estimator.so ../.libs/liblogrotate_container_logger.so ../.libs/libmesos-1.4.0.so.1.4.0 ../../3rdparty/libprocess/src/libprocess-0.0.1.so.0.0.1 ../libmesos-protobufs.so -lapr-1 -lcurl -lglog -lsvn_delta-1 -lsvn_diff-1 -lsvn_subr-1 -lprotobuf -ldl -lapr-1 -lzookeeper_mt ../../3rdparty/leveldb-1.19/src/leveldb-1.19/out-static/libleveldb.a -lsasl2 -lrt -lhttp_parser -levent -lssl -lcrypto -lrt -lhttp_parser -levent -lssl -lcrypto -lz -lpthread -Wl,-rpath,/mesos/build/3rdparty/protobuf-3.3.0/src/protobuf-3.3.0-lib/lib/lib:/mesos/build/3rdparty/glog-0.3.3/src/glog-0.3.3-lib/lib/lib:/mesos/build/3rdparty/http_parser-2.6.2/src/http_parser-2.6.2-build:/mesos/build/3rdparty/libevent-2.1.5-beta/src/libevent-2.1.5-beta-lib/lib/lib:/mesos/build/3rdparty/zookeeper-3.4.8/src/zookeeper-3.4.8/src/c:/mesos/build/3rdparty/googletest-1.8.0/src/googletest-1.8.0-lib/lib:/mesos/build/3rdparty/googletest-1.8.0/src/googletest-1.8.0-lib/lib/gtest:/mesos/build/src/.libs:/mesos/build/3rdparty/libprocess/src:/mesos/build/src:/mesos/build/3rdparty/zookeeper-3.4.8/src/zookeeper-3.4.8/src/c/lib 
make[3]: Leaving directory `/mesos/build'
/usr/bin/cmake -E cmake_progress_report /mesos/build/CMakeFiles  96
[ 79%] Built target test-helper
make -f src/tests/CMakeFiles/mesos-tests.dir/build.make src/tests/CMakeFiles/mesos-tests.dir/depend
make[3]: Entering directory `/mesos/build'
cd /mesos/build && /usr/bin/cmake -E cmake_depends "Unix Makefiles" /mesos /mesos/src/tests /mesos/build /mesos/build/src/tests /mesos/build/src/tests/CMakeFiles/mesos-tests.dir/DependInfo.cmake --color=
Scanning dependencies of target mesos-tests
make[3]: Leaving directory `/mesos/build'
make -f src/tests/CMakeFiles/mesos-tests.dir/build.make src/tests/CMakeFiles/mesos-tests.dir/build
make[3]: Entering directory `/mesos/build'
/usr/bin/cmake -E cmake_progress_report /mesos/build/CMakeFiles 59
[ 80%] /usr/bin/cmake -E cmake_progress_report /mesos/build/CMakeFiles 
/usr/bin/cmake -E cmake_progress_report /mesos/build/CMakeFiles 
/usr/bin/cmake -E cmake_progress_report /mesos/build/CMakeFiles 
[ 80%] [ 80%] Building CXX object src/tests/CMakeFiles/mesos-tests.dir/active_user_test_helper.cpp.o
[ 80%] cd /mesos/build/src/tests && /usr/bin/g++   -DBUILD_DIR=\"/mesos/build\" -DBUILD_FLAGS=\"\" -DBUILD_JAVA_JVM_LIBRARY=\"\" -DHAS_AUTHENTICATION=1 -DLIBDIR=\"/usr/local/libmesos\" -DPICOJSON_USE_INT64 -DPKGDATADIR=\"/usr/local/share/mesos\" -DPKGLIBEXECDIR=\"/usr/local/libexec/mesos\" -DPKGMODULEDIR=\"\" -DSBINDIR=\"\" -DSOURCE_DIR=\"/mesos\" -DTESTLIBEXECDIR=\"\" -DUSE_CMAKE_BUILD_CONFIG -DUSE_SSL_SOCKET=1 -DUSE_STATIC_LIB -DVERSION=\"1.4.0\" -D__STDC_FORMAT_MACROS -std=c++11 -fPIE -I/mesos/build/include -I/mesos/build/include/mesos -I/mesos/build/src -I/mesos/src -isystem /mesos/build/3rdparty/protobuf-3.3.0/src/protobuf-3.3.0-lib/lib/include -isystem /mesos/3rdparty/libprocess/include -isystem /usr/include/apr-1.0 -isystem /mesos/build/3rdparty/boost-1.53.0/src/boost-1.53.0 -isystem /mesos/build/3rdparty/elfio-3.2/src/elfio-3.2 -isystem /mesos/build/3rdparty/glog-0.3.3/src/glog-0.3.3-lib/lib/include -isystem /mesos/build/3rdparty/nvml-352.79/src/nvml-352.79 -isystem /mesos/build/3rdparty/picojson-1.3.0/src/picojson-1.3.0 -isystem /usr/include/subversion-1 -isystem /mesos/3rdparty/stout/include -isystem /mesos/build/3rdparty/http_parser-2.6.2/src/http_parser-2.6.2 -isystem /mesos/build/3rdparty/concurrentqueue-1.0.0-beta/src/concurrentqueue-1.0.0-beta -isystem /mesos/build/3rdparty/libevent-2.1.5-beta/src/libevent-2.1.5-beta-lib/lib/include -isystem /mesos/build/3rdparty/zookeeper-3.4.8/src/zookeeper-3.4.8/src/c/include -isystem /mesos/build/3rdparty/zookeeper-3.4.8/src/zookeeper-3.4.8/src/c/generated -isystem /mesos/build/3rdparty/leveldb-1.19/src/leveldb-1.19/include -I/mesos/include -isystem /mesos/build/3rdparty/googletest-1.8.0/src/googletest-1.8.0/googlemock/include -isystem /mesos/build/3rdparty/googletest-1.8.0/src/googletest-1.8.0/googletest/include    -o CMakeFiles/mesos-tests.dir/active_user_test_helper.cpp.o -c /mesos/src/tests/active_user_test_helper.cpp
Building CXX object src/tests/CMakeFiles/mesos-tests.dir/cluster.cpp.o
cd /mesos/build/src/tests && /usr/bin/g++   -DBUILD_DIR=\"/mesos/build\" -DBUILD_FLAGS=\"\" -DBUILD_JAVA_JVM_LIBRARY=\"\" -DHAS_AUTHENTICATION=1 -DLIBDIR=\"/usr/local/libmesos\" -DPICOJSON_USE_INT64 -DPKGDATADIR=\"/usr/local/share/mesos\" -DPKGLIBEXECDIR=\"/usr/local/libexec/mesos\" -DPKGMODULEDIR=\"\" -DSBINDIR=\"\" -DSOURCE_DIR=\"/mesos\" -DTESTLIBEXECDIR=\"\" -DUSE_CMAKE_BUILD_CONFIG -DUSE_SSL_SOCKET=1 -DUSE_STATIC_LIB -DVERSION=\"1.4.0\" -D__STDC_FORMAT_MACROS -std=c++11 -fPIE -I/mesos/build/include -I/mesos/build/include/mesos -I/mesos/build/src -I/mesos/src -isystem /mesos/build/3rdparty/protobuf-3.3.0/src/protobuf-3.3.0-lib/lib/include -isystem /mesos/3rdparty/libprocess/include -isystem /usr/include/apr-1.0 -isystem /mesos/build/3rdparty/boost-1.53.0/src/boost-1.53.0 -isystem /mesos/build/3rdparty/elfio-3.2/src/elfio-3.2 -isystem /mesos/build/3rdparty/glog-0.3.3/src/glog-0.3.3-lib/lib/include -isystem /mesos/build/3rdparty/nvml-352.79/src/nvml-352.79 -isystem /mesos/build/3rdparty/picojson-1.3.0/src/picojson-1.3.0 -isystem /usr/include/subversion-1 -isystem /mesos/3rdparty/stout/include -isystem /mesos/build/3rdparty/http_parser-2.6.2/src/http_parser-2.6.2 -isystem /mesos/build/3rdparty/concurrentqueue-1.0.0-beta/src/concurrentqueue-1.0.0-beta -isystem /mesos/build/3rdparty/libevent-2.1.5-beta/src/libevent-2.1.5-beta-lib/lib/include -isystem /mesos/build/3rdparty/zookeeper-3.4.8/src/zookeeper-3.4.8/src/c/include -isystem /mesos/build/3rdparty/zookeeper-3.4.8/src/zookeeper-3.4.8/src/c/generated -isystem /mesos/build/3rdparty/leveldb-1.19/src/leveldb-1.19/include -I/mesos/include -isystem /mesos/build/3rdparty/googletest-1.8.0/src/googletest-1.8.0/googlemock/include -isystem /mesos/build/3rdparty/googletest-1.8.0/src/googletest-1.8.0/googletest/include    -o CMakeFiles/mesos-tests.dir/cluster.cpp.o -c /mesos/src/tests/cluster.cpp
/usr/bin/cmake -E cmake_progress_report /mesos/build/CMakeFiles 
/usr/bin/cmake -E cmake_progress_report /mesos/build/CMakeFiles 
Building CXX object src/tests/CMakeFiles/mesos-tests.dir/containerizer.cpp.o
Building CXX object src/tests/CMakeFiles/mesos-tests.dir/environment.cpp.o
[ 80%] cd /mesos/build/src/tests && /usr/bin/g++   -DBUILD_DIR=\"/mesos/build\" -DBUILD_FLAGS=\"\" -DBUILD_JAVA_JVM_LIBRARY=\"\" -DHAS_AUTHENTICATION=1 -DLIBDIR=\"/usr/local/libmesos\" -DPICOJSON_USE_INT64 -DPKGDATADIR=\"/usr/local/share/mesos\" -DPKGLIBEXECDIR=\"/usr/local/libexec/mesos\" -DPKGMODULEDIR=\"\" -DSBINDIR=\"\" -DSOURCE_DIR=\"/mesos\" -DTESTLIBEXECDIR=\"\" -DUSE_CMAKE_BUILD_CONFIG -DUSE_SSL_SOCKET=1 -DUSE_STATIC_LIB -DVERSION=\"1.4.0\" -D__STDC_FORMAT_MACROS -std=c++11 -fPIE -I/mesos/build/include -I/mesos/build/include/mesos -I/mesos/build/src -I/mesos/src -isystem /mesos/build/3rdparty/protobuf-3.3.0/src/protobuf-3.3.0-lib/lib/include -isystem /mesos/3rdparty/libprocess/include -isystem /usr/include/apr-1.0 -isystem /mesos/build/3rdparty/boost-1.53.0/src/boost-1.53.0 -isystem /mesos/build/3rdparty/elfio-3.2/src/elfio-3.2 -isystem /mesos/build/3rdparty/glog-0.3.3/src/glog-0.3.3-lib/lib/include -isystem /mesos/build/3rdparty/nvml-352.79/src/nvml-352.79 -isystem /mesos/build/3rdparty/picojson-1.3.0/src/picojson-1.3.0 -isystem /usr/include/subversion-1 -isystem /mesos/3rdparty/stout/include -isystem /mesos/build/3rdparty/http_parser-2.6.2/src/http_parser-2.6.2 -isystem /mesos/build/3rdparty/concurrentqueue-1.0.0-beta/src/concurrentqueue-1.0.0-beta -isystem /mesos/build/3rdparty/libevent-2.1.5-beta/src/libevent-2.1.5-beta-lib/lib/include -isystem /mesos/build/3rdparty/zookeeper-3.4.8/src/zookeeper-3.4.8/src/c/include -isystem /mesos/build/3rdparty/zookeeper-3.4.8/src/zookeeper-3.4.8/src/c/generated -isystem /mesos/build/3rdparty/leveldb-1.19/src/leveldb-1.19/include -I/mesos/include -isystem /mesos/build/3rdparty/googletest-1.8.0/src/googletest-1.8.0/googlemock/include -isystem /mesos/build/3rdparty/googletest-1.8.0/src/googletest-1.8.0/googletest/include    -o CMakeFiles/mesos-tests.dir/environment.cpp.o -c /mesos/src/tests/environment.cpp
[ 80%] cd /mesos/build/src/tests && /usr/bin/g++   -DBUILD_DIR=\"/mesos/build\" -DBUILD_FLAGS=\"\" -DBUILD_JAVA_JVM_LIBRARY=\"\" -DHAS_AUTHENTICATION=1 -DLIBDIR=\"/usr/local/libmesos\" -DPICOJSON_USE_INT64 -DPKGDATADIR=\"/usr/local/share/mesos\" -DPKGLIBEXECDIR=\"/usr/local/libexec/mesos\" -DPKGMODULEDIR=\"\" -DSBINDIR=\"\" -DSOURCE_DIR=\"/mesos\" -DTESTLIBEXECDIR=\"\" -DUSE_CMAKE_BUILD_CONFIG -DUSE_SSL_SOCKET=1 -DUSE_STATIC_LIB -DVERSION=\"1.4.0\" -D__STDC_FORMAT_MACROS -std=c++11 -fPIE -I/mesos/build/include -I/mesos/build/include/mesos -I/mesos/build/src -I/mesos/src -isystem /mesos/build/3rdparty/protobuf-3.3.0/src/protobuf-3.3.0-lib/lib/include -isystem /mesos/3rdparty/libprocess/include -isystem /usr/include/apr-1.0 -isystem /mesos/build/3rdparty/boost-1.53.0/src/boost-1.53.0 -isystem /mesos/build/3rdparty/elfio-3.2/src/elfio-3.2 -isystem /mesos/build/3rdparty/glog-0.3.3/src/glog-0.3.3-lib/lib/include -isystem /mesos/build/3rdparty/nvml-352.79/src/nvml-352.79 -isystem /mesos/build/3rdparty/picojson-1.3.0/src/picojson-1.3.0 -isystem /usr/include/subversion-1 -isystem /mesos/3rdparty/stout/include -isystem /mesos/build/3rdparty/http_parser-2.6.2/src/http_parser-2.6.2 -isystem /mesos/build/3rdparty/concurrentqueue-1.0.0-beta/src/concurrentqueue-1.0.0-beta -isystem /mesos/build/3rdparty/libevent-2.1.5-beta/src/libevent-2.1.5-beta-lib/lib/include -isystem /mesos/build/3rdparty/zookeeper-3.4.8/src/zookeeper-3.4.8/src/c/include -isystem /mesos/build/3rdparty/zookeeper-3.4.8/src/zookeeper-3.4.8/src/c/generated -isystem /mesos/build/3rdparty/leveldb-1.19/src/leveldb-1.19/include -I/mesos/include -isystem /mesos/build/3rdparty/googletest-1.8.0/src/googletest-1.8.0/googlemock/include -isystem /mesos/build/3rdparty/googletest-1.8.0/src/googletest-1.8.0/googletest/include    -o CMakeFiles/mesos-tests.dir/containerizer.cpp.o -c /mesos/src/tests/containerizer.cpp
Building CXX object src/tests/CMakeFiles/mesos-tests.dir/flags.cpp.o
cd /mesos/build/src/tests && /usr/bin/g++   -DBUILD_DIR=\"/mesos/build\" -DBUILD_FLAGS=\"\" -DBUILD_JAVA_JVM_LIBRARY=\"\" -DHAS_AUTHENTICATION=1 -DLIBDIR=\"/usr/local/libmesos\" -DPICOJSON_USE_INT64 -DPKGDATADIR=\"/usr/local/share/mesos\" -DPKGLIBEXECDIR=\"/usr/local/libexec/mesos\" -DPKGMODULEDIR=\"\" -DSBINDIR=\"\" -DSOURCE_DIR=\"/mesos\" -DTESTLIBEXECDIR=\"\" -DUSE_CMAKE_BUILD_CONFIG -DUSE_SSL_SOCKET=1 -DUSE_STATIC_LIB -DVERSION=\"1.4.0\" -D__STDC_FORMAT_MACROS -std=c++11 -fPIE -I/mesos/build/include -I/mesos/build/include/mesos -I/mesos/build/src -I/mesos/src -isystem /mesos/build/3rdparty/protobuf-3.3.0/src/protobuf-3.3.0-lib/lib/include -isystem /mesos/3rdparty/libprocess/include -isystem /usr/include/apr-1.0 -isystem /mesos/build/3rdparty/boost-1.53.0/src/boost-1.53.0 -isystem /mesos/build/3rdparty/elfio-3.2/src/elfio-3.2 -isystem /mesos/build/3rdparty/glog-0.3.3/src/glog-0.3.3-lib/lib/include -isystem /mesos/build/3rdparty/nvml-352.79/src/nvml-352.79 -isystem /mesos/build/3rdparty/picojson-1.3.0/src/picojson-1.3.0 -isystem /usr/include/subversion-1 -isystem /mesos/3rdparty/stout/include -isystem /mesos/build/3rdparty/http_parser-2.6.2/src/http_parser-2.6.2 -isystem /mesos/build/3rdparty/concurrentqueue-1.0.0-beta/src/concurrentqueue-1.0.0-beta -isystem /mesos/build/3rdparty/libevent-2.1.5-beta/src/libevent-2.1.5-beta-lib/lib/include -isystem /mesos/build/3rdparty/zookeeper-3.4.8/src/zookeeper-3.4.8/src/c/include -isystem /mesos/build/3rdparty/zookeeper-3.4.8/src/zookeeper-3.4.8/src/c/generated -isystem /mesos/build/3rdparty/leveldb-1.19/src/leveldb-1.19/include -I/mesos/include -isystem /mesos/build/3rdparty/googletest-1.8.0/src/googletest-1.8.0/googlemock/include -isystem /mesos/build/3rdparty/googletest-1.8.0/src/googletest-1.8.0/googletest/include    -o CMakeFiles/mesos-tests.dir/flags.cpp.o -c /mesos/src/tests/flags.cpp
Building CXX object src/tests/CMakeFiles/mesos-tests.dir/http_server_test_helper.cpp.o
cd /mesos/build/src/tests && /usr/bin/g++   -DBUILD_DIR=\"/mesos/build\" -DBUILD_FLAGS=\"\" -DBUILD_JAVA_JVM_LIBRARY=\"\" -DHAS_AUTHENTICATION=1 -DLIBDIR=\"/usr/local/libmesos\" -DPICOJSON_USE_INT64 -DPKGDATADIR=\"/usr/local/share/mesos\" -DPKGLIBEXECDIR=\"/usr/local/libexec/mesos\" -DPKGMODULEDIR=\"\" -DSBINDIR=\"\" -DSOURCE_DIR=\"/mesos\" -DTESTLIBEXECDIR=\"\" -DUSE_CMAKE_BUILD_CONFIG -DUSE_SSL_SOCKET=1 -DUSE_STATIC_LIB -DVERSION=\"1.4.0\" -D__STDC_FORMAT_MACROS -std=c++11 -fPIE -I/mesos/build/include -I/mesos/build/include/mesos -I/mesos/build/src -I/mesos/src -isystem /mesos/build/3rdparty/protobuf-3.3.0/src/protobuf-3.3.0-lib/lib/include -isystem /mesos/3rdparty/libprocess/include -isystem /usr/include/apr-1.0 -isystem /mesos/build/3rdparty/boost-1.53.0/src/boost-1.53.0 -isystem /mesos/build/3rdparty/elfio-3.2/src/elfio-3.2 -isystem /mesos/build/3rdparty/glog-0.3.3/src/glog-0.3.3-lib/lib/include -isystem /mesos/build/3rdparty/nvml-352.79/src/nvml-352.79 -isystem /mesos/build/3rdparty/picojson-1.3.0/src/picojson-1.3.0 -isystem /usr/include/subversion-1 -isystem /mesos/3rdparty/stout/include -isystem /mesos/build/3rdparty/http_parser-2.6.2/src/http_parser-2.6.2 -isystem /mesos/build/3rdparty/concurrentqueue-1.0.0-beta/src/concurrentqueue-1.0.0-beta -isystem /mesos/build/3rdparty/libevent-2.1.5-beta/src/libevent-2.1.5-beta-lib/lib/include -isystem /mesos/build/3rdparty/zookeeper-3.4.8/src/zookeeper-3.4.8/src/c/include -isystem /mesos/build/3rdparty/zookeeper-3.4.8/src/zookeeper-3.4.8/src/c/generated -isystem /mesos/build/3rdparty/leveldb-1.19/src/leveldb-1.19/include -I/mesos/include -isystem /mesos/build/3rdparty/googletest-1.8.0/src/googletest-1.8.0/googlemock/include -isystem /mesos/build/3rdparty/googletest-1.8.0/src/googletest-1.8.0/googletest/include    -o CMakeFiles/mesos-tests.dir/http_server_test_helper.cpp.o -c /mesos/src/tests/http_server_test_helper.cpp
/usr/bin/cmake -E cmake_progress_report /mesos/build/CMakeFiles 60
[ 81%] Building CXX object src/tests/CMakeFiles/mesos-tests.dir/main.cpp.o
cd /mesos/build/src/tests && /usr/bin/g++   -DBUILD_DIR=\"/mesos/build\" -DBUILD_FLAGS=\"\" -DBUILD_JAVA_JVM_LIBRARY=\"\" -DHAS_AUTHENTICATION=1 -DLIBDIR=\"/usr/local/libmesos\" -DPICOJSON_USE_INT64 -DPKGDATADIR=\"/usr/local/share/mesos\" -DPKGLIBEXECDIR=\"/usr/local/libexec/mesos\" -DPKGMODULEDIR=\"\" -DSBINDIR=\"\" -DSOURCE_DIR=\"/mesos\" -DTESTLIBEXECDIR=\"\" -DUSE_CMAKE_BUILD_CONFIG -DUSE_SSL_SOCKET=1 -DUSE_STATIC_LIB -DVERSION=\"1.4.0\" -D__STDC_FORMAT_MACROS -std=c++11 -fPIE -I/mesos/build/include -I/mesos/build/include/mesos -I/mesos/build/src -I/mesos/src -isystem /mesos/build/3rdparty/protobuf-3.3.0/src/protobuf-3.3.0-lib/lib/include -isystem /mesos/3rdparty/libprocess/include -isystem /usr/include/apr-1.0 -isystem /mesos/build/3rdparty/boost-1.53.0/src/boost-1.53.0 -isystem /mesos/build/3rdparty/elfio-3.2/src/elfio-3.2 -isystem /mesos/build/3rdparty/glog-0.3.3/src/glog-0.3.3-lib/lib/include -isystem /mesos/build/3rdparty/nvml-352.79/src/nvml-352.79 -isystem /mesos/build/3rdparty/picojson-1.3.0/src/picojson-1.3.0 -isystem /usr/include/subversion-1 -isystem /mesos/3rdparty/stout/include -isystem /mesos/build/3rdparty/http_parser-2.6.2/src/http_parser-2.6.2 -isystem /mesos/build/3rdparty/concurrentqueue-1.0.0-beta/src/concurrentqueue-1.0.0-beta -isystem /mesos/build/3rdparty/libevent-2.1.5-beta/src/libevent-2.1.5-beta-lib/lib/include -isystem /mesos/build/3rdparty/zookeeper-3.4.8/src/zookeeper-3.4.8/src/c/include -isystem /mesos/build/3rdparty/zookeeper-3.4.8/src/zookeeper-3.4.8/src/c/generated -isystem /mesos/build/3rdparty/leveldb-1.19/src/leveldb-1.19/include -I/mesos/include -isystem /mesos/build/3rdparty/googletest-1.8.0/src/googletest-1.8.0/googlemock/include -isystem /mesos/build/3rdparty/googletest-1.8.0/src/googletest-1.8.0/googletest/include    -o CMakeFiles/mesos-tests.dir/main.cpp.o -c /mesos/src/tests/main.cpp
/usr/bin/cmake -E cmake_progress_report /mesos/build/CMakeFiles 
[ 81%] Building CXX object src/tests/CMakeFiles/mesos-tests.dir/mesos.cpp.o
cd /mesos/build/src/tests && /usr/bin/g++   -DBUILD_DIR=\"/mesos/build\" -DBUILD_FLAGS=\"\" -DBUILD_JAVA_JVM_LIBRARY=\"\" -DHAS_AUTHENTICATION=1 -DLIBDIR=\"/usr/local/libmesos\" -DPICOJSON_USE_INT64 -DPKGDATADIR=\"/usr/local/share/mesos\" -DPKGLIBEXECDIR=\"/usr/local/libexec/mesos\" -DPKGMODULEDIR=\"\" -DSBINDIR=\"\" -DSOURCE_DIR=\"/mesos\" -DTESTLIBEXECDIR=\"\" -DUSE_CMAKE_BUILD_CONFIG -DUSE_SSL_SOCKET=1 -DUSE_STATIC_LIB -DVERSION=\"1.4.0\" -D__STDC_FORMAT_MACROS -std=c++11 -fPIE -I/mesos/build/include -I/mesos/build/include/mesos -I/mesos/build/src -I/mesos/src -isystem /mesos/build/3rdparty/protobuf-3.3.0/src/protobuf-3.3.0-lib/lib/include -isystem /mesos/3rdparty/libprocess/include -isystem /usr/include/apr-1.0 -isystem /mesos/build/3rdparty/boost-1.53.0/src/boost-1.53.0 -isystem /mesos/build/3rdparty/elfio-3.2/src/elfio-3.2 -isystem /mesos/build/3rdparty/glog-0.3.3/src/glog-0.3.3-lib/lib/include -isystem /mesos/build/3rdparty/nvml-352.79/src/nvml-352.79 -isystem /mesos/build/3rdparty/picojson-1.3.0/src/picojson-1.3.0 -isystem /usr/include/subversion-1 -isystem /mesos/3rdparty/stout/include -isystem /mesos/build/3rdparty/http_parser-2.6.2/src/http_parser-2.6.2 -isystem /mesos/build/3rdparty/concurrentqueue-1.0.0-beta/src/concurrentqueue-1.0.0-beta -isystem /mesos/build/3rdparty/libevent-2.1.5-beta/src/libevent-2.1.5-beta-lib/lib/include -isystem /mesos/build/3rdparty/zookeeper-3.4.8/src/zookeeper-3.4.8/src/c/include -isystem /mesos/build/3rdparty/zookeeper-3.4.8/src/zookeeper-3.4.8/src/c/generated -isystem /mesos/build/3rdparty/leveldb-1.19/src/leveldb-1.19/include -I/mesos/include -isystem /mesos/build/3rdparty/googletest-1.8.0/src/googletest-1.8.0/googlemock/include -isystem /mesos/build/3rdparty/googletest-1.8.0/src/googletest-1.8.0/googletest/include    -o CMakeFiles/mesos-tests.dir/mesos.cpp.o -c /mesos/src/tests/mesos.cpp
/usr/bin/cmake -E cmake_progress_report /mesos/build/CMakeFiles 
[ 81%] Building CXX object src/tests/CMakeFiles/mesos-tests.dir/mock_docker.cpp.o
cd /mesos/build/src/tests && /usr/bin/g++   -DBUILD_DIR=\"/mesos/build\" -DBUILD_FLAGS=\"\" -DBUILD_JAVA_JVM_LIBRARY=\"\" -DHAS_AUTHENTICATION=1 -DLIBDIR=\"/usr/local/libmesos\" -DPICOJSON_USE_INT64 -DPKGDATADIR=\"/usr/local/share/mesos\" -DPKGLIBEXECDIR=\"/usr/local/libexec/mesos\" -DPKGMODULEDIR=\"\" -DSBINDIR=\"\" -DSOURCE_DIR=\"/mesos\" -DTESTLIBEXECDIR=\"\" -DUSE_CMAKE_BUILD_CONFIG -DUSE_SSL_SOCKET=1 -DUSE_STATIC_LIB -DVERSION=\"1.4.0\" -D__STDC_FORMAT_MACROS -std=c++11 -fPIE -I/mesos/build/include -I/mesos/build/include/mesos -I/mesos/build/src -I/mesos/src -isystem /mesos/build/3rdparty/protobuf-3.3.0/src/protobuf-3.3.0-lib/lib/include -isystem /mesos/3rdparty/libprocess/include -isystem /usr/include/apr-1.0 -isystem /mesos/build/3rdparty/boost-1.53.0/src/boost-1.53.0 -isystem /mesos/build/3rdparty/elfio-3.2/src/elfio-3.2 -isystem /mesos/build/3rdparty/glog-0.3.3/src/glog-0.3.3-lib/lib/include -isystem /mesos/build/3rdparty/nvml-352.79/src/nvml-352.79 -isystem /mesos/build/3rdparty/picojson-1.3.0/src/picojson-1.3.0 -isystem /usr/include/subversion-1 -isystem /mesos/3rdparty/stout/include -isystem /mesos/build/3rdparty/http_parser-2.6.2/src/http_parser-2.6.2 -isystem /mesos/build/3rdparty/concurrentqueue-1.0.0-beta/src/concurrentqueue-1.0.0-beta -isystem /mesos/build/3rdparty/libevent-2.1.5-beta/src/libevent-2.1.5-beta-lib/lib/include -isystem /mesos/build/3rdparty/zookeeper-3.4.8/src/zookeeper-3.4.8/src/c/include -isystem /mesos/build/3rdparty/zookeeper-3.4.8/src/zookeeper-3.4.8/src/c/generated -isystem /mesos/build/3rdparty/leveldb-1.19/src/leveldb-1.19/include -I/mesos/include -isystem /mesos/build/3rdparty/googletest-1.8.0/src/googletest-1.8.0/googlemock/include -isystem /mesos/build/3rdparty/googletest-1.8.0/src/googletest-1.8.0/googletest/include    -o CMakeFiles/mesos-tests.dir/mock_docker.cpp.o -c /mesos/src/tests/mock_docker.cpp
/usr/bin/cmake -E cmake_progress_report /mesos/build/CMakeFiles 
[ 81%] Building CXX object src/tests/CMakeFiles/mesos-tests.dir/mock_fetcher.cpp.o
cd /mesos/build/src/tests && /usr/bin/g++   -DBUILD_DIR=\"/mesos/build\" -DBUILD_FLAGS=\"\" -DBUILD_JAVA_JVM_LIBRARY=\"\" -DHAS_AUTHENTICATION=1 -DLIBDIR=\"/usr/local/libmesos\" -DPICOJSON_USE_INT64 -DPKGDATADIR=\"/usr/local/share/mesos\" -DPKGLIBEXECDIR=\"/usr/local/libexec/mesos\" -DPKGMODULEDIR=\"\" -DSBINDIR=\"\" -DSOURCE_DIR=\"/mesos\" -DTESTLIBEXECDIR=\"\" -DUSE_CMAKE_BUILD_CONFIG -DUSE_SSL_SOCKET=1 -DUSE_STATIC_LIB -DVERSION=\"1.4.0\" -D__STDC_FORMAT_MACROS -std=c++11 -fPIE -I/mesos/build/include -I/mesos/build/include/mesos -I/mesos/build/src -I/mesos/src -isystem /mesos/build/3rdparty/protobuf-3.3.0/src/protobuf-3.3.0-lib/lib/include -isystem /mesos/3rdparty/libprocess/include -isystem /usr/include/apr-1.0 -isystem /mesos/build/3rdparty/boost-1.53.0/src/boost-1.53.0 -isystem /mesos/build/3rdparty/elfio-3.2/src/elfio-3.2 -isystem /mesos/build/3rdparty/glog-0.3.3/src/glog-0.3.3-lib/lib/include -isystem /mesos/build/3rdparty/nvml-352.79/src/nvml-352.79 -isystem /mesos/build/3rdparty/picojson-1.3.0/src/picojson-1.3.0 -isystem /usr/include/subversion-1 -isystem /mesos/3rdparty/stout/include -isystem /mesos/build/3rdparty/http_parser-2.6.2/src/http_parser-2.6.2 -isystem /mesos/build/3rdparty/concurrentqueue-1.0.0-beta/src/concurrentqueue-1.0.0-beta -isystem /mesos/build/3rdparty/libevent-2.1.5-beta/src/libevent-2.1.5-beta-lib/lib/include -isystem /mesos/build/3rdparty/zookeeper-3.4.8/src/zookeeper-3.4.8/src/c/include -isystem /mesos/build/3rdparty/zookeeper-3.4.8/src/zookeeper-3.4.8/src/c/generated -isystem /mesos/build/3rdparty/leveldb-1.19/src/leveldb-1.19/include -I/mesos/include -isystem /mesos/build/3rdparty/googletest-1.8.0/src/googletest-1.8.0/googlemock/include -isystem /mesos/build/3rdparty/googletest-1.8.0/src/googletest-1.8.0/googletest/include    -o CMakeFiles/mesos-tests.dir/mock_fetcher.cpp.o -c /mesos/src/tests/mock_fetcher.cpp
/usr/bin/cmake -E cmake_progress_report /mesos/build/CMakeFiles 
[ 81%] Building CXX object src/tests/CMakeFiles/mesos-tests.dir/mock_registrar.cpp.o
cd /mesos/build/src/tests && /usr/bin/g++   -DBUILD_DIR=\"/mesos/build\" -DBUILD_FLAGS=\"\" -DBUILD_JAVA_JVM_LIBRARY=\"\" -DHAS_AUTHENTICATION=1 -DLIBDIR=\"/usr/local/libmesos\" -DPICOJSON_USE_INT64 -DPKGDATADIR=\"/usr/local/share/mesos\" -DPKGLIBEXECDIR=\"/usr/local/libexec/mesos\" -DPKGMODULEDIR=\"\" -DSBINDIR=\"\" -DSOURCE_DIR=\"/mesos\" -DTESTLIBEXECDIR=\"\" -DUSE_CMAKE_BUILD_CONFIG -DUSE_SSL_SOCKET=1 -DUSE_STATIC_LIB -DVERSION=\"1.4.0\" -D__STDC_FORMAT_MACROS -std=c++11 -fPIE -I/mesos/build/include -I/mesos/build/include/mesos -I/mesos/build/src -I/mesos/src -isystem /mesos/build/3rdparty/protobuf-3.3.0/src/protobuf-3.3.0-lib/lib/include -isystem /mesos/3rdparty/libprocess/include -isystem /usr/include/apr-1.0 -isystem /mesos/build/3rdparty/boost-1.53.0/src/boost-1.53.0 -isystem /mesos/build/3rdparty/elfio-3.2/src/elfio-3.2 -isystem /mesos/build/3rdparty/glog-0.3.3/src/glog-0.3.3-lib/lib/include -isystem /mesos/build/3rdparty/nvml-352.79/src/nvml-352.79 -isystem /mesos/build/3rdparty/picojson-1.3.0/src/picojson-1.3.0 -isystem /usr/include/subversion-1 -isystem /mesos/3rdparty/stout/include -isystem /mesos/build/3rdparty/http_parser-2.6.2/src/http_parser-2.6.2 -isystem /mesos/build/3rdparty/concurrentqueue-1.0.0-beta/src/concurrentqueue-1.0.0-beta -isystem /mesos/build/3rdparty/libevent-2.1.5-beta/src/libevent-2.1.5-beta-lib/lib/include -isystem /mesos/build/3rdparty/zookeeper-3.4.8/src/zookeeper-3.4.8/src/c/include -isystem /mesos/build/3rdparty/zookeeper-3.4.8/src/zookeeper-3.4.8/src/c/generated -isystem /mesos/build/3rdparty/leveldb-1.19/src/leveldb-1.19/include -I/mesos/include -isystem /mesos/build/3rdparty/googletest-1.8.0/src/googletest-1.8.0/googlemock/include -isystem /mesos/build/3rdparty/googletest-1.8.0/src/googletest-1.8.0/googletest/include    -o CMakeFiles/mesos-tests.dir/mock_registrar.cpp.o -c /mesos/src/tests/mock_registrar.cpp
/usr/bin/cmake -E cmake_progress_report /mesos/build/CMakeFiles 
[ 81%] Building CXX object src/tests/CMakeFiles/mesos-tests.dir/mock_slave.cpp.o
cd /mesos/build/src/tests && /usr/bin/g++   -DBUILD_DIR=\"/mesos/build\" -DBUILD_FLAGS=\"\" -DBUILD_JAVA_JVM_LIBRARY=\"\" -DHAS_AUTHENTICATION=1 -DLIBDIR=\"/usr/local/libmesos\" -DPICOJSON_USE_INT64 -DPKGDATADIR=\"/usr/local/share/mesos\" -DPKGLIBEXECDIR=\"/usr/local/libexec/mesos\" -DPKGMODULEDIR=\"\" -DSBINDIR=\"\" -DSOURCE_DIR=\"/mesos\" -DTESTLIBEXECDIR=\"\" -DUSE_CMAKE_BUILD_CONFIG -DUSE_SSL_SOCKET=1 -DUSE_STATIC_LIB -DVERSION=\"1.4.0\" -D__STDC_FORMAT_MACROS -std=c++11 -fPIE -I/mesos/build/include -I/mesos/build/include/mesos -I/mesos/build/src -I/mesos/src -isystem /mesos/build/3rdparty/protobuf-3.3.0/src/protobuf-3.3.0-lib/lib/include -isystem /mesos/3rdparty/libprocess/include -isystem /usr/include/apr-1.0 -isystem /mesos/build/3rdparty/boost-1.53.0/src/boost-1.53.0 -isystem /mesos/build/3rdparty/elfio-3.2/src/elfio-3.2 -isystem /mesos/build/3rdparty/glog-0.3.3/src/glog-0.3.3-lib/lib/include -isystem /mesos/build/3rdparty/nvml-352.79/src/nvml-352.79 -isystem /mesos/build/3rdparty/picojson-1.3.0/src/picojson-1.3.0 -isystem /usr/include/subversion-1 -isystem /mesos/3rdparty/stout/include -isystem /mesos/build/3rdparty/http_parser-2.6.2/src/http_parser-2.6.2 -isystem /mesos/build/3rdparty/concurrentqueue-1.0.0-beta/src/concurrentqueue-1.0.0-beta -isystem /mesos/build/3rdparty/libevent-2.1.5-beta/src/libevent-2.1.5-beta-lib/lib/include -isystem /mesos/build/3rdparty/zookeeper-3.4.8/src/zookeeper-3.4.8/src/c/include -isystem /mesos/build/3rdparty/zookeeper-3.4.8/src/zookeeper-3.4.8/src/c/generated -isystem /mesos/build/3rdparty/leveldb-1.19/src/leveldb-1.19/include -I/mesos/include -isystem /mesos/build/3rdparty/googletest-1.8.0/src/googletest-1.8.0/googlemock/include -isystem /mesos/build/3rdparty/googletest-1.8.0/src/googletest-1.8.0/googletest/include    -o CMakeFiles/mesos-tests.dir/mock_slave.cpp.o -c /mesos/src/tests/mock_slave.cpp
/usr/bin/cmake -E cmake_progress_report /mesos/build/CMakeFiles 
[ 81%] Building CXX object src/tests/CMakeFiles/mesos-tests.dir/module.cpp.o
cd /mesos/build/src/tests && /usr/bin/g++   -DBUILD_DIR=\"/mesos/build\" -DBUILD_FLAGS=\"\" -DBUILD_JAVA_JVM_LIBRARY=\"\" -DHAS_AUTHENTICATION=1 -DLIBDIR=\"/usr/local/libmesos\" -DPICOJSON_USE_INT64 -DPKGDATADIR=\"/usr/local/share/mesos\" -DPKGLIBEXECDIR=\"/usr/local/libexec/mesos\" -DPKGMODULEDIR=\"\" -DSBINDIR=\"\" -DSOURCE_DIR=\"/mesos\" -DTESTLIBEXECDIR=\"\" -DUSE_CMAKE_BUILD_CONFIG -DUSE_SSL_SOCKET=1 -DUSE_STATIC_LIB -DVERSION=\"1.4.0\" -D__STDC_FORMAT_MACROS -std=c++11 -fPIE -I/mesos/build/include -I/mesos/build/include/mesos -I/mesos/build/src -I/mesos/src -isystem /mesos/build/3rdparty/protobuf-3.3.0/src/protobuf-3.3.0-lib/lib/include -isystem /mesos/3rdparty/libprocess/include -isystem /usr/include/apr-1.0 -isystem /mesos/build/3rdparty/boost-1.53.0/src/boost-1.53.0 -isystem /mesos/build/3rdparty/elfio-3.2/src/elfio-3.2 -isystem /mesos/build/3rdparty/glog-0.3.3/src/glog-0.3.3-lib/lib/include -isystem /mesos/build/3rdparty/nvml-352.79/src/nvml-352.79 -isystem /mesos/build/3rdparty/picojson-1.3.0/src/picojson-1.3.0 -isystem /usr/include/subversion-1 -isystem /mesos/3rdparty/stout/include -isystem /mesos/build/3rdparty/http_parser-2.6.2/src/http_parser-2.6.2 -isystem /mesos/build/3rdparty/concurrentqueue-1.0.0-beta/src/concurrentqueue-1.0.0-beta -isystem /mesos/build/3rdparty/libevent-2.1.5-beta/src/libevent-2.1.5-beta-lib/lib/include -isystem /mesos/build/3rdparty/zookeeper-3.4.8/src/zookeeper-3.4.8/src/c/include -isystem /mesos/build/3rdparty/zookeeper-3.4.8/src/zookeeper-3.4.8/src/c/generated -isystem /mesos/build/3rdparty/leveldb-1.19/src/leveldb-1.19/include -I/mesos/include -isystem /mesos/build/3rdparty/googletest-1.8.0/src/googletest-1.8.0/googlemock/include -isystem /mesos/build/3rdparty/googletest-1.8.0/src/googletest-1.8.0/googletest/include    -o CMakeFiles/mesos-tests.dir/module.cpp.o -c /mesos/src/tests/module.cpp
/usr/bin/cmake -E cmake_progress_report /mesos/build/CMakeFiles 61
[ 82%] Building CXX object src/tests/CMakeFiles/mesos-tests.dir/resources_utils.cpp.o
cd /mesos/build/src/tests && /usr/bin/g++   -DBUILD_DIR=\"/mesos/build\" -DBUILD_FLAGS=\"\" -DBUILD_JAVA_JVM_LIBRARY=\"\" -DHAS_AUTHENTICATION=1 -DLIBDIR=\"/usr/local/libmesos\" -DPICOJSON_USE_INT64 -DPKGDATADIR=\"/usr/local/share/mesos\" -DPKGLIBEXECDIR=\"/usr/local/libexec/mesos\" -DPKGMODULEDIR=\"\" -DSBINDIR=\"\" -DSOURCE_DIR=\"/mesos\" -DTESTLIBEXECDIR=\"\" -DUSE_CMAKE_BUILD_CONFIG -DUSE_SSL_SOCKET=1 -DUSE_STATIC_LIB -DVERSION=\"1.4.0\" -D__STDC_FORMAT_MACROS -std=c++11 -fPIE -I/mesos/build/include -I/mesos/build/include/mesos -I/mesos/build/src -I/mesos/src -isystem /mesos/build/3rdparty/protobuf-3.3.0/src/protobuf-3.3.0-lib/lib/include -isystem /mesos/3rdparty/libprocess/include -isystem /usr/include/apr-1.0 -isystem /mesos/build/3rdparty/boost-1.53.0/src/boost-1.53.0 -isystem /mesos/build/3rdparty/elfio-3.2/src/elfio-3.2 -isystem /mesos/build/3rdparty/glog-0.3.3/src/glog-0.3.3-lib/lib/include -isystem /mesos/build/3rdparty/nvml-352.79/src/nvml-352.79 -isystem /mesos/build/3rdparty/picojson-1.3.0/src/picojson-1.3.0 -isystem /usr/include/subversion-1 -isystem /mesos/3rdparty/stout/include -isystem /mesos/build/3rdparty/http_parser-2.6.2/src/http_parser-2.6.2 -isystem /mesos/build/3rdparty/concurrentqueue-1.0.0-beta/src/concurrentqueue-1.0.0-beta -isystem /mesos/build/3rdparty/libevent-2.1.5-beta/src/libevent-2.1.5-beta-lib/lib/include -isystem /mesos/build/3rdparty/zookeeper-3.4.8/src/zookeeper-3.4.8/src/c/include -isystem /mesos/build/3rdparty/zookeeper-3.4.8/src/zookeeper-3.4.8/src/c/generated -isystem /mesos/build/3rdparty/leveldb-1.19/src/leveldb-1.19/include -I/mesos/include -isystem /mesos/build/3rdparty/googletest-1.8.0/src/googletest-1.8.0/googlemock/include -isystem /mesos/build/3rdparty/googletest-1.8.0/src/googletest-1.8.0/googletest/include    -o CMakeFiles/mesos-tests.dir/resources_utils.cpp.o -c /mesos/src/tests/resources_utils.cpp
/usr/bin/cmake -E cmake_progress_report /mesos/build/CMakeFiles 
[ 82%] Building CXX object src/tests/CMakeFiles/mesos-tests.dir/utils.cpp.o
cd /mesos/build/src/tests && /usr/bin/g++   -DBUILD_DIR=\"/mesos/build\" -DBUILD_FLAGS=\"\" -DBUILD_JAVA_JVM_LIBRARY=\"\" -DHAS_AUTHENTICATION=1 -DLIBDIR=\"/usr/local/libmesos\" -DPICOJSON_USE_INT64 -DPKGDATADIR=\"/usr/local/share/mesos\" -DPKGLIBEXECDIR=\"/usr/local/libexec/mesos\" -DPKGMODULEDIR=\"\" -DSBINDIR=\"\" -DSOURCE_DIR=\"/mesos\" -DTESTLIBEXECDIR=\"\" -DUSE_CMAKE_BUILD_CONFIG -DUSE_SSL_SOCKET=1 -DUSE_STATIC_LIB -DVERSION=\"1.4.0\" -D__STDC_FORMAT_MACROS -std=c++11 -fPIE -I/mesos/build/include -I/mesos/build/include/mesos -I/mesos/build/src -I/mesos/src -isystem /mesos/build/3rdparty/protobuf-3.3.0/src/protobuf-3.3.0-lib/lib/include -isystem /mesos/3rdparty/libprocess/include -isystem /usr/include/apr-1.0 -isystem /mesos/build/3rdparty/boost-1.53.0/src/boost-1.53.0 -isystem /mesos/build/3rdparty/elfio-3.2/src/elfio-3.2 -isystem /mesos/build/3rdparty/glog-0.3.3/src/glog-0.3.3-lib/lib/include -isystem /mesos/build/3rdparty/nvml-352.79/src/nvml-352.79 -isystem /mesos/build/3rdparty/picojson-1.3.0/src/picojson-1.3.0 -isystem /usr/include/subversion-1 -isystem /mesos/3rdparty/stout/include -isystem /mesos/build/3rdparty/http_parser-2.6.2/src/http_parser-2.6.2 -isystem /mesos/build/3rdparty/concurrentqueue-1.0.0-beta/src/concurrentqueue-1.0.0-beta -isystem /mesos/build/3rdparty/libevent-2.1.5-beta/src/libevent-2.1.5-beta-lib/lib/include -isystem /mesos/build/3rdparty/zookeeper-3.4.8/src/zookeeper-3.4.8/src/c/include -isystem /mesos/build/3rdparty/zookeeper-3.4.8/src/zookeeper-3.4.8/src/c/generated -isystem /mesos/build/3rdparty/leveldb-1.19/src/leveldb-1.19/include -I/mesos/include -isystem /mesos/build/3rdparty/googletest-1.8.0/src/googletest-1.8.0/googlemock/include -isystem /mesos/build/3rdparty/googletest-1.8.0/src/googletest-1.8.0/googletest/include    -o CMakeFiles/mesos-tests.dir/utils.cpp.o -c /mesos/src/tests/utils.cpp
/usr/bin/cmake -E cmake_progress_report /mesos/build/CMakeFiles 
[ 82%] Building CXX object src/tests/CMakeFiles/mesos-tests.dir/containerizer/launcher.cpp.o
cd /mesos/build/src/tests && /usr/bin/g++   -DBUILD_DIR=\"/mesos/build\" -DBUILD_FLAGS=\"\" -DBUILD_JAVA_JVM_LIBRARY=\"\" -DHAS_AUTHENTICATION=1 -DLIBDIR=\"/usr/local/libmesos\" -DPICOJSON_USE_INT64 -DPKGDATADIR=\"/usr/local/share/mesos\" -DPKGLIBEXECDIR=\"/usr/local/libexec/mesos\" -DPKGMODULEDIR=\"\" -DSBINDIR=\"\" -DSOURCE_DIR=\"/mesos\" -DTESTLIBEXECDIR=\"\" -DUSE_CMAKE_BUILD_CONFIG -DUSE_SSL_SOCKET=1 -DUSE_STATIC_LIB -DVERSION=\"1.4.0\" -D__STDC_FORMAT_MACROS -std=c++11 -fPIE -I/mesos/build/include -I/mesos/build/include/mesos -I/mesos/build/src -I/mesos/src -isystem /mesos/build/3rdparty/protobuf-3.3.0/src/protobuf-3.3.0-lib/lib/include -isystem /mesos/3rdparty/libprocess/include -isystem /usr/include/apr-1.0 -isystem /mesos/build/3rdparty/boost-1.53.0/src/boost-1.53.0 -isystem /mesos/build/3rdparty/elfio-3.2/src/elfio-3.2 -isystem /mesos/build/3rdparty/glog-0.3.3/src/glog-0.3.3-lib/lib/include -isystem /mesos/build/3rdparty/nvml-352.79/src/nvml-352.79 -isystem /mesos/build/3rdparty/picojson-1.3.0/src/picojson-1.3.0 -isystem /usr/include/subversion-1 -isystem /mesos/3rdparty/stout/include -isystem /mesos/build/3rdparty/http_parser-2.6.2/src/http_parser-2.6.2 -isystem /mesos/build/3rdparty/concurrentqueue-1.0.0-beta/src/concurrentqueue-1.0.0-beta -isystem /mesos/build/3rdparty/libevent-2.1.5-beta/src/libevent-2.1.5-beta-lib/lib/include -isystem /mesos/build/3rdparty/zookeeper-3.4.8/src/zookeeper-3.4.8/src/c/include -isystem /mesos/build/3rdparty/zookeeper-3.4.8/src/zookeeper-3.4.8/src/c/generated -isystem /mesos/build/3rdparty/leveldb-1.19/src/leveldb-1.19/include -I/mesos/include -isystem /mesos/build/3rdparty/googletest-1.8.0/src/googletest-1.8.0/googlemock/include -isystem /mesos/build/3rdparty/googletest-1.8.0/src/googletest-1.8.0/googletest/include    -o CMakeFiles/mesos-tests.dir/containerizer/launcher.cpp.o -c /mesos/src/tests/containerizer/launcher.cpp
/usr/bin/cmake -E cmake_progress_report /mesos/build/CMakeFiles 
[ 82%] Building CXX object src/tests/CMakeFiles/mesos-tests.dir/kill_policy_test_helper.cpp.o
cd /mesos/build/src/tests && /usr/bin/g++   -DBUILD_DIR=\"/mesos/build\" -DBUILD_FLAGS=\"\" -DBUILD_JAVA_JVM_LIBRARY=\"\" -DHAS_AUTHENTICATION=1 -DLIBDIR=\"/usr/local/libmesos\" -DPICOJSON_USE_INT64 -DPKGDATADIR=\"/usr/local/share/mesos\" -DPKGLIBEXECDIR=\"/usr/local/libexec/mesos\" -DPKGMODULEDIR=\"\" -DSBINDIR=\"\" -DSOURCE_DIR=\"/mesos\" -DTESTLIBEXECDIR=\"\" -DUSE_CMAKE_BUILD_CONFIG -DUSE_SSL_SOCKET=1 -DUSE_STATIC_LIB -DVERSION=\"1.4.0\" -D__STDC_FORMAT_MACROS -std=c++11 -fPIE -I/mesos/build/include -I/mesos/build/include/mesos -I/mesos/build/src -I/mesos/src -isystem /mesos/build/3rdparty/protobuf-3.3.0/src/protobuf-3.3.0-lib/lib/include -isystem /mesos/3rdparty/libprocess/include -isystem /usr/include/apr-1.0 -isystem /mesos/build/3rdparty/boost-1.53.0/src/boost-1.53.0 -isystem /mesos/build/3rdparty/elfio-3.2/src/elfio-3.2 -isystem /mesos/build/3rdparty/glog-0.3.3/src/glog-0.3.3-lib/lib/include -isystem /mesos/build/3rdparty/nvml-352.79/src/nvml-352.79 -isystem /mesos/build/3rdparty/picojson-1.3.0/src/picojson-1.3.0 -isystem /usr/include/subversion-1 -isystem /mesos/3rdparty/stout/include -isystem /mesos/build/3rdparty/http_parser-2.6.2/src/http_parser-2.6.2 -isystem /mesos/build/3rdparty/concurrentqueue-1.0.0-beta/src/concurrentqueue-1.0.0-beta -isystem /mesos/build/3rdparty/libevent-2.1.5-beta/src/libevent-2.1.5-beta-lib/lib/include -isystem /mesos/build/3rdparty/zookeeper-3.4.8/src/zookeeper-3.4.8/src/c/include -isystem /mesos/build/3rdparty/zookeeper-3.4.8/src/zookeeper-3.4.8/src/c/generated -isystem /mesos/build/3rdparty/leveldb-1.19/src/leveldb-1.19/include -I/mesos/include -isystem /mesos/build/3rdparty/googletest-1.8.0/src/googletest-1.8.0/googlemock/include -isystem /mesos/build/3rdparty/googletest-1.8.0/src/googletest-1.8.0/googletest/include    -o CMakeFiles/mesos-tests.dir/kill_policy_test_helper.cpp.o -c /mesos/src/tests/kill_policy_test_helper.cpp
/usr/bin/cmake -E cmake_progress_report /mesos/build/CMakeFiles 
[ 82%] Building CXX object src/tests/CMakeFiles/mesos-tests.dir/script.cpp.o
cd /mesos/build/src/tests && /usr/bin/g++   -DBUILD_DIR=\"/mesos/build\" -DBUILD_FLAGS=\"\" -DBUILD_JAVA_JVM_LIBRARY=\"\" -DHAS_AUTHENTICATION=1 -DLIBDIR=\"/usr/local/libmesos\" -DPICOJSON_USE_INT64 -DPKGDATADIR=\"/usr/local/share/mesos\" -DPKGLIBEXECDIR=\"/usr/local/libexec/mesos\" -DPKGMODULEDIR=\"\" -DSBINDIR=\"\" -DSOURCE_DIR=\"/mesos\" -DTESTLIBEXECDIR=\"\" -DUSE_CMAKE_BUILD_CONFIG -DUSE_SSL_SOCKET=1 -DUSE_STATIC_LIB -DVERSION=\"1.4.0\" -D__STDC_FORMAT_MACROS -std=c++11 -fPIE -I/mesos/build/include -I/mesos/build/include/mesos -I/mesos/build/src -I/mesos/src -isystem /mesos/build/3rdparty/protobuf-3.3.0/src/protobuf-3.3.0-lib/lib/include -isystem /mesos/3rdparty/libprocess/include -isystem /usr/include/apr-1.0 -isystem /mesos/build/3rdparty/boost-1.53.0/src/boost-1.53.0 -isystem /mesos/build/3rdparty/elfio-3.2/src/elfio-3.2 -isystem /mesos/build/3rdparty/glog-0.3.3/src/glog-0.3.3-lib/lib/include -isystem /mesos/build/3rdparty/nvml-352.79/src/nvml-352.79 -isystem /mesos/build/3rdparty/picojson-1.3.0/src/picojson-1.3.0 -isystem /usr/include/subversion-1 -isystem /mesos/3rdparty/stout/include -isystem /mesos/build/3rdparty/http_parser-2.6.2/src/http_parser-2.6.2 -isystem /mesos/build/3rdparty/concurrentqueue-1.0.0-beta/src/concurrentqueue-1.0.0-beta -isystem /mesos/build/3rdparty/libevent-2.1.5-beta/src/libevent-2.1.5-beta-lib/lib/include -isystem /mesos/build/3rdparty/zookeeper-3.4.8/src/zookeeper-3.4.8/src/c/include -isystem /mesos/build/3rdparty/zookeeper-3.4.8/src/zookeeper-3.4.8/src/c/generated -isystem /mesos/build/3rdparty/leveldb-1.19/src/leveldb-1.19/include -I/mesos/include -isystem /mesos/build/3rdparty/googletest-1.8.0/src/googletest-1.8.0/googlemock/include -isystem /mesos/build/3rdparty/googletest-1.8.0/src/googletest-1.8.0/googletest/include    -o CMakeFiles/mesos-tests.dir/script.cpp.o -c /mesos/src/tests/script.cpp
/usr/bin/cmake -E cmake_progress_report /mesos/build/CMakeFiles 
[ 82%] Building CXX object src/tests/CMakeFiles/mesos-tests.dir/containerizer/memory_test_helper.cpp.o
cd /mesos/build/src/tests && /usr/bin/g++   -DBUILD_DIR=\"/mesos/build\" -DBUILD_FLAGS=\"\" -DBUILD_JAVA_JVM_LIBRARY=\"\" -DHAS_AUTHENTICATION=1 -DLIBDIR=\"/usr/local/libmesos\" -DPICOJSON_USE_INT64 -DPKGDATADIR=\"/usr/local/share/mesos\" -DPKGLIBEXECDIR=\"/usr/local/libexec/mesos\" -DPKGMODULEDIR=\"\" -DSBINDIR=\"\" -DSOURCE_DIR=\"/mesos\" -DTESTLIBEXECDIR=\"\" -DUSE_CMAKE_BUILD_CONFIG -DUSE_SSL_SOCKET=1 -DUSE_STATIC_LIB -DVERSION=\"1.4.0\" -D__STDC_FORMAT_MACROS -std=c++11 -fPIE -I/mesos/build/include -I/mesos/build/include/mesos -I/mesos/build/src -I/mesos/src -isystem /mesos/build/3rdparty/protobuf-3.3.0/src/protobuf-3.3.0-lib/lib/include -isystem /mesos/3rdparty/libprocess/include -isystem /usr/include/apr-1.0 -isystem /mesos/build/3rdparty/boost-1.53.0/src/boost-1.53.0 -isystem /mesos/build/3rdparty/elfio-3.2/src/elfio-3.2 -isystem /mesos/build/3rdparty/glog-0.3.3/src/glog-0.3.3-lib/lib/include -isystem /mesos/build/3rdparty/nvml-352.79/src/nvml-352.79 -isystem /mesos/build/3rdparty/picojson-1.3.0/src/picojson-1.3.0 -isystem /usr/include/subversion-1 -isystem /mesos/3rdparty/stout/include -isystem /mesos/build/3rdparty/http_parser-2.6.2/src/http_parser-2.6.2 -isystem /mesos/build/3rdparty/concurrentqueue-1.0.0-beta/src/concurrentqueue-1.0.0-beta -isystem /mesos/build/3rdparty/libevent-2.1.5-beta/src/libevent-2.1.5-beta-lib/lib/include -isystem /mesos/build/3rdparty/zookeeper-3.4.8/src/zookeeper-3.4.8/src/c/include -isystem /mesos/build/3rdparty/zookeeper-3.4.8/src/zookeeper-3.4.8/src/c/generated -isystem /mesos/build/3rdparty/leveldb-1.19/src/leveldb-1.19/include -I/mesos/include -isystem /mesos/build/3rdparty/googletest-1.8.0/src/googletest-1.8.0/googlemock/include -isystem /mesos/build/3rdparty/googletest-1.8.0/src/googletest-1.8.0/googletest/include    -o CMakeFiles/mesos-tests.dir/containerizer/memory_test_helper.cpp.o -c /mesos/src/tests/containerizer/memory_test_helper.cpp
/usr/bin/cmake -E cmake_progress_report /mesos/build/CMakeFiles 
[ 82%] Building CXX object src/tests/CMakeFiles/mesos-tests.dir/containerizer/capabilities_test_helper.cpp.o
cd /mesos/build/src/tests && /usr/bin/g++   -DBUILD_DIR=\"/mesos/build\" -DBUILD_FLAGS=\"\" -DBUILD_JAVA_JVM_LIBRARY=\"\" -DHAS_AUTHENTICATION=1 -DLIBDIR=\"/usr/local/libmesos\" -DPICOJSON_USE_INT64 -DPKGDATADIR=\"/usr/local/share/mesos\" -DPKGLIBEXECDIR=\"/usr/local/libexec/mesos\" -DPKGMODULEDIR=\"\" -DSBINDIR=\"\" -DSOURCE_DIR=\"/mesos\" -DTESTLIBEXECDIR=\"\" -DUSE_CMAKE_BUILD_CONFIG -DUSE_SSL_SOCKET=1 -DUSE_STATIC_LIB -DVERSION=\"1.4.0\" -D__STDC_FORMAT_MACROS -std=c++11 -fPIE -I/mesos/build/include -I/mesos/build/include/mesos -I/mesos/build/src -I/mesos/src -isystem /mesos/build/3rdparty/protobuf-3.3.0/src/protobuf-3.3.0-lib/lib/include -isystem /mesos/3rdparty/libprocess/include -isystem /usr/include/apr-1.0 -isystem /mesos/build/3rdparty/boost-1.53.0/src/boost-1.53.0 -isystem /mesos/build/3rdparty/elfio-3.2/src/elfio-3.2 -isystem /mesos/build/3rdparty/glog-0.3.3/src/glog-0.3.3-lib/lib/include -isystem /mesos/build/3rdparty/nvml-352.79/src/nvml-352.79 -isystem /mesos/build/3rdparty/picojson-1.3.0/src/picojson-1.3.0 -isystem /usr/include/subversion-1 -isystem /mesos/3rdparty/stout/include -isystem /mesos/build/3rdparty/http_parser-2.6.2/src/http_parser-2.6.2 -isystem /mesos/build/3rdparty/concurrentqueue-1.0.0-beta/src/concurrentqueue-1.0.0-beta -isystem /mesos/build/3rdparty/libevent-2.1.5-beta/src/libevent-2.1.5-beta-lib/lib/include -isystem /mesos/build/3rdparty/zookeeper-3.4.8/src/zookeeper-3.4.8/src/c/include -isystem /mesos/build/3rdparty/zookeeper-3.4.8/src/zookeeper-3.4.8/src/c/generated -isystem /mesos/build/3rdparty/leveldb-1.19/src/leveldb-1.19/include -I/mesos/include -isystem /mesos/build/3rdparty/googletest-1.8.0/src/googletest-1.8.0/googlemock/include -isystem /mesos/build/3rdparty/googletest-1.8.0/src/googletest-1.8.0/googletest/include    -o CMakeFiles/mesos-tests.dir/containerizer/capabilities_test_helper.cpp.o -c /mesos/src/tests/containerizer/capabilities_test_helper.cpp
/usr/bin/cmake -E cmake_progress_report /mesos/build/CMakeFiles 62
[ 83%] Building CXX object src/tests/CMakeFiles/mesos-tests.dir/containerizer/setns_test_helper.cpp.o
cd /mesos/build/src/tests && /usr/bin/g++   -DBUILD_DIR=\"/mesos/build\" -DBUILD_FLAGS=\"\" -DBUILD_JAVA_JVM_LIBRARY=\"\" -DHAS_AUTHENTICATION=1 -DLIBDIR=\"/usr/local/libmesos\" -DPICOJSON_USE_INT64 -DPKGDATADIR=\"/usr/local/share/mesos\" -DPKGLIBEXECDIR=\"/usr/local/libexec/mesos\" -DPKGMODULEDIR=\"\" -DSBINDIR=\"\" -DSOURCE_DIR=\"/mesos\" -DTESTLIBEXECDIR=\"\" -DUSE_CMAKE_BUILD_CONFIG -DUSE_SSL_SOCKET=1 -DUSE_STATIC_LIB -DVERSION=\"1.4.0\" -D__STDC_FORMAT_MACROS -std=c++11 -fPIE -I/mesos/build/include -I/mesos/build/include/mesos -I/mesos/build/src -I/mesos/src -isystem /mesos/build/3rdparty/protobuf-3.3.0/src/protobuf-3.3.0-lib/lib/include -isystem /mesos/3rdparty/libprocess/include -isystem /usr/include/apr-1.0 -isystem /mesos/build/3rdparty/boost-1.53.0/src/boost-1.53.0 -isystem /mesos/build/3rdparty/elfio-3.2/src/elfio-3.2 -isystem /mesos/build/3rdparty/glog-0.3.3/src/glog-0.3.3-lib/lib/include -isystem /mesos/build/3rdparty/nvml-352.79/src/nvml-352.79 -isystem /mesos/build/3rdparty/picojson-1.3.0/src/picojson-1.3.0 -isystem /usr/include/subversion-1 -isystem /mesos/3rdparty/stout/include -isystem /mesos/build/3rdparty/http_parser-2.6.2/src/http_parser-2.6.2 -isystem /mesos/build/3rdparty/concurrentqueue-1.0.0-beta/src/concurrentqueue-1.0.0-beta -isystem /mesos/build/3rdparty/libevent-2.1.5-beta/src/libevent-2.1.5-beta-lib/lib/include -isystem /mesos/build/3rdparty/zookeeper-3.4.8/src/zookeeper-3.4.8/src/c/include -isystem /mesos/build/3rdparty/zookeeper-3.4.8/src/zookeeper-3.4.8/src/c/generated -isystem /mesos/build/3rdparty/leveldb-1.19/src/leveldb-1.19/include -I/mesos/include -isystem /mesos/build/3rdparty/googletest-1.8.0/src/googletest-1.8.0/googlemock/include -isystem /mesos/build/3rdparty/googletest-1.8.0/src/googletest-1.8.0/googletest/include    -o CMakeFiles/mesos-tests.dir/containerizer/setns_test_helper.cpp.o -c /mesos/src/tests/containerizer/setns_test_helper.cpp
/usr/bin/cmake -E cmake_progress_report /mesos/build/CMakeFiles 
[ 83%] Building CXX object src/tests/CMakeFiles/mesos-tests.dir/anonymous_tests.cpp.o
cd /mesos/build/src/tests && /usr/bin/g++   -DBUILD_DIR=\"/mesos/build\" -DBUILD_FLAGS=\"\" -DBUILD_JAVA_JVM_LIBRARY=\"\" -DHAS_AUTHENTICATION=1 -DLIBDIR=\"/usr/local/libmesos\" -DPICOJSON_USE_INT64 -DPKGDATADIR=\"/usr/local/share/mesos\" -DPKGLIBEXECDIR=\"/usr/local/libexec/mesos\" -DPKGMODULEDIR=\"\" -DSBINDIR=\"\" -DSOURCE_DIR=\"/mesos\" -DTESTLIBEXECDIR=\"\" -DUSE_CMAKE_BUILD_CONFIG -DUSE_SSL_SOCKET=1 -DUSE_STATIC_LIB -DVERSION=\"1.4.0\" -D__STDC_FORMAT_MACROS -std=c++11 -fPIE -I/mesos/build/include -I/mesos/build/include/mesos -I/mesos/build/src -I/mesos/src -isystem /mesos/build/3rdparty/protobuf-3.3.0/src/protobuf-3.3.0-lib/lib/include -isystem /mesos/3rdparty/libprocess/include -isystem /usr/include/apr-1.0 -isystem /mesos/build/3rdparty/boost-1.53.0/src/boost-1.53.0 -isystem /mesos/build/3rdparty/elfio-3.2/src/elfio-3.2 -isystem /mesos/build/3rdparty/glog-0.3.3/src/glog-0.3.3-lib/lib/include -isystem /mesos/build/3rdparty/nvml-352.79/src/nvml-352.79 -isystem /mesos/build/3rdparty/picojson-1.3.0/src/picojson-1.3.0 -isystem /usr/include/subversion-1 -isystem /mesos/3rdparty/stout/include -isystem /mesos/build/3rdparty/http_parser-2.6.2/src/http_parser-2.6.2 -isystem /mesos/build/3rdparty/concurrentqueue-1.0.0-beta/src/concurrentqueue-1.0.0-beta -isystem /mesos/build/3rdparty/libevent-2.1.5-beta/src/libevent-2.1.5-beta-lib/lib/include -isystem /mesos/build/3rdparty/zookeeper-3.4.8/src/zookeeper-3.4.8/src/c/include -isystem /mesos/build/3rdparty/zookeeper-3.4.8/src/zookeeper-3.4.8/src/c/generated -isystem /mesos/build/3rdparty/leveldb-1.19/src/leveldb-1.19/include -I/mesos/include -isystem /mesos/build/3rdparty/googletest-1.8.0/src/googletest-1.8.0/googlemock/include -isystem /mesos/build/3rdparty/googletest-1.8.0/src/googletest-1.8.0/googletest/include    -o CMakeFiles/mesos-tests.dir/anonymous_tests.cpp.o -c /mesos/src/tests/anonymous_tests.cpp
/usr/bin/cmake -E cmake_progress_report /mesos/build/CMakeFiles 
[ 83%] Building CXX object src/tests/CMakeFiles/mesos-tests.dir/api_tests.cpp.o
cd /mesos/build/src/tests && /usr/bin/g++   -DBUILD_DIR=\"/mesos/build\" -DBUILD_FLAGS=\"\" -DBUILD_JAVA_JVM_LIBRARY=\"\" -DHAS_AUTHENTICATION=1 -DLIBDIR=\"/usr/local/libmesos\" -DPICOJSON_USE_INT64 -DPKGDATADIR=\"/usr/local/share/mesos\" -DPKGLIBEXECDIR=\"/usr/local/libexec/mesos\" -DPKGMODULEDIR=\"\" -DSBINDIR=\"\" -DSOURCE_DIR=\"/mesos\" -DTESTLIBEXECDIR=\"\" -DUSE_CMAKE_BUILD_CONFIG -DUSE_SSL_SOCKET=1 -DUSE_STATIC_LIB -DVERSION=\"1.4.0\" -D__STDC_FORMAT_MACROS -std=c++11 -fPIE -I/mesos/build/include -I/mesos/build/include/mesos -I/mesos/build/src -I/mesos/src -isystem /mesos/build/3rdparty/protobuf-3.3.0/src/protobuf-3.3.0-lib/lib/include -isystem /mesos/3rdparty/libprocess/include -isystem /usr/include/apr-1.0 -isystem /mesos/build/3rdparty/boost-1.53.0/src/boost-1.53.0 -isystem /mesos/build/3rdparty/elfio-3.2/src/elfio-3.2 -isystem /mesos/build/3rdparty/glog-0.3.3/src/glog-0.3.3-lib/lib/include -isystem /mesos/build/3rdparty/nvml-352.79/src/nvml-352.79 -isystem /mesos/build/3rdparty/picojson-1.3.0/src/picojson-1.3.0 -isystem /usr/include/subversion-1 -isystem /mesos/3rdparty/stout/include -isystem /mesos/build/3rdparty/http_parser-2.6.2/src/http_parser-2.6.2 -isystem /mesos/build/3rdparty/concurrentqueue-1.0.0-beta/src/concurrentqueue-1.0.0-beta -isystem /mesos/build/3rdparty/libevent-2.1.5-beta/src/libevent-2.1.5-beta-lib/lib/include -isystem /mesos/build/3rdparty/zookeeper-3.4.8/src/zookeeper-3.4.8/src/c/include -isystem /mesos/build/3rdparty/zookeeper-3.4.8/src/zookeeper-3.4.8/src/c/generated -isystem /mesos/build/3rdparty/leveldb-1.19/src/leveldb-1.19/include -I/mesos/include -isystem /mesos/build/3rdparty/googletest-1.8.0/src/googletest-1.8.0/googlemock/include -isystem /mesos/build/3rdparty/googletest-1.8.0/src/googletest-1.8.0/googletest/include    -o CMakeFiles/mesos-tests.dir/api_tests.cpp.o -c /mesos/src/tests/api_tests.cpp
/usr/bin/cmake -E cmake_progress_report /mesos/build/CMakeFiles 
[ 83%] Building CXX object src/tests/CMakeFiles/mesos-tests.dir/attributes_tests.cpp.o
cd /mesos/build/src/tests && /usr/bin/g++   -DBUILD_DIR=\"/mesos/build\" -DBUILD_FLAGS=\"\" -DBUILD_JAVA_JVM_LIBRARY=\"\" -DHAS_AUTHENTICATION=1 -DLIBDIR=\"/usr/local/libmesos\" -DPICOJSON_USE_INT64 -DPKGDATADIR=\"/usr/local/share/mesos\" -DPKGLIBEXECDIR=\"/usr/local/libexec/mesos\" -DPKGMODULEDIR=\"\" -DSBINDIR=\"\" -DSOURCE_DIR=\"/mesos\" -DTESTLIBEXECDIR=\"\" -DUSE_CMAKE_BUILD_CONFIG -DUSE_SSL_SOCKET=1 -DUSE_STATIC_LIB -DVERSION=\"1.4.0\" -D__STDC_FORMAT_MACROS -std=c++11 -fPIE -I/mesos/build/include -I/mesos/build/include/mesos -I/mesos/build/src -I/mesos/src -isystem /mesos/build/3rdparty/protobuf-3.3.0/src/protobuf-3.3.0-lib/lib/include -isystem /mesos/3rdparty/libprocess/include -isystem /usr/include/apr-1.0 -isystem /mesos/build/3rdparty/boost-1.53.0/src/boost-1.53.0 -isystem /mesos/build/3rdparty/elfio-3.2/src/elfio-3.2 -isystem /mesos/build/3rdparty/glog-0.3.3/src/glog-0.3.3-lib/lib/include -isystem /mesos/build/3rdparty/nvml-352.79/src/nvml-352.79 -isystem /mesos/build/3rdparty/picojson-1.3.0/src/picojson-1.3.0 -isystem /usr/include/subversion-1 -isystem /mesos/3rdparty/stout/include -isystem /mesos/build/3rdparty/http_parser-2.6.2/src/http_parser-2.6.2 -isystem /mesos/build/3rdparty/concurrentqueue-1.0.0-beta/src/concurrentqueue-1.0.0-beta -isystem /mesos/build/3rdparty/libevent-2.1.5-beta/src/libevent-2.1.5-beta-lib/lib/include -isystem /mesos/build/3rdparty/zookeeper-3.4.8/src/zookeeper-3.4.8/src/c/include -isystem /mesos/build/3rdparty/zookeeper-3.4.8/src/zookeeper-3.4.8/src/c/generated -isystem /mesos/build/3rdparty/leveldb-1.19/src/leveldb-1.19/include -I/mesos/include -isystem /mesos/build/3rdparty/googletest-1.8.0/src/googletest-1.8.0/googlemock/include -isystem /mesos/build/3rdparty/googletest-1.8.0/src/googletest-1.8.0/googletest/include    -o CMakeFiles/mesos-tests.dir/attributes_tests.cpp.o -c /mesos/src/tests/attributes_tests.cpp
/usr/bin/cmake -E cmake_progress_report /mesos/build/CMakeFiles 
[ 83%] Building CXX object src/tests/CMakeFiles/mesos-tests.dir/authentication_tests.cpp.o
cd /mesos/build/src/tests && /usr/bin/g++   -DBUILD_DIR=\"/mesos/build\" -DBUILD_FLAGS=\"\" -DBUILD_JAVA_JVM_LIBRARY=\"\" -DHAS_AUTHENTICATION=1 -DLIBDIR=\"/usr/local/libmesos\" -DPICOJSON_USE_INT64 -DPKGDATADIR=\"/usr/local/share/mesos\" -DPKGLIBEXECDIR=\"/usr/local/libexec/mesos\" -DPKGMODULEDIR=\"\" -DSBINDIR=\"\" -DSOURCE_DIR=\"/mesos\" -DTESTLIBEXECDIR=\"\" -DUSE_CMAKE_BUILD_CONFIG -DUSE_SSL_SOCKET=1 -DUSE_STATIC_LIB -DVERSION=\"1.4.0\" -D__STDC_FORMAT_MACROS -std=c++11 -fPIE -I/mesos/build/include -I/mesos/build/include/mesos -I/mesos/build/src -I/mesos/src -isystem /mesos/build/3rdparty/protobuf-3.3.0/src/protobuf-3.3.0-lib/lib/include -isystem /mesos/3rdparty/libprocess/include -isystem /usr/include/apr-1.0 -isystem /mesos/build/3rdparty/boost-1.53.0/src/boost-1.53.0 -isystem /mesos/build/3rdparty/elfio-3.2/src/elfio-3.2 -isystem /mesos/build/3rdparty/glog-0.3.3/src/glog-0.3.3-lib/lib/include -isystem /mesos/build/3rdparty/nvml-352.79/src/nvml-352.79 -isystem /mesos/build/3rdparty/picojson-1.3.0/src/picojson-1.3.0 -isystem /usr/include/subversion-1 -isystem /mesos/3rdparty/stout/include -isystem /mesos/build/3rdparty/http_parser-2.6.2/src/http_parser-2.6.2 -isystem /mesos/build/3rdparty/concurrentqueue-1.0.0-beta/src/concurrentqueue-1.0.0-beta -isystem /mesos/build/3rdparty/libevent-2.1.5-beta/src/libevent-2.1.5-beta-lib/lib/include -isystem /mesos/build/3rdparty/zookeeper-3.4.8/src/zookeeper-3.4.8/src/c/include -isystem /mesos/build/3rdparty/zookeeper-3.4.8/src/zookeeper-3.4.8/src/c/generated -isystem /mesos/build/3rdparty/leveldb-1.19/src/leveldb-1.19/include -I/mesos/include -isystem /mesos/build/3rdparty/googletest-1.8.0/src/googletest-1.8.0/googlemock/include -isystem /mesos/build/3rdparty/googletest-1.8.0/src/googletest-1.8.0/googletest/include    -o CMakeFiles/mesos-tests.dir/authentication_tests.cpp.o -c /mesos/src/tests/authentication_tests.cpp
/usr/bin/cmake -E cmake_progress_report /mesos/build/CMakeFiles 
[ 83%] Building CXX object src/tests/CMakeFiles/mesos-tests.dir/check_tests.cpp.o
cd /mesos/build/src/tests && /usr/bin/g++   -DBUILD_DIR=\"/mesos/build\" -DBUILD_FLAGS=\"\" -DBUILD_JAVA_JVM_LIBRARY=\"\" -DHAS_AUTHENTICATION=1 -DLIBDIR=\"/usr/local/libmesos\" -DPICOJSON_USE_INT64 -DPKGDATADIR=\"/usr/local/share/mesos\" -DPKGLIBEXECDIR=\"/usr/local/libexec/mesos\" -DPKGMODULEDIR=\"\" -DSBINDIR=\"\" -DSOURCE_DIR=\"/mesos\" -DTESTLIBEXECDIR=\"\" -DUSE_CMAKE_BUILD_CONFIG -DUSE_SSL_SOCKET=1 -DUSE_STATIC_LIB -DVERSION=\"1.4.0\" -D__STDC_FORMAT_MACROS -std=c++11 -fPIE -I/mesos/build/include -I/mesos/build/include/mesos -I/mesos/build/src -I/mesos/src -isystem /mesos/build/3rdparty/protobuf-3.3.0/src/protobuf-3.3.0-lib/lib/include -isystem /mesos/3rdparty/libprocess/include -isystem /usr/include/apr-1.0 -isystem /mesos/build/3rdparty/boost-1.53.0/src/boost-1.53.0 -isystem /mesos/build/3rdparty/elfio-3.2/src/elfio-3.2 -isystem /mesos/build/3rdparty/glog-0.3.3/src/glog-0.3.3-lib/lib/include -isystem /mesos/build/3rdparty/nvml-352.79/src/nvml-352.79 -isystem /mesos/build/3rdparty/picojson-1.3.0/src/picojson-1.3.0 -isystem /usr/include/subversion-1 -isystem /mesos/3rdparty/stout/include -isystem /mesos/build/3rdparty/http_parser-2.6.2/src/http_parser-2.6.2 -isystem /mesos/build/3rdparty/concurrentqueue-1.0.0-beta/src/concurrentqueue-1.0.0-beta -isystem /mesos/build/3rdparty/libevent-2.1.5-beta/src/libevent-2.1.5-beta-lib/lib/include -isystem /mesos/build/3rdparty/zookeeper-3.4.8/src/zookeeper-3.4.8/src/c/include -isystem /mesos/build/3rdparty/zookeeper-3.4.8/src/zookeeper-3.4.8/src/c/generated -isystem /mesos/build/3rdparty/leveldb-1.19/src/leveldb-1.19/include -I/mesos/include -isystem /mesos/build/3rdparty/googletest-1.8.0/src/googletest-1.8.0/googlemock/include -isystem /mesos/build/3rdparty/googletest-1.8.0/src/googletest-1.8.0/googletest/include    -o CMakeFiles/mesos-tests.dir/check_tests.cpp.o -c /mesos/src/tests/check_tests.cpp
/usr/bin/cmake -E cmake_progress_report /mesos/build/CMakeFiles 
[ 83%] Building CXX object src/tests/CMakeFiles/mesos-tests.dir/command_executor_tests.cpp.o
cd /mesos/build/src/tests && /usr/bin/g++   -DBUILD_DIR=\"/mesos/build\" -DBUILD_FLAGS=\"\" -DBUILD_JAVA_JVM_LIBRARY=\"\" -DHAS_AUTHENTICATION=1 -DLIBDIR=\"/usr/local/libmesos\" -DPICOJSON_USE_INT64 -DPKGDATADIR=\"/usr/local/share/mesos\" -DPKGLIBEXECDIR=\"/usr/local/libexec/mesos\" -DPKGMODULEDIR=\"\" -DSBINDIR=\"\" -DSOURCE_DIR=\"/mesos\" -DTESTLIBEXECDIR=\"\" -DUSE_CMAKE_BUILD_CONFIG -DUSE_SSL_SOCKET=1 -DUSE_STATIC_LIB -DVERSION=\"1.4.0\" -D__STDC_FORMAT_MACROS -std=c++11 -fPIE -I/mesos/build/include -I/mesos/build/include/mesos -I/mesos/build/src -I/mesos/src -isystem /mesos/build/3rdparty/protobuf-3.3.0/src/protobuf-3.3.0-lib/lib/include -isystem /mesos/3rdparty/libprocess/include -isystem /usr/include/apr-1.0 -isystem /mesos/build/3rdparty/boost-1.53.0/src/boost-1.53.0 -isystem /mesos/build/3rdparty/elfio-3.2/src/elfio-3.2 -isystem /mesos/build/3rdparty/glog-0.3.3/src/glog-0.3.3-lib/lib/include -isystem /mesos/build/3rdparty/nvml-352.79/src/nvml-352.79 -isystem /mesos/build/3rdparty/picojson-1.3.0/src/picojson-1.3.0 -isystem /usr/include/subversion-1 -isystem /mesos/3rdparty/stout/include -isystem /mesos/build/3rdparty/http_parser-2.6.2/src/http_parser-2.6.2 -isystem /mesos/build/3rdparty/concurrentqueue-1.0.0-beta/src/concurrentqueue-1.0.0-beta -isystem /mesos/build/3rdparty/libevent-2.1.5-beta/src/libevent-2.1.5-beta-lib/lib/include -isystem /mesos/build/3rdparty/zookeeper-3.4.8/src/zookeeper-3.4.8/src/c/include -isystem /mesos/build/3rdparty/zookeeper-3.4.8/src/zookeeper-3.4.8/src/c/generated -isystem /mesos/build/3rdparty/leveldb-1.19/src/leveldb-1.19/include -I/mesos/include -isystem /mesos/build/3rdparty/googletest-1.8.0/src/googletest-1.8.0/googlemock/include -isystem /mesos/build/3rdparty/googletest-1.8.0/src/googletest-1.8.0/googletest/include    -o CMakeFiles/mesos-tests.dir/command_executor_tests.cpp.o -c /mesos/src/tests/command_executor_tests.cpp
/usr/bin/cmake -E cmake_progress_report /mesos/build/CMakeFiles 63
[ 84%] Building CXX object src/tests/CMakeFiles/mesos-tests.dir/credentials_tests.cpp.o
cd /mesos/build/src/tests && /usr/bin/g++   -DBUILD_DIR=\"/mesos/build\" -DBUILD_FLAGS=\"\" -DBUILD_JAVA_JVM_LIBRARY=\"\" -DHAS_AUTHENTICATION=1 -DLIBDIR=\"/usr/local/libmesos\" -DPICOJSON_USE_INT64 -DPKGDATADIR=\"/usr/local/share/mesos\" -DPKGLIBEXECDIR=\"/usr/local/libexec/mesos\" -DPKGMODULEDIR=\"\" -DSBINDIR=\"\" -DSOURCE_DIR=\"/mesos\" -DTESTLIBEXECDIR=\"\" -DUSE_CMAKE_BUILD_CONFIG -DUSE_SSL_SOCKET=1 -DUSE_STATIC_LIB -DVERSION=\"1.4.0\" -D__STDC_FORMAT_MACROS -std=c++11 -fPIE -I/mesos/build/include -I/mesos/build/include/mesos -I/mesos/build/src -I/mesos/src -isystem /mesos/build/3rdparty/protobuf-3.3.0/src/protobuf-3.3.0-lib/lib/include -isystem /mesos/3rdparty/libprocess/include -isystem /usr/include/apr-1.0 -isystem /mesos/build/3rdparty/boost-1.53.0/src/boost-1.53.0 -isystem /mesos/build/3rdparty/elfio-3.2/src/elfio-3.2 -isystem /mesos/build/3rdparty/glog-0.3.3/src/glog-0.3.3-lib/lib/include -isystem /mesos/build/3rdparty/nvml-352.79/src/nvml-352.79 -isystem /mesos/build/3rdparty/picojson-1.3.0/src/picojson-1.3.0 -isystem /usr/include/subversion-1 -isystem /mesos/3rdparty/stout/include -isystem /mesos/build/3rdparty/http_parser-2.6.2/src/http_parser-2.6.2 -isystem /mesos/build/3rdparty/concurrentqueue-1.0.0-beta/src/concurrentqueue-1.0.0-beta -isystem /mesos/build/3rdparty/libevent-2.1.5-beta/src/libevent-2.1.5-beta-lib/lib/include -isystem /mesos/build/3rdparty/zookeeper-3.4.8/src/zookeeper-3.4.8/src/c/include -isystem /mesos/build/3rdparty/zookeeper-3.4.8/src/zookeeper-3.4.8/src/c/generated -isystem /mesos/build/3rdparty/leveldb-1.19/src/leveldb-1.19/include -I/mesos/include -isystem /mesos/build/3rdparty/googletest-1.8.0/src/googletest-1.8.0/googlemock/include -isystem /mesos/build/3rdparty/googletest-1.8.0/src/googletest-1.8.0/googletest/include    -o CMakeFiles/mesos-tests.dir/credentials_tests.cpp.o -c /mesos/src/tests/credentials_tests.cpp
/usr/bin/cmake -E cmake_progress_report /mesos/build/CMakeFiles 
[ 84%] Building CXX object src/tests/CMakeFiles/mesos-tests.dir/default_executor_tests.cpp.o
cd /mesos/build/src/tests && /usr/bin/g++   -DBUILD_DIR=\"/mesos/build\" -DBUILD_FLAGS=\"\" -DBUILD_JAVA_JVM_LIBRARY=\"\" -DHAS_AUTHENTICATION=1 -DLIBDIR=\"/usr/local/libmesos\" -DPICOJSON_USE_INT64 -DPKGDATADIR=\"/usr/local/share/mesos\" -DPKGLIBEXECDIR=\"/usr/local/libexec/mesos\" -DPKGMODULEDIR=\"\" -DSBINDIR=\"\" -DSOURCE_DIR=\"/mesos\" -DTESTLIBEXECDIR=\"\" -DUSE_CMAKE_BUILD_CONFIG -DUSE_SSL_SOCKET=1 -DUSE_STATIC_LIB -DVERSION=\"1.4.0\" -D__STDC_FORMAT_MACROS -std=c++11 -fPIE -I/mesos/build/include -I/mesos/build/include/mesos -I/mesos/build/src -I/mesos/src -isystem /mesos/build/3rdparty/protobuf-3.3.0/src/protobuf-3.3.0-lib/lib/include -isystem /mesos/3rdparty/libprocess/include -isystem /usr/include/apr-1.0 -isystem /mesos/build/3rdparty/boost-1.53.0/src/boost-1.53.0 -isystem /mesos/build/3rdparty/elfio-3.2/src/elfio-3.2 -isystem /mesos/build/3rdparty/glog-0.3.3/src/glog-0.3.3-lib/lib/include -isystem /mesos/build/3rdparty/nvml-352.79/src/nvml-352.79 -isystem /mesos/build/3rdparty/picojson-1.3.0/src/picojson-1.3.0 -isystem /usr/include/subversion-1 -isystem /mesos/3rdparty/stout/include -isystem /mesos/build/3rdparty/http_parser-2.6.2/src/http_parser-2.6.2 -isystem /mesos/build/3rdparty/concurrentqueue-1.0.0-beta/src/concurrentqueue-1.0.0-beta -isystem /mesos/build/3rdparty/libevent-2.1.5-beta/src/libevent-2.1.5-beta-lib/lib/include -isystem /mesos/build/3rdparty/zookeeper-3.4.8/src/zookeeper-3.4.8/src/c/include -isystem /mesos/build/3rdparty/zookeeper-3.4.8/src/zookeeper-3.4.8/src/c/generated -isystem /mesos/build/3rdparty/leveldb-1.19/src/leveldb-1.19/include -I/mesos/include -isystem /mesos/build/3rdparty/googletest-1.8.0/src/googletest-1.8.0/googlemock/include -isystem /mesos/build/3rdparty/googletest-1.8.0/src/googletest-1.8.0/googletest/include    -o CMakeFiles/mesos-tests.dir/default_executor_tests.cpp.o -c /mesos/src/tests/default_executor_tests.cpp
/usr/bin/cmake -E cmake_progress_report /mesos/build/CMakeFiles 
[ 84%] Building CXX object src/tests/CMakeFiles/mesos-tests.dir/exception_tests.cpp.o
cd /mesos/build/src/tests && /usr/bin/g++   -DBUILD_DIR=\"/mesos/build\" -DBUILD_FLAGS=\"\" -DBUILD_JAVA_JVM_LIBRARY=\"\" -DHAS_AUTHENTICATION=1 -DLIBDIR=\"/usr/local/libmesos\" -DPICOJSON_USE_INT64 -DPKGDATADIR=\"/usr/local/share/mesos\" -DPKGLIBEXECDIR=\"/usr/local/libexec/mesos\" -DPKGMODULEDIR=\"\" -DSBINDIR=\"\" -DSOURCE_DIR=\"/mesos\" -DTESTLIBEXECDIR=\"\" -DUSE_CMAKE_BUILD_CONFIG -DUSE_SSL_SOCKET=1 -DUSE_STATIC_LIB -DVERSION=\"1.4.0\" -D__STDC_FORMAT_MACROS -std=c++11 -fPIE -I/mesos/build/include -I/mesos/build/include/mesos -I/mesos/build/src -I/mesos/src -isystem /mesos/build/3rdparty/protobuf-3.3.0/src/protobuf-3.3.0-lib/lib/include -isystem /mesos/3rdparty/libprocess/include -isystem /usr/include/apr-1.0 -isystem /mesos/build/3rdparty/boost-1.53.0/src/boost-1.53.0 -isystem /mesos/build/3rdparty/elfio-3.2/src/elfio-3.2 -isystem /mesos/build/3rdparty/glog-0.3.3/src/glog-0.3.3-lib/lib/include -isystem /mesos/build/3rdparty/nvml-352.79/src/nvml-352.79 -isystem /mesos/build/3rdparty/picojson-1.3.0/src/picojson-1.3.0 -isystem /usr/include/subversion-1 -isystem /mesos/3rdparty/stout/include -isystem /mesos/build/3rdparty/http_parser-2.6.2/src/http_parser-2.6.2 -isystem /mesos/build/3rdparty/concurrentqueue-1.0.0-beta/src/concurrentqueue-1.0.0-beta -isystem /mesos/build/3rdparty/libevent-2.1.5-beta/src/libevent-2.1.5-beta-lib/lib/include -isystem /mesos/build/3rdparty/zookeeper-3.4.8/src/zookeeper-3.4.8/src/c/include -isystem /mesos/build/3rdparty/zookeeper-3.4.8/src/zookeeper-3.4.8/src/c/generated -isystem /mesos/build/3rdparty/leveldb-1.19/src/leveldb-1.19/include -I/mesos/include -isystem /mesos/build/3rdparty/googletest-1.8.0/src/googletest-1.8.0/googlemock/include -isystem /mesos/build/3rdparty/googletest-1.8.0/src/googletest-1.8.0/googletest/include    -o CMakeFiles/mesos-tests.dir/exception_tests.cpp.o -c /mesos/src/tests/exception_tests.cpp
/usr/bin/cmake -E cmake_progress_report /mesos/build/CMakeFiles 
[ 84%] Building CXX object src/tests/CMakeFiles/mesos-tests.dir/executor_http_api_tests.cpp.o
cd /mesos/build/src/tests && /usr/bin/g++   -DBUILD_DIR=\"/mesos/build\" -DBUILD_FLAGS=\"\" -DBUILD_JAVA_JVM_LIBRARY=\"\" -DHAS_AUTHENTICATION=1 -DLIBDIR=\"/usr/local/libmesos\" -DPICOJSON_USE_INT64 -DPKGDATADIR=\"/usr/local/share/mesos\" -DPKGLIBEXECDIR=\"/usr/local/libexec/mesos\" -DPKGMODULEDIR=\"\" -DSBINDIR=\"\" -DSOURCE_DIR=\"/mesos\" -DTESTLIBEXECDIR=\"\" -DUSE_CMAKE_BUILD_CONFIG -DUSE_SSL_SOCKET=1 -DUSE_STATIC_LIB -DVERSION=\"1.4.0\" -D__STDC_FORMAT_MACROS -std=c++11 -fPIE -I/mesos/build/include -I/mesos/build/include/mesos -I/mesos/build/src -I/mesos/src -isystem /mesos/build/3rdparty/protobuf-3.3.0/src/protobuf-3.3.0-lib/lib/include -isystem /mesos/3rdparty/libprocess/include -isystem /usr/include/apr-1.0 -isystem /mesos/build/3rdparty/boost-1.53.0/src/boost-1.53.0 -isystem /mesos/build/3rdparty/elfio-3.2/src/elfio-3.2 -isystem /mesos/build/3rdparty/glog-0.3.3/src/glog-0.3.3-lib/lib/include -isystem /mesos/build/3rdparty/nvml-352.79/src/nvml-352.79 -isystem /mesos/build/3rdparty/picojson-1.3.0/src/picojson-1.3.0 -isystem /usr/include/subversion-1 -isystem /mesos/3rdparty/stout/include -isystem /mesos/build/3rdparty/http_parser-2.6.2/src/http_parser-2.6.2 -isystem /mesos/build/3rdparty/concurrentqueue-1.0.0-beta/src/concurrentqueue-1.0.0-beta -isystem /mesos/build/3rdparty/libevent-2.1.5-beta/src/libevent-2.1.5-beta-lib/lib/include -isystem /mesos/build/3rdparty/zookeeper-3.4.8/src/zookeeper-3.4.8/src/c/include -isystem /mesos/build/3rdparty/zookeeper-3.4.8/src/zookeeper-3.4.8/src/c/generated -isystem /mesos/build/3rdparty/leveldb-1.19/src/leveldb-1.19/include -I/mesos/include -isystem /mesos/build/3rdparty/googletest-1.8.0/src/googletest-1.8.0/googlemock/include -isystem /mesos/build/3rdparty/googletest-1.8.0/src/googletest-1.8.0/googletest/include    -o CMakeFiles/mesos-tests.dir/executor_http_api_tests.cpp.o -c /mesos/src/tests/executor_http_api_tests.cpp
/usr/bin/cmake -E cmake_progress_report /mesos/build/CMakeFiles 
[ 84%] Building CXX object src/tests/CMakeFiles/mesos-tests.dir/fault_tolerance_tests.cpp.o
cd /mesos/build/src/tests && /usr/bin/g++   -DBUILD_DIR=\"/mesos/build\" -DBUILD_FLAGS=\"\" -DBUILD_JAVA_JVM_LIBRARY=\"\" -DHAS_AUTHENTICATION=1 -DLIBDIR=\"/usr/local/libmesos\" -DPICOJSON_USE_INT64 -DPKGDATADIR=\"/usr/local/share/mesos\" -DPKGLIBEXECDIR=\"/usr/local/libexec/mesos\" -DPKGMODULEDIR=\"\" -DSBINDIR=\"\" -DSOURCE_DIR=\"/mesos\" -DTESTLIBEXECDIR=\"\" -DUSE_CMAKE_BUILD_CONFIG -DUSE_SSL_SOCKET=1 -DUSE_STATIC_LIB -DVERSION=\"1.4.0\" -D__STDC_FORMAT_MACROS -std=c++11 -fPIE -I/mesos/build/include -I/mesos/build/include/mesos -I/mesos/build/src -I/mesos/src -isystem /mesos/build/3rdparty/protobuf-3.3.0/src/protobuf-3.3.0-lib/lib/include -isystem /mesos/3rdparty/libprocess/include -isystem /usr/include/apr-1.0 -isystem /mesos/build/3rdparty/boost-1.53.0/src/boost-1.53.0 -isystem /mesos/build/3rdparty/elfio-3.2/src/elfio-3.2 -isystem /mesos/build/3rdparty/glog-0.3.3/src/glog-0.3.3-lib/lib/include -isystem /mesos/build/3rdparty/nvml-352.79/src/nvml-352.79 -isystem /mesos/build/3rdparty/picojson-1.3.0/src/picojson-1.3.0 -isystem /usr/include/subversion-1 -isystem /mesos/3rdparty/stout/include -isystem /mesos/build/3rdparty/http_parser-2.6.2/src/http_parser-2.6.2 -isystem /mesos/build/3rdparty/concurrentqueue-1.0.0-beta/src/concurrentqueue-1.0.0-beta -isystem /mesos/build/3rdparty/libevent-2.1.5-beta/src/libevent-2.1.5-beta-lib/lib/include -isystem /mesos/build/3rdparty/zookeeper-3.4.8/src/zookeeper-3.4.8/src/c/include -isystem /mesos/build/3rdparty/zookeeper-3.4.8/src/zookeeper-3.4.8/src/c/generated -isystem /mesos/build/3rdparty/leveldb-1.19/src/leveldb-1.19/include -I/mesos/include -isystem /mesos/build/3rdparty/googletest-1.8.0/src/googletest-1.8.0/googlemock/include -isystem /mesos/build/3rdparty/googletest-1.8.0/src/googletest-1.8.0/googletest/include    -o CMakeFiles/mesos-tests.dir/fault_tolerance_tests.cpp.o -c /mesos/src/tests/fault_tolerance_tests.cpp
/usr/bin/cmake -E cmake_progress_report /mesos/build/CMakeFiles 
[ 84%] Building CXX object src/tests/CMakeFiles/mesos-tests.dir/fetcher_tests.cpp.o
cd /mesos/build/src/tests && /usr/bin/g++   -DBUILD_DIR=\"/mesos/build\" -DBUILD_FLAGS=\"\" -DBUILD_JAVA_JVM_LIBRARY=\"\" -DHAS_AUTHENTICATION=1 -DLIBDIR=\"/usr/local/libmesos\" -DPICOJSON_USE_INT64 -DPKGDATADIR=\"/usr/local/share/mesos\" -DPKGLIBEXECDIR=\"/usr/local/libexec/mesos\" -DPKGMODULEDIR=\"\" -DSBINDIR=\"\" -DSOURCE_DIR=\"/mesos\" -DTESTLIBEXECDIR=\"\" -DUSE_CMAKE_BUILD_CONFIG -DUSE_SSL_SOCKET=1 -DUSE_STATIC_LIB -DVERSION=\"1.4.0\" -D__STDC_FORMAT_MACROS -std=c++11 -fPIE -I/mesos/build/include -I/mesos/build/include/mesos -I/mesos/build/src -I/mesos/src -isystem /mesos/build/3rdparty/protobuf-3.3.0/src/protobuf-3.3.0-lib/lib/include -isystem /mesos/3rdparty/libprocess/include -isystem /usr/include/apr-1.0 -isystem /mesos/build/3rdparty/boost-1.53.0/src/boost-1.53.0 -isystem /mesos/build/3rdparty/elfio-3.2/src/elfio-3.2 -isystem /mesos/build/3rdparty/glog-0.3.3/src/glog-0.3.3-lib/lib/include -isystem /mesos/build/3rdparty/nvml-352.79/src/nvml-352.79 -isystem /mesos/build/3rdparty/picojson-1.3.0/src/picojson-1.3.0 -isystem /usr/include/subversion-1 -isystem /mesos/3rdparty/stout/include -isystem /mesos/build/3rdparty/http_parser-2.6.2/src/http_parser-2.6.2 -isystem /mesos/build/3rdparty/concurrentqueue-1.0.0-beta/src/concurrentqueue-1.0.0-beta -isystem /mesos/build/3rdparty/libevent-2.1.5-beta/src/libevent-2.1.5-beta-lib/lib/include -isystem /mesos/build/3rdparty/zookeeper-3.4.8/src/zookeeper-3.4.8/src/c/include -isystem /mesos/build/3rdparty/zookeeper-3.4.8/src/zookeeper-3.4.8/src/c/generated -isystem /mesos/build/3rdparty/leveldb-1.19/src/leveldb-1.19/include -I/mesos/include -isystem /mesos/build/3rdparty/googletest-1.8.0/src/googletest-1.8.0/googlemock/include -isystem /mesos/build/3rdparty/googletest-1.8.0/src/googletest-1.8.0/googletest/include    -o CMakeFiles/mesos-tests.dir/fetcher_tests.cpp.o -c /mesos/src/tests/fetcher_tests.cpp
/usr/bin/cmake -E cmake_progress_report /mesos/build/CMakeFiles 64
[ 85%] Building CXX object src/tests/CMakeFiles/mesos-tests.dir/files_tests.cpp.o
cd /mesos/build/src/tests && /usr/bin/g++   -DBUILD_DIR=\"/mesos/build\" -DBUILD_FLAGS=\"\" -DBUILD_JAVA_JVM_LIBRARY=\"\" -DHAS_AUTHENTICATION=1 -DLIBDIR=\"/usr/local/libmesos\" -DPICOJSON_USE_INT64 -DPKGDATADIR=\"/usr/local/share/mesos\" -DPKGLIBEXECDIR=\"/usr/local/libexec/mesos\" -DPKGMODULEDIR=\"\" -DSBINDIR=\"\" -DSOURCE_DIR=\"/mesos\" -DTESTLIBEXECDIR=\"\" -DUSE_CMAKE_BUILD_CONFIG -DUSE_SSL_SOCKET=1 -DUSE_STATIC_LIB -DVERSION=\"1.4.0\" -D__STDC_FORMAT_MACROS -std=c++11 -fPIE -I/mesos/build/include -I/mesos/build/include/mesos -I/mesos/build/src -I/mesos/src -isystem /mesos/build/3rdparty/protobuf-3.3.0/src/protobuf-3.3.0-lib/lib/include -isystem /mesos/3rdparty/libprocess/include -isystem /usr/include/apr-1.0 -isystem /mesos/build/3rdparty/boost-1.53.0/src/boost-1.53.0 -isystem /mesos/build/3rdparty/elfio-3.2/src/elfio-3.2 -isystem /mesos/build/3rdparty/glog-0.3.3/src/glog-0.3.3-lib/lib/include -isystem /mesos/build/3rdparty/nvml-352.79/src/nvml-352.79 -isystem /mesos/build/3rdparty/picojson-1.3.0/src/picojson-1.3.0 -isystem /usr/include/subversion-1 -isystem /mesos/3rdparty/stout/include -isystem /mesos/build/3rdparty/http_parser-2.6.2/src/http_parser-2.6.2 -isystem /mesos/build/3rdparty/concurrentqueue-1.0.0-beta/src/concurrentqueue-1.0.0-beta -isystem /mesos/build/3rdparty/libevent-2.1.5-beta/src/libevent-2.1.5-beta-lib/lib/include -isystem /mesos/build/3rdparty/zookeeper-3.4.8/src/zookeeper-3.4.8/src/c/include -isystem /mesos/build/3rdparty/zookeeper-3.4.8/src/zookeeper-3.4.8/src/c/generated -isystem /mesos/build/3rdparty/leveldb-1.19/src/leveldb-1.19/include -I/mesos/include -isystem /mesos/build/3rdparty/googletest-1.8.0/src/googletest-1.8.0/googlemock/include -isystem /mesos/build/3rdparty/googletest-1.8.0/src/googletest-1.8.0/googletest/include    -o CMakeFiles/mesos-tests.dir/files_tests.cpp.o -c /mesos/src/tests/files_tests.cpp
g++: internal compiler error: Killed (program cc1plus)
Please submit a full bug report,
with preprocessed source if appropriate.
See <file:///usr/share/doc/gcc-4.8/README.Bugs> for instructions.
make[3]: *** [src/tests/CMakeFiles/mesos-tests.dir/api_tests.cpp.o] Error 4
make[3]: *** Waiting for unfinished jobs....
make[3]: Leaving directory `/mesos/build'
make[2]: Leaving directory `/mesos/build'
make[2]: *** [src/tests/CMakeFiles/mesos-tests.dir/all] Error 2
make[1]: *** [CMakeFiles/check.dir/rule] Error 2
make[1]: Leaving directory `/mesos/build'
make: *** [check] Error 2
+ docker rmi mesos-1501547988-5805
Untagged: mesos-1501547988-5805:latest
Deleted: sha256:ae351a0c39e61c7086c392c9d3b76f04b3f062296ff9637c44961d27d0be4205
Deleted: sha256:12eb6652486e793b8519bfca4a7d85e3ad15d8dad13d4f961d1e14a324817ec9
Deleted: sha256:87f8e5adb901225c4e4155cf8e377188425a7af266cef75a58857f08f8a6a0dc
Deleted: sha256:e5aca517483a68a73d29984c0e489102876bd5a4dec53a0ff1298bc13723b746
Deleted: sha256:d9ddc1421fc0033cad9976ed39ede88cc24c11461785f159a26c2f6b6f9ec09d
Deleted: sha256:3336922527201a4b0d93537366a19ecced6c4bc7eb693717f238faa96173a30d
Deleted: sha256:e751195c149926f219ad465e1de6b49f9f2844fbe1f743e21c9de7a77c97e46e
Deleted: sha256:69a7e868879ef03e2f6c33226572a3ea44298cbfecbf4f00e22c85663e15f820
Deleted: sha256:ba20c6d8bab082a4f7ab5a3126fd57ff9afc198503b09efdb9f6107e6690c33c
Deleted: sha256:fc3017dbd73af817f33b5506f05a27242487444e89dc315e6397fe292708295c
Deleted: sha256:f8ed600c6d5b5f101a9809333a82598a7ae0c268b7ad19d44ecb58916ef9ee4c
Deleted: sha256:1205bb384e4525e70b20e503f97b9fd6868d66af4e4a429613d6e2a3bfffe07d
Deleted: sha256:85245a5e3c620c02538f3b203bba651ad2beccac9f0fefe7e69a425ae56a7015
Deleted: sha256:c93ede722a102b8ad3678505017bd521adb533a0a01c9be712f610ff4cf48b07
Deleted: sha256:3f7205ab1f7bde2f49882246cc516f977ec5ce5899710a9f64a9b693d24d5dc3
Deleted: sha256:bd85f1cc9ea27dc1b5bbae5e9831b6356a0902306a46639ad5a71292d3f31a3b
Deleted: sha256:8d9240552d8c34708b551d8dcfad96906eb53bac908b8f839b0bbc5a17165d72
Deleted: sha256:6b129286636d4f7fc1476ad2beb3a87eeb769a1a20d35f51702d23739814390e
Deleted: sha256:16b28d85e43d95d5fce2f6b74a3a050624ff01964be9362f3cd1753528589203
Deleted: sha256:c17069477ef912c4285b1ec64942a50c42cb2f4bfd9d3fb382443482f0052771
Deleted: sha256:6fe35941e752994ea2c1850422879ac06ea0a31b29761540463bc90625d896d5
Deleted: sha256:4980ac9380d4dff3f9c3ec485620b0c03234f471bd6a8b0467654710335317d2
Deleted: sha256:6ecb98ea6c4d366b75c583aa52fa6211e93d7d66d68cb3bdb725d6e77e9f60cd
Deleted: sha256:c745b3c73526f96db2cc95f9290404ce839c57e52f562a4fb77338a75747b983
Build step 'Execute shell' marked build as failure
Not sending mail to unregistered user songzihao1990@gmail.com

Mime
View raw message