mesos-builds mailing list archives

Site index · List index
Message view « Date » · « Thread »
Top « Date » · « Thread »
From Apache Jenkins Server <jenk...@builds.apache.org>
Subject Build failed in Jenkins: Mesos-Buildbot » autotools,gcc,--verbose --enable-libevent --enable-ssl,GLOG_v=1 MESOS_VERBOSE=1,centos:7,(ubuntu)&&(!ubuntu-us1)&&(!ubuntu-eu2) #4120
Date Thu, 17 Aug 2017 14:58:57 GMT
See <https://builds.apache.org/job/Mesos-Buildbot/BUILDTOOL=autotools,COMPILER=gcc,CONFIGURATION=--verbose%20--enable-libevent%20--enable-ssl,ENVIRONMENT=GLOG_v=1%20MESOS_VERBOSE=1,OS=centos%3A7,label_exp=(ubuntu)&&(!ubuntu-us1)&&(!ubuntu-eu2)/4120/display/redirect?page=changes>

Changes:

[songzihao1990] Fixed mesos containerizer to support docker image WORKDIR missing.

[songzihao1990] Added MESOS-7652 to 1.3.2 CHANGELOG.

[songzihao1990] Added MESOS-7652 to 1.2.3 CHANGELOG.

[songzihao1990] Added MESOS-7652 to 1.1.3 CHANGELOG.

[mpark] Updated website for 1.3.1 release.

------------------------------------------
[...truncated 32.21 MB...]
I0817 14:58:40.655540 30346 credentials.hpp:86] Loading credential for authentication from
'/tmp/Endpoint_SlaveEndpointTest_UnauthorizedRequest_0_USKVuY/credential'
I0817 14:58:40.655748 30346 slave.cpp:283] Agent using credential for: test-principal
I0817 14:58:40.655767 30346 credentials.hpp:37] Loading credentials for authentication from
'/tmp/Endpoint_SlaveEndpointTest_UnauthorizedRequest_0_USKVuY/http_credentials'
I0817 14:58:40.656092 30346 http.cpp:1026] Creating default 'basic' HTTP authenticator for
realm 'mesos-agent-executor'
I0817 14:58:40.656230 30346 http.cpp:1047] Creating default 'jwt' HTTP authenticator for realm
'mesos-agent-executor'
I0817 14:58:40.656455 30346 http.cpp:1026] Creating default 'basic' HTTP authenticator for
realm 'mesos-agent-readonly'
I0817 14:58:40.656559 30346 http.cpp:1047] Creating default 'jwt' HTTP authenticator for realm
'mesos-agent-readonly'
I0817 14:58:40.656764 30346 http.cpp:1026] Creating default 'basic' HTTP authenticator for
realm 'mesos-agent-readwrite'
I0817 14:58:40.656858 30346 http.cpp:1047] Creating default 'jwt' HTTP authenticator for realm
'mesos-agent-readwrite'
I0817 14:58:40.658589 30346 slave.cpp:565] Agent resources: [{"name":"cpus","scalar":{"value":2.0},"type":"SCALAR"},{"name":"mem","scalar":{"value":1024.0},"type":"SCALAR"},{"name":"disk","scalar":{"value":1024.0},"type":"SCALAR"},{"name":"ports","ranges":{"range":[{"begin":31000,"end":32000}]},"type":"RANGES"}]
I0817 14:58:40.658890 30346 slave.cpp:573] Agent attributes: [  ]
I0817 14:58:40.658929 30346 slave.cpp:582] Agent hostname: ec6b7589084c
I0817 14:58:40.659101 30360 status_update_manager.cpp:177] Pausing sending status updates
I0817 14:58:40.661257 30362 state.cpp:64] Recovering state from '/tmp/Endpoint_SlaveEndpointTest_UnauthorizedRequest_0_lBnd93/meta'
I0817 14:58:40.661618 30348 status_update_manager.cpp:203] Recovering status update manager
I0817 14:58:40.661844 30352 containerizer.cpp:609] Recovering containerizer
I0817 14:58:40.663635 30368 provisioner.cpp:416] Provisioner recovery complete
I0817 14:58:40.664026 30353 slave.cpp:6210] Finished recovery
I0817 14:58:40.664556 30353 slave.cpp:6392] Querying resource estimator for oversubscribable
resources
I0817 14:58:40.665040 30353 slave.cpp:6406] Received oversubscribable resources {} from the
resource estimator
I0817 14:58:40.668478 30358 process.cpp:3933] Handling HTTP event for process 'slave(803)'
with path: '/slave(803)/monitor/statistics'
I0817 14:58:40.670931 30354 http.cpp:1166] HTTP GET for /slave(803)/monitor/statistics from
172.17.0.7:44652
I0817 14:58:40.671013 30354 http.cpp:957] Authorizing principal 'test-principal' to GET the
'/monitor/statistics' endpoint
I0817 14:58:40.672981 30346 slave.cpp:843] Agent terminating
[       OK ] Endpoint/SlaveEndpointTest.UnauthorizedRequest/0 (37 ms)
[ RUN      ] Endpoint/SlaveEndpointTest.UnauthorizedRequest/1
I0817 14:58:40.686262  9443 containerizer.cpp:246] Using isolation: posix/cpu,posix/mem,filesystem/posix,network/cni,environment_secret
W0817 14:58:40.686911  9443 backend.cpp:76] Failed to create 'aufs' backend: AufsBackend requires
root privileges
W0817 14:58:40.687033  9443 backend.cpp:76] Failed to create 'bind' backend: BindBackend requires
root privileges
I0817 14:58:40.687072  9443 provisioner.cpp:255] Using default backend 'copy'
I0817 14:58:40.691192 30363 slave.cpp:250] Mesos agent started on (804)@172.17.0.7:36521
I0817 14:58:40.691450 30363 slave.cpp:251] Flags at startup: --acls="" --appc_simple_discovery_uri_prefix="http://"
--appc_store_dir="/tmp/Endpoint_SlaveEndpointTest_UnauthorizedRequest_1_DvANcC/store/appc"
--authenticate_http_executors="true" --authenticate_http_readonly="true" --authenticate_http_readwrite="true"
--authenticatee="crammd5" --authentication_backoff_factor="1secs" --authorizer="local" --cgroups_cpu_enable_pids_and_tids_count="false"
--cgroups_enable_cfs="false" --cgroups_hierarchy="/sys/fs/cgroup" --cgroups_limit_swap="false"
--cgroups_root="mesos" --container_disk_watch_interval="15secs" --containerizers="mesos" --credential="/tmp/Endpoint_SlaveEndpointTest_UnauthorizedRequest_1_DvANcC/credential"
--default_role="*" --disallow_sharing_agent_pid_namespace="false" --disk_watch_interval="1mins"
--docker="docker" --docker_kill_orphans="true" --docker_registry="https://registry-1.docker.io"
--docker_remove_delay="6hrs" --docker_socket="/var/run/docker.sock" --docker_stop_timeout="0ns"
--docker_store_dir="/tmp/Endpoint_SlaveEndpointTest_UnauthorizedRequest_1_DvANcC/store/docker"
--docker_volume_checkpoint_dir="/var/run/mesos/isolators/docker/volume" --enforce_container_disk_quota="false"
--executor_registration_timeout="1mins" --executor_reregistration_timeout="2secs" --executor_secret_key="/tmp/Endpoint_SlaveEndpointTest_UnauthorizedRequest_1_DvANcC/executor_secret_key"
--executor_shutdown_grace_period="5secs" --fetcher_cache_dir="/tmp/Endpoint_SlaveEndpointTest_UnauthorizedRequest_1_DvANcC/fetch"
--fetcher_cache_size="2GB" --frameworks_home="" --gc_delay="1weeks" --gc_disk_headroom="0.1"
--hadoop_home="" --help="false" --hostname_lookup="true" --http_command_executor="false" --http_credentials="/tmp/Endpoint_SlaveEndpointTest_UnauthorizedRequest_1_DvANcC/http_credentials"
--http_heartbeat_interval="30secs" --initialize_driver_logging="true" --isolation="posix/cpu,posix/mem"
--launcher="posix" --launcher_dir="/mesos/mesos-1.4.0/_build/src" --logbufsecs="0" --logging_level="INFO"
--max_completed_executors_per_framework="150" --oversubscribed_resources_interval="15secs"
--perf_duration="10secs" --perf_interval="1mins" --port="5051" --qos_correction_interval_min="0ns"
--quiet="false" --recover="reconnect" --recovery_timeout="15mins" --registration_backoff_factor="10ms"
--resources="cpus:2;gpus:0;mem:1024;disk:1024;ports:[31000-32000]" --revocable_cpu_low_priority="true"
--runtime_dir="/tmp/Endpoint_SlaveEndpointTest_UnauthorizedRequest_1_DvANcC" --sandbox_directory="/mnt/mesos/sandbox"
--strict="true" --switch_user="true" --systemd_enable_support="true" --systemd_runtime_directory="/run/systemd/system"
--version="false" --work_dir="/tmp/Endpoint_SlaveEndpointTest_UnauthorizedRequest_1_xMMxLH"
I0817 14:58:40.692195 30363 credentials.hpp:86] Loading credential for authentication from
'/tmp/Endpoint_SlaveEndpointTest_UnauthorizedRequest_1_DvANcC/credential'
I0817 14:58:40.692571 30363 slave.cpp:283] Agent using credential for: test-principal
I0817 14:58:40.692788 30363 credentials.hpp:37] Loading credentials for authentication from
'/tmp/Endpoint_SlaveEndpointTest_UnauthorizedRequest_1_DvANcC/http_credentials'
I0817 14:58:40.693313 30363 http.cpp:1026] Creating default 'basic' HTTP authenticator for
realm 'mesos-agent-executor'
I0817 14:58:40.693647 30363 http.cpp:1047] Creating default 'jwt' HTTP authenticator for realm
'mesos-agent-executor'
I0817 14:58:40.694067 30363 http.cpp:1026] Creating default 'basic' HTTP authenticator for
realm 'mesos-agent-readonly'
I0817 14:58:40.694386 30363 http.cpp:1047] Creating default 'jwt' HTTP authenticator for realm
'mesos-agent-readonly'
I0817 14:58:40.694768 30363 http.cpp:1026] Creating default 'basic' HTTP authenticator for
realm 'mesos-agent-readwrite'
I0817 14:58:40.695067 30363 http.cpp:1047] Creating default 'jwt' HTTP authenticator for realm
'mesos-agent-readwrite'
I0817 14:58:40.696955 30363 slave.cpp:565] Agent resources: [{"name":"cpus","scalar":{"value":2.0},"type":"SCALAR"},{"name":"mem","scalar":{"value":1024.0},"type":"SCALAR"},{"name":"disk","scalar":{"value":1024.0},"type":"SCALAR"},{"name":"ports","ranges":{"range":[{"begin":31000,"end":32000}]},"type":"RANGES"}]
I0817 14:58:40.697253 30363 slave.cpp:573] Agent attributes: [  ]
I0817 14:58:40.697291 30363 slave.cpp:582] Agent hostname: ec6b7589084c
I0817 14:58:40.697484 30361 status_update_manager.cpp:177] Pausing sending status updates
I0817 14:58:40.699291 30352 state.cpp:64] Recovering state from '/tmp/Endpoint_SlaveEndpointTest_UnauthorizedRequest_1_xMMxLH/meta'
I0817 14:58:40.699856 30359 status_update_manager.cpp:203] Recovering status update manager
I0817 14:58:40.700081 30356 containerizer.cpp:609] Recovering containerizer
I0817 14:58:40.701508 30351 provisioner.cpp:416] Provisioner recovery complete
I0817 14:58:40.701979 30363 slave.cpp:6210] Finished recovery
I0817 14:58:40.702528 30363 slave.cpp:6392] Querying resource estimator for oversubscribable
resources
I0817 14:58:40.702816 30365 slave.cpp:6406] Received oversubscribable resources {} from the
resource estimator
I0817 14:58:40.705775 30353 process.cpp:3933] Handling HTTP event for process 'slave(804)'
with path: '/slave(804)/monitor/statistics.json'
I0817 14:58:40.707638 30360 http.cpp:1166] HTTP GET for /slave(804)/monitor/statistics.json
from 172.17.0.7:44658
I0817 14:58:40.707720 30360 http.cpp:957] Authorizing principal 'test-principal' to GET the
'/monitor/statistics.json' endpoint
I0817 14:58:40.709915  9443 slave.cpp:843] Agent terminating
[       OK ] Endpoint/SlaveEndpointTest.UnauthorizedRequest/1 (37 ms)
[ RUN      ] Endpoint/SlaveEndpointTest.UnauthorizedRequest/2
I0817 14:58:40.723199  9443 containerizer.cpp:246] Using isolation: posix/cpu,posix/mem,filesystem/posix,network/cni,environment_secret
W0817 14:58:40.723865  9443 backend.cpp:76] Failed to create 'aufs' backend: AufsBackend requires
root privileges
W0817 14:58:40.723986  9443 backend.cpp:76] Failed to create 'bind' backend: BindBackend requires
root privileges
I0817 14:58:40.724023  9443 provisioner.cpp:255] Using default backend 'copy'
I0817 14:58:40.728123 30365 slave.cpp:250] Mesos agent started on (805)@172.17.0.7:36521
I0817 14:58:40.728166 30365 slave.cpp:251] Flags at startup: --acls="" --appc_simple_discovery_uri_prefix="http://"
--appc_store_dir="/tmp/Endpoint_SlaveEndpointTest_UnauthorizedRequest_2_50YTgg/store/appc"
--authenticate_http_executors="true" --authenticate_http_readonly="true" --authenticate_http_readwrite="true"
--authenticatee="crammd5" --authentication_backoff_factor="1secs" --authorizer="local" --cgroups_cpu_enable_pids_and_tids_count="false"
--cgroups_enable_cfs="false" --cgroups_hierarchy="/sys/fs/cgroup" --cgroups_limit_swap="false"
--cgroups_root="mesos" --container_disk_watch_interval="15secs" --containerizers="mesos" --credential="/tmp/Endpoint_SlaveEndpointTest_UnauthorizedRequest_2_50YTgg/credential"
--default_role="*" --disallow_sharing_agent_pid_namespace="false" --disk_watch_interval="1mins"
--docker="docker" --docker_kill_orphans="true" --docker_registry="https://registry-1.docker.io"
--docker_remove_delay="6hrs" --docker_socket="/var/run/docker.sock" --docker_stop_timeout="0ns"
--docker_store_dir="/tmp/Endpoint_SlaveEndpointTest_UnauthorizedRequest_2_50YTgg/store/docker"
--docker_volume_checkpoint_dir="/var/run/mesos/isolators/docker/volume" --enforce_container_disk_quota="false"
--executor_registration_timeout="1mins" --executor_reregistration_timeout="2secs" --executor_secret_key="/tmp/Endpoint_SlaveEndpointTest_UnauthorizedRequest_2_50YTgg/executor_secret_key"
--executor_shutdown_grace_period="5secs" --fetcher_cache_dir="/tmp/Endpoint_SlaveEndpointTest_UnauthorizedRequest_2_50YTgg/fetch"
--fetcher_cache_size="2GB" --frameworks_home="" --gc_delay="1weeks" --gc_disk_headroom="0.1"
--hadoop_home="" --help="false" --hostname_lookup="true" --http_command_executor="false" --http_credentials="/tmp/Endpoint_SlaveEndpointTest_UnauthorizedRequest_2_50YTgg/http_credentials"
--http_heartbeat_interval="30secs" --initialize_driver_logging="true" --isolation="posix/cpu,posix/mem"
--launcher="posix" --launcher_dir="/mesos/mesos-1.4.0/_build/src" --logbufsecs="0" --logging_level="INFO"
--max_completed_executors_per_framework="150" --oversubscribed_resources_interval="15secs"
--perf_duration="10secs" --perf_interval="1mins" --port="5051" --qos_correction_interval_min="0ns"
--quiet="false" --recover="reconnect" --recovery_timeout="15mins" --registration_backoff_factor="10ms"
--resources="cpus:2;gpus:0;mem:1024;disk:1024;ports:[31000-32000]" --revocable_cpu_low_priority="true"
--runtime_dir="/tmp/Endpoint_SlaveEndpointTest_UnauthorizedRequest_2_50YTgg" --sandbox_directory="/mnt/mesos/sandbox"
--strict="true" --switch_user="true" --systemd_enable_support="true" --systemd_runtime_directory="/run/systemd/system"
--version="false" --work_dir="/tmp/Endpoint_SlaveEndpointTest_UnauthorizedRequest_2_uFB7Jl"
I0817 14:58:40.728826 30365 credentials.hpp:86] Loading credential for authentication from
'/tmp/Endpoint_SlaveEndpointTest_UnauthorizedRequest_2_50YTgg/credential'
I0817 14:58:40.729032 30365 slave.cpp:283] Agent using credential for: test-principal
I0817 14:58:40.729075 30365 credentials.hpp:37] Loading credentials for authentication from
'/tmp/Endpoint_SlaveEndpointTest_UnauthorizedRequest_2_50YTgg/http_credentials'
I0817 14:58:40.729418 30365 http.cpp:1026] Creating default 'basic' HTTP authenticator for
realm 'mesos-agent-executor'
I0817 14:58:40.729576 30365 http.cpp:1047] Creating default 'jwt' HTTP authenticator for realm
'mesos-agent-executor'
I0817 14:58:40.729900 30365 http.cpp:1026] Creating default 'basic' HTTP authenticator for
realm 'mesos-agent-readonly'
I0817 14:58:40.730118 30365 http.cpp:1047] Creating default 'jwt' HTTP authenticator for realm
'mesos-agent-readonly'
I0817 14:58:40.730351 30365 http.cpp:1026] Creating default 'basic' HTTP authenticator for
realm 'mesos-agent-readwrite'
I0817 14:58:40.730474 30365 http.cpp:1047] Creating default 'jwt' HTTP authenticator for realm
'mesos-agent-readwrite'
I0817 14:58:40.732385 30365 slave.cpp:565] Agent resources: [{"name":"cpus","scalar":{"value":2.0},"type":"SCALAR"},{"name":"mem","scalar":{"value":1024.0},"type":"SCALAR"},{"name":"disk","scalar":{"value":1024.0},"type":"SCALAR"},{"name":"ports","ranges":{"range":[{"begin":31000,"end":32000}]},"type":"RANGES"}]
I0817 14:58:40.732707 30365 slave.cpp:573] Agent attributes: [  ]
I0817 14:58:40.732738 30365 slave.cpp:582] Agent hostname: ec6b7589084c
I0817 14:58:40.732996 30368 status_update_manager.cpp:177] Pausing sending status updates
I0817 14:58:40.734915 30352 state.cpp:64] Recovering state from '/tmp/Endpoint_SlaveEndpointTest_UnauthorizedRequest_2_uFB7Jl/meta'
I0817 14:58:40.735244 30348 status_update_manager.cpp:203] Recovering status update manager
I0817 14:58:40.735445 30357 containerizer.cpp:609] Recovering containerizer
I0817 14:58:40.737287 30346 provisioner.cpp:416] Provisioner recovery complete
I0817 14:58:40.737601 30352 slave.cpp:6210] Finished recovery
I0817 14:58:40.738134 30352 slave.cpp:6392] Querying resource estimator for oversubscribable
resources
I0817 14:58:40.738453 30352 slave.cpp:6406] Received oversubscribable resources {} from the
resource estimator
I0817 14:58:40.741207 30357 process.cpp:3933] Handling HTTP event for process 'slave(805)'
with path: '/slave(805)/containers'
I0817 14:58:40.743458 30365 http.cpp:1166] HTTP GET for /slave(805)/containers from 172.17.0.7:44662
I0817 14:58:40.743537 30365 http.cpp:957] Authorizing principal 'test-principal' to GET the
'/containers' endpoint
I0817 14:58:40.747627  9443 slave.cpp:843] Agent terminating
[       OK ] Endpoint/SlaveEndpointTest.UnauthorizedRequest/2 (36 ms)
[ RUN      ] Endpoint/SlaveEndpointTest.NoAuthorizer/0
I0817 14:58:40.760463  9443 containerizer.cpp:246] Using isolation: posix/cpu,posix/mem,filesystem/posix,network/cni,environment_secret
W0817 14:58:40.761121  9443 backend.cpp:76] Failed to create 'aufs' backend: AufsBackend requires
root privileges
W0817 14:58:40.761241  9443 backend.cpp:76] Failed to create 'bind' backend: BindBackend requires
root privileges
I0817 14:58:40.761278  9443 provisioner.cpp:255] Using default backend 'copy'
I0817 14:58:40.763314  9443 cluster.cpp:448] Creating default 'local' authorizer
I0817 14:58:40.765506 30349 slave.cpp:250] Mesos agent started on (806)@172.17.0.7:36521
I0817 14:58:40.765532 30349 slave.cpp:251] Flags at startup: --acls="" --appc_simple_discovery_uri_prefix="http://"
--appc_store_dir="/tmp/Endpoint_SlaveEndpointTest_NoAuthorizer_0_UEoPGU/store/appc" --authenticate_http_executors="true"
--authenticate_http_readonly="true" --authenticate_http_readwrite="true" --authenticatee="crammd5"
--authentication_backoff_factor="1secs" --authorizer="local" --cgroups_cpu_enable_pids_and_tids_count="false"
--cgroups_enable_cfs="false" --cgroups_hierarchy="/sys/fs/cgroup" --cgroups_limit_swap="false"
--cgroups_root="mesos" --container_disk_watch_interval="15secs" --containerizers="mesos" --credential="/tmp/Endpoint_SlaveEndpointTest_NoAuthorizer_0_UEoPGU/credential"
--default_role="*" --disallow_sharing_agent_pid_namespace="false" --disk_watch_interval="1mins"
--docker="docker" --docker_kill_orphans="true" --docker_registry="https://registry-1.docker.io"
--docker_remove_delay="6hrs" --docker_socket="/var/run/docker.sock" --docker_stop_timeout="0ns"
--docker_store_dir="/tmp/Endpoint_SlaveEndpointTest_NoAuthorizer_0_UEoPGU/store/docker" --docker_volume_checkpoint_dir="/var/run/mesos/isolators/docker/volume"
--enforce_container_disk_quota="false" --executor_registration_timeout="1mins" --executor_reregistration_timeout="2secs"
--executor_secret_key="/tmp/Endpoint_SlaveEndpointTest_NoAuthorizer_0_UEoPGU/executor_secret_key"
--executor_shutdown_grace_period="5secs" --fetcher_cache_dir="/tmp/Endpoint_SlaveEndpointTest_NoAuthorizer_0_UEoPGU/fetch"
--fetcher_cache_size="2GB" --frameworks_home="" --gc_delay="1weeks" --gc_disk_headroom="0.1"
--hadoop_home="" --help="false" --hostname_lookup="true" --http_command_executor="false" --http_credentials="/tmp/Endpoint_SlaveEndpointTest_NoAuthorizer_0_UEoPGU/http_credentials"
--http_heartbeat_interval="30secs" --initialize_driver_logging="true" --isolation="posix/cpu,posix/mem"
--launcher="posix" --launcher_dir="/mesos/mesos-1.4.0/_build/src" --logbufsecs="0" --logging_level="INFO"
--max_completed_executors_per_framework="150" --oversubscribed_resources_interval="15secs"
--perf_duration="10secs" --perf_interval="1mins" --port="5051" --qos_correction_interval_min="0ns"
--quiet="false" --recover="reconnect" --recovery_timeout="15mins" --registration_backoff_factor="10ms"
--resources="cpus:2;gpus:0;mem:1024;disk:1024;ports:[31000-32000]" --revocable_cpu_low_priority="true"
--runtime_dir="/tmp/Endpoint_SlaveEndpointTest_NoAuthorizer_0_UEoPGU" --sandbox_directory="/mnt/mesos/sandbox"
--strict="true" --switch_user="true" --systemd_enable_support="true" --systemd_runtime_directory="/run/systemd/system"
--version="false" --work_dir="/tmp/Endpoint_SlaveEndpointTest_NoAuthorizer_0_f6Wx4Z"
I0817 14:58:40.766160 30349 credentials.hpp:86] Loading credential for authentication from
'/tmp/Endpoint_SlaveEndpointTest_NoAuthorizer_0_UEoPGU/credential'
I0817 14:58:40.766400 30349 slave.cpp:283] Agent using credential for: test-principal
I0817 14:58:40.766450 30349 credentials.hpp:37] Loading credentials for authentication from
'/tmp/Endpoint_SlaveEndpointTest_NoAuthorizer_0_UEoPGU/http_credentials'
I0817 14:58:40.766865 30349 http.cpp:1026] Creating default 'basic' HTTP authenticator for
realm 'mesos-agent-executor'
I0817 14:58:40.767027 30349 http.cpp:1047] Creating default 'jwt' HTTP authenticator for realm
'mesos-agent-executor'
I0817 14:58:40.767268 30349 http.cpp:1026] Creating default 'basic' HTTP authenticator for
realm 'mesos-agent-readonly'
I0817 14:58:40.767390 30349 http.cpp:1047] Creating default 'jwt' HTTP authenticator for realm
'mesos-agent-readonly'
I0817 14:58:40.767591 30349 http.cpp:1026] Creating default 'basic' HTTP authenticator for
realm 'mesos-agent-readwrite'
I0817 14:58:40.767791 30349 http.cpp:1047] Creating default 'jwt' HTTP authenticator for realm
'mesos-agent-readwrite'
I0817 14:58:40.769512 30349 slave.cpp:565] Agent resources: [{"name":"cpus","scalar":{"value":2.0},"type":"SCALAR"},{"name":"mem","scalar":{"value":1024.0},"type":"SCALAR"},{"name":"disk","scalar":{"value":1024.0},"type":"SCALAR"},{"name":"ports","ranges":{"range":[{"begin":31000,"end":32000}]},"type":"RANGES"}]
I0817 14:58:40.769827 30349 slave.cpp:573] Agent attributes: [  ]
I0817 14:58:40.769858 30349 slave.cpp:582] Agent hostname: ec6b7589084c
I0817 14:58:40.770011 30346 status_update_manager.cpp:177] Pausing sending status updates
I0817 14:58:40.771822 30365 state.cpp:64] Recovering state from '/tmp/Endpoint_SlaveEndpointTest_NoAuthorizer_0_f6Wx4Z/meta'
I0817 14:58:40.772130 30363 status_update_manager.cpp:203] Recovering status update manager
I0817 14:58:40.772369 30347 containerizer.cpp:609] Recovering containerizer
I0817 14:58:40.773967 30367 provisioner.cpp:416] Provisioner recovery complete
I0817 14:58:40.774304 30349 slave.cpp:6210] Finished recovery
I0817 14:58:40.774847 30349 slave.cpp:6392] Querying resource estimator for oversubscribable
resources
I0817 14:58:40.775094 30345 slave.cpp:6406] Received oversubscribable resources {} from the
resource estimator
I0817 14:58:40.777524 30357 process.cpp:3933] Handling HTTP event for process 'slave(806)'
with path: '/slave(806)/monitor/statistics'
I0817 14:58:40.779373 30362 http.cpp:1166] HTTP GET for /slave(806)/monitor/statistics from
172.17.0.7:44666
I0817 14:58:40.779451 30362 http.cpp:957] Authorizing principal 'test-principal' to GET the
'/monitor/statistics' endpoint
I0817 14:58:40.783131 30353 slave.cpp:843] Agent terminating
[       OK ] Endpoint/SlaveEndpointTest.NoAuthorizer/0 (35 ms)
[ RUN      ] Endpoint/SlaveEndpointTest.NoAuthorizer/1
I0817 14:58:40.795920  9443 containerizer.cpp:246] Using isolation: posix/cpu,posix/mem,filesystem/posix,network/cni,environment_secret
W0817 14:58:40.796747  9443 backend.cpp:76] Failed to create 'aufs' backend: AufsBackend requires
root privileges
W0817 14:58:40.797010  9443 backend.cpp:76] Failed to create 'bind' backend: BindBackend requires
root privileges
I0817 14:58:40.797179  9443 provisioner.cpp:255] Using default backend 'copy'
I0817 14:58:40.799494  9443 cluster.cpp:448] Creating default 'local' authorizer
I0817 14:58:40.801749 30361 slave.cpp:250] Mesos agent started on (807)@172.17.0.7:36521
I0817 14:58:40.801923 30361 slave.cpp:251] Flags at startup: --acls="" --appc_simple_discovery_uri_prefix="http://"
--appc_store_dir="/tmp/Endpoint_SlaveEndpointTest_NoAuthorizer_1_XE28rz/store/appc" --authenticate_http_executors="true"
--authenticate_http_readonly="true" --authenticate_http_readwrite="true" --authenticatee="crammd5"
--authentication_backoff_factor="1secs" --authorizer="local" --cgroups_cpu_enable_pids_and_tids_count="false"
--cgroups_enable_cfs="false" --cgroups_hierarchy="/sys/fs/cgroup" --cgroups_limit_swap="false"
--cgroups_root="mesos" --container_disk_watch_interval="15secs" --containerizers="mesos" --credential="/tmp/Endpoint_SlaveEndpointTest_NoAuthorizer_1_XE28rz/credential"
--default_role="*" --disallow_sharing_agent_pid_namespace="false" --disk_watch_interval="1mins"
--docker="docker" --docker_kill_orphans="true" --docker_registry="https://registry-1.docker.io"
--docker_remove_delay="6hrs" --docker_socket="/var/run/docker.sock" --docker_stop_timeout="0ns"
--docker_store_dir="/tmp/Endpoint_SlaveEndpointTest_NoAuthorizer_1_XE28rz/store/docker" --docker_volume_checkpoint_dir="/var/run/mesos/isolators/docker/volume"
--enforce_container_disk_quota="false" --executor_registration_timeout="1mins" --executor_reregistration_timeout="2secs"
--executor_secret_key="/tmp/Endpoint_SlaveEndpointTest_NoAuthorizer_1_XE28rz/executor_secret_key"
--executor_shutdown_grace_period="5secs" --fetcher_cache_dir="/tmp/Endpoint_SlaveEndpointTest_NoAuthorizer_1_XE28rz/fetch"
--fetcher_cache_size="2GB" --frameworks_home="" --gc_delay="1weeks" --gc_disk_headroom="0.1"
--hadoop_home="" --help="false" --hostname_lookup="true" --http_command_executor="false" --http_credentials="/tmp/Endpoint_SlaveEndpointTest_NoAuthorizer_1_XE28rz/http_credentials"
--http_heartbeat_interval="30secs" --initialize_driver_logging="true" --isolation="posix/cpu,posix/mem"
--launcher="posix" --launcher_dir="/mesos/mesos-1.4.0/_build/src" --logbufsecs="0" --logging_level="INFO"
--max_completed_executors_per_framework="150" --oversubscribed_resources_interval="15secs"
--perf_duration="10secs" --perf_interval="1mins" --port="5051" --qos_correction_interval_min="0ns"
--quiet="false" --recover="reconnect" --recovery_timeout="15mins" --registration_backoff_factor="10ms"
--resources="cpus:2;gpus:0;mem:1024;disk:1024;ports:[31000-32000]" --revocable_cpu_low_priority="true"
--runtime_dir="/tmp/Endpoint_SlaveEndpointTest_NoAuthorizer_1_XE28rz" --sandbox_directory="/mnt/mesos/sandbox"
--strict="true" --switch_user="true" --systemd_enable_support="true" --systemd_runtime_directory="/run/systemd/system"
--version="false" --work_dir="/tmp/Endpoint_SlaveEndpointTest_NoAuthorizer_1_B4jyKE"
I0817 14:58:40.802651 30361 credentials.hpp:86] Loading credential for authentication from
'/tmp/Endpoint_SlaveEndpointTest_NoAuthorizer_1_XE28rz/credential'
I0817 14:58:40.802963 30361 slave.cpp:283] Agent using credential for: test-principal
I0817 14:58:40.803119 30361 credentials.hpp:37] Loading credentials for authentication from
'/tmp/Endpoint_SlaveEndpointTest_NoAuthorizer_1_XE28rz/http_credentials'
I0817 14:58:40.803573 30361 http.cpp:1026] Creating default 'basic' HTTP authenticator for
realm 'mesos-agent-executor'
I0817 14:58:40.803848 30361 http.cpp:1047] Creating default 'jwt' HTTP authenticator for realm
'mesos-agent-executor'
I0817 14:58:40.804206 30361 http.cpp:1026] Creating default 'basic' HTTP authenticator for
realm 'mesos-agent-readonly'
I0817 14:58:40.804441 30361 http.cpp:1047] Creating default 'jwt' HTTP authenticator for realm
'mesos-agent-readonly'
I0817 14:58:40.804760 30361 http.cpp:1026] Creating default 'basic' HTTP authenticator for
realm 'mesos-agent-readwrite'
I0817 14:58:40.804994 30361 http.cpp:1047] Creating default 'jwt' HTTP authenticator for realm
'mesos-agent-readwrite'
I0817 14:58:40.806885 30361 slave.cpp:565] Agent resources: [{"name":"cpus","scalar":{"value":2.0},"type":"SCALAR"},{"name":"mem","scalar":{"value":1024.0},"type":"SCALAR"},{"name":"disk","scalar":{"value":1024.0},"type":"SCALAR"},{"name":"ports","ranges":{"range":[{"begin":31000,"end":32000}]},"type":"RANGES"}]
I0817 14:58:40.807333 30361 slave.cpp:573] Agent attributes: [  ]
I0817 14:58:40.807473 30361 slave.cpp:582] Agent hostname: ec6b7589084c
I0817 14:58:40.807737 30359 status_update_manager.cpp:177] Pausing sending status updates
I0817 14:58:40.809494 30365 state.cpp:64] Recovering state from '/tmp/Endpoint_SlaveEndpointTest_NoAuthorizer_1_B4jyKE/meta'
I0817 14:58:40.809782 30347 status_update_manager.cpp:203] Recovering status update manager
I0817 14:58:40.809974 30368 containerizer.cpp:609] Recovering containerizer
I0817 14:58:40.811676 30363 provisioner.cpp:416] Provisioner recovery complete
I0817 14:58:40.812046 30351 slave.cpp:6210] Finished recovery
I0817 14:58:40.812738 30351 slave.cpp:6392] Querying resource estimator for oversubscribable
resources
I0817 14:58:40.813349 30354 slave.cpp:6406] Received oversubscribable resources {} from the
resource estimator
I0817 14:58:40.815918 30362 process.cpp:3933] Handling HTTP event for process 'slave(807)'
with path: '/slave(807)/monitor/statistics.json'
I0817 14:58:40.817715 30347 http.cpp:1166] HTTP GET for /slave(807)/monitor/statistics.json
from 172.17.0.7:44668
I0817 14:58:40.817797 30347 http.cpp:957] Authorizing principal 'test-principal' to GET the
'/monitor/statistics.json' endpoint
I0817 14:58:40.820621 30345 slave.cpp:843] Agent terminating
[       OK ] Endpoint/SlaveEndpointTest.NoAuthorizer/1 (39 ms)
[ RUN      ] Endpoint/SlaveEndpointTest.NoAuthorizer/2
I0817 14:58:40.835567  9443 containerizer.cpp:246] Using isolation: posix/cpu,posix/mem,filesystem/posix,network/cni,environment_secret
W0817 14:58:40.836433  9443 backend.cpp:76] Failed to create 'aufs' backend: AufsBackend requires
root privileges
W0817 14:58:40.836731  9443 backend.cpp:76] Failed to create 'bind' backend: BindBackend requires
root privileges
I0817 14:58:40.836915  9443 provisioner.cpp:255] Using default backend 'copy'
I0817 14:58:40.839295  9443 cluster.cpp:448] Creating default 'local' authorizer
I0817 14:58:40.842092 30352 slave.cpp:250] Mesos agent started on (808)@172.17.0.7:36521
I0817 14:58:40.842119 30352 slave.cpp:251] Flags at startup: --acls="" --appc_simple_discovery_uri_prefix="http://"
--appc_store_dir="/tmp/Endpoint_SlaveEndpointTest_NoAuthorizer_2_SS9EAe/store/appc" --authenticate_http_executors="true"
--authenticate_http_readonly="true" --authenticate_http_readwrite="true" --authenticatee="crammd5"
--authentication_backoff_factor="1secs" --authorizer="local" --cgroups_cpu_enable_pids_and_tids_count="false"
--cgroups_enable_cfs="false" --cgroups_hierarchy="/sys/fs/cgroup" --cgroups_limit_swap="false"
--cgroups_root="mesos" --container_disk_watch_interval="15secs" --containerizers="mesos" --credential="/tmp/Endpoint_SlaveEndpointTest_NoAuthorizer_2_SS9EAe/credential"
--default_role="*" --disallow_sharing_agent_pid_namespace="false" --disk_watch_interval="1mins"
--docker="docker" --docker_kill_orphans="true" --docker_registry="https://registry-1.docker.io"
--docker_remove_delay="6hrs" --docker_socket="/var/run/docker.sock" --docker_stop_timeout="0ns"
--docker_store_dir="/tmp/Endpoint_SlaveEndpointTest_NoAuthorizer_2_SS9EAe/store/docker" --docker_volume_checkpoint_dir="/var/run/mesos/isolators/docker/volume"
--enforce_container_disk_quota="false" --executor_registration_timeout="1mins" --executor_reregistration_timeout="2secs"
--executor_secret_key="/tmp/Endpoint_SlaveEndpointTest_NoAuthorizer_2_SS9EAe/executor_secret_key"
--executor_shutdown_grace_period="5secs" --fetcher_cache_dir="/tmp/Endpoint_SlaveEndpointTest_NoAuthorizer_2_SS9EAe/fetch"
--fetcher_cache_size="2GB" --frameworks_home="" --gc_delay="1weeks" --gc_disk_headroom="0.1"
--hadoop_home="" --help="false" --hostname_lookup="true" --http_command_executor="false" --http_credentials="/tmp/Endpoint_SlaveEndpointTest_NoAuthorizer_2_SS9EAe/http_credentials"
--http_heartbeat_interval="30secs" --initialize_driver_logging="true" --isolation="posix/cpu,posix/mem"
--launcher="posix" --launcher_dir="/mesos/mesos-1.4.0/_build/src" --logbufsecs="0" --logging_level="INFO"
--max_completed_executors_per_framework="150" --oversubscribed_resources_interval="15secs"
--perf_duration="10secs" --perf_interval="1mins" --port="5051" --qos_correction_interval_min="0ns"
--quiet="false" --recover="reconnect" --recovery_timeout="15mins" --registration_backoff_factor="10ms"
--resources="cpus:2;gpus:0;mem:1024;disk:1024;ports:[31000-32000]" --revocable_cpu_low_priority="true"
--runtime_dir="/tmp/Endpoint_SlaveEndpointTest_NoAuthorizer_2_SS9EAe" --sandbox_directory="/mnt/mesos/sandbox"
--strict="true" --switch_user="true" --systemd_enable_support="true" --systemd_runtime_directory="/run/systemd/system"
--version="false" --work_dir="/tmp/Endpoint_SlaveEndpointTest_NoAuthorizer_2_em2cNj"
I0817 14:58:40.842664 30352 credentials.hpp:86] Loading credential for authentication from
'/tmp/Endpoint_SlaveEndpointTest_NoAuthorizer_2_SS9EAe/credential'
I0817 14:58:40.842885 30352 slave.cpp:283] Agent using credential for: test-principal
I0817 14:58:40.842905 30352 credentials.hpp:37] Loading credentials for authentication from
'/tmp/Endpoint_SlaveEndpointTest_NoAuthorizer_2_SS9EAe/http_credentials'
I0817 14:58:40.843256 30352 http.cpp:1026] Creating default 'basic' HTTP authenticator for
realm 'mesos-agent-executor'
I0817 14:58:40.843439 30352 http.cpp:1047] Creating default 'jwt' HTTP authenticator for realm
'mesos-agent-executor'
I0817 14:58:40.843703 30352 http.cpp:1026] Creating default 'basic' HTTP authenticator for
realm 'mesos-agent-readonly'
I0817 14:58:40.843935 30352 http.cpp:1047] Creating default 'jwt' HTTP authenticator for realm
'mesos-agent-readonly'
I0817 14:58:40.844146 30352 http.cpp:1026] Creating default 'basic' HTTP authenticator for
realm 'mesos-agent-readwrite'
I0817 14:58:40.844275 30352 http.cpp:1047] Creating default 'jwt' HTTP authenticator for realm
'mesos-agent-readwrite'
I0817 14:58:40.846082 30352 slave.cpp:565] Agent resources: [{"name":"cpus","scalar":{"value":2.0},"type":"SCALAR"},{"name":"mem","scalar":{"value":1024.0},"type":"SCALAR"},{"name":"disk","scalar":{"value":1024.0},"type":"SCALAR"},{"name":"ports","ranges":{"range":[{"begin":31000,"end":32000}]},"type":"RANGES"}]
I0817 14:58:40.846565 30352 slave.cpp:573] Agent attributes: [  ]
I0817 14:58:40.846586 30352 slave.cpp:582] Agent hostname: ec6b7589084c
I0817 14:58:40.846741 30368 status_update_manager.cpp:177] Pausing sending status updates
I0817 14:58:40.848695 30346 state.cpp:64] Recovering state from '/tmp/Endpoint_SlaveEndpointTest_NoAuthorizer_2_em2cNj/meta'
I0817 14:58:40.849298 30351 status_update_manager.cpp:203] Recovering status update manager
I0817 14:58:40.849501 30366 containerizer.cpp:609] Recovering containerizer
I0817 14:58:40.851168 30365 provisioner.cpp:416] Provisioner recovery complete
I0817 14:58:40.851943 30352 slave.cpp:6210] Finished recovery
I0817 14:58:40.852535 30352 slave.cpp:6392] Querying resource estimator for oversubscribable
resources
I0817 14:58:40.853014 30352 slave.cpp:6406] Received oversubscribable resources {} from the
resource estimator
I0817 14:58:40.856040 30353 process.cpp:3933] Handling HTTP event for process 'slave(808)'
with path: '/slave(808)/containers'
I0817 14:58:40.858289 30357 http.cpp:1166] HTTP GET for /slave(808)/containers from 172.17.0.7:44676
I0817 14:58:40.858379 30357 http.cpp:957] Authorizing principal 'test-principal' to GET the
'/containers' endpoint
I0817 14:58:40.862618  9443 slave.cpp:843] Agent terminating
[       OK ] Endpoint/SlaveEndpointTest.NoAuthorizer/2 (43 ms)
[----------] 9 tests from Endpoint/SlaveEndpointTest (368 ms total)

[----------] 2 tests from ContainerizerType/DefaultContainerDNSFlagTest
[ RUN      ] ContainerizerType/DefaultContainerDNSFlagTest.ValidateFlag/0
[       OK ] ContainerizerType/DefaultContainerDNSFlagTest.ValidateFlag/0 (12 ms)
[ RUN      ] ContainerizerType/DefaultContainerDNSFlagTest.ValidateFlag/1
[       OK ] ContainerizerType/DefaultContainerDNSFlagTest.ValidateFlag/1 (13 ms)
[----------] 2 tests from ContainerizerType/DefaultContainerDNSFlagTest (27 ms total)

[----------] Global test environment tear-down
[==========] 1660 tests from 184 test cases ran. (686900 ms total)
[  PASSED  ] 1655 tests.
[  FAILED  ] 5 tests, listed below:
[  FAILED  ] CommandExecutorCheckTest.CommandCheckDeliveredAndReconciled
[  FAILED  ] DefaultExecutorCheckTest.CommandCheckDeliveredAndReconciled
[  FAILED  ] DefaultExecutorCheckTest.CommandCheckStatusChange
[  FAILED  ] DefaultExecutorCheckTest.CommandCheckSeesParentsEnv
[  FAILED  ] DefaultExecutorCheckTest.CommandCheckSharesWorkDirWithTask

 5 FAILED TESTS
  YOU HAVE 20 DISABLED TESTS

I0817 14:58:40.986776 30369 process.cpp:1072] Failed to accept socket: future discarded
make[4]: *** [check-local] Error 1
make[4]: Leaving directory `/mesos/mesos-1.4.0/_build/src'
make[3]: *** [check-am] Error 2
make[3]: Leaving directory `/mesos/mesos-1.4.0/_build/src'
make[2]: *** [check] Error 2
make[2]: Leaving directory `/mesos/mesos-1.4.0/_build/src'
make[1]: *** [check-recursive] Error 1
make[1]: Leaving directory `/mesos/mesos-1.4.0/_build'
make: *** [distcheck] Error 1
+ docker rmi mesos-1502978715-19131
Untagged: mesos-1502978715-19131:latest
Deleted: sha256:528a10167b01f111206456707eaa02c61d40ca867a46308af0e3a9657ba479b6
Deleted: sha256:044ba4b3e2c3670c3cef5c761b153386c7f8e54dba17d8746c44cc20b1f293e2
Deleted: sha256:f485fa8b2a5b6997611729993dde15c5e5a9ab674b9f962c039e1b2c9ae43651
Deleted: sha256:e31fa0161d83a69a7ff2726e0358c669b2e546206b6a8d7d63f116b71d782e37
Deleted: sha256:d510ef8e6c5dff53bc009e7001458eb72e33d9395a6651f9f8687217b6b83dd9
Deleted: sha256:56fe923f4c424bab78ec46159147df7e5292ee30701cdbc8f5a66f209f2eeb74
Deleted: sha256:5cffd623f105b3da5cf27a8aba056fa48a344533e546223747834bb5493a5b1c
Deleted: sha256:ec57aa30fee7df7756fff91f3b7328cbb424edbebb9b2496e0835adbf47f26ec
Deleted: sha256:29c296800ce0cedbfdaa137f879eb6ebd0225cab047ad4d5fb0f5ea63c380b57
Deleted: sha256:aa8e1d60b213d51cb5e80922ec0a90651b3bbc61741443532022a889546bdb16
Deleted: sha256:829bce0ba4d2f47e05492201dd190b6a7e390e738611189a8f929075bf77ddef
Deleted: sha256:4eed9c3021d6763f9d4cad6a572cf26984f68d9f540f3ed949959e94fdcc9ed6
Deleted: sha256:e16286b98f1419f18290bcae6ecd528b2ba8f4bd4bcc077d30fb94dce5429601
Deleted: sha256:2ce6d242795ab4432a9e6c17f3ece991ffacca470654a5fe54d941ceb5820800
Deleted: sha256:3234c57db39bd069f073290cd743bd35795553242b15de1d611cbf79eadc4b72
Deleted: sha256:8041ba61cb2981115fe187074ccb97cf8da416941d5a2959e3b55aeda0d33c06
Deleted: sha256:15459e3d186743300dcbe392c41e47624520cb679347bcdaea13b0ad27678ea7
Deleted: sha256:02d3bdf26a1ad2d17a185357a91b56e4754f11bfc9f2c47e1f425a77c44347bd
Deleted: sha256:c513dfb7433446cc10feb00bc69a5adb9af55c07bf025f33cee4af749484a2f4
Deleted: sha256:aede04ae3ab70193bd8bf93c825dee2a906116c74ed4f13478822ed5485e4270
Deleted: sha256:1b8d2d985d53c7b42280068aaf10e392f0da1e42576e2c3fd9c73fd2c7593d7e
Deleted: sha256:dd93a2e91a1e7d39d518e20c101ad65ddb5498956bc5d7765d90895562388162
Deleted: sha256:38027b4e8a8e32bc9822d547b211e4b6100a39a578942bebbefb2b6154f9c274
Deleted: sha256:779437c06606422fe4920d70413fd8fd7b74cff27008084d42f651a0c7515fd0
Deleted: sha256:a28798b6d09291bf3381555e56072cb24dc0c90620dbd799b5e610ad48e56f1c
Build step 'Execute shell' marked build as failure
Not sending mail to unregistered user songzihao1990@gmail.com

Mime
View raw message