mesos-builds mailing list archives

Site index · List index
Message view « Date » · « Thread »
Top « Date » · « Thread »
From Apache Jenkins Server <jenk...@builds.apache.org>
Subject Build failed in Jenkins: Mesos-Buildbot » autotools,gcc,--verbose --enable-libevent --enable-ssl,GLOG_v=1 MESOS_VERBOSE=1,centos:7,(ubuntu)&&(!ubuntu-us1)&&(!ubuntu-eu2) #4167
Date Tue, 29 Aug 2017 18:05:45 GMT
See <https://builds.apache.org/job/Mesos-Buildbot/BUILDTOOL=autotools,COMPILER=gcc,CONFIGURATION=--verbose%20--enable-libevent%20--enable-ssl,ENVIRONMENT=GLOG_v=1%20MESOS_VERBOSE=1,OS=centos%3A7,label_exp=(ubuntu)&&(!ubuntu-us1)&&(!ubuntu-eu2)/4167/display/redirect?page=changes>

Changes:

[yujie.jay] Added HOST_PATH volume source protobuf.

[yujie.jay] Added equal operator for Error.

[yujie.jay] Added common validation for Volume.

[yujie.jay] Added master and agent validation for ContainerInfo.

[yujie.jay] Fixed a indentation issue in linux filesystem isolator.

[yujie.jay] Added volume/host_path isolator.

[yujie.jay] Integrated 'volume/host_path' into MesosContainerizer.

[yujie.jay] Added a dependency check 'filesystem/linux' isolator.

[yujie.jay] Moved host volume related tests to a dedicated file.

[yujie.jay] Used path::absolute to replace some startsWith checks.

[yujie.jay] Adjusted the test helpers for creating host and sandbox path volumes.

[yujie.jay] Parameterized the volume host path tests on executor type.

------------------------------------------
[...truncated 32.32 MB...]
W0829 18:05:37.037752  9649 backend.cpp:76] Failed to create 'bind' backend: BindBackend requires
root privileges
I0829 18:05:37.037786  9649 provisioner.cpp:255] Using default backend 'copy'
I0829 18:05:37.041266 30732 slave.cpp:252] Mesos agent started on (810)@172.17.0.4:36112
I0829 18:05:37.041294 30732 slave.cpp:253] Flags at startup: --acls="" --appc_simple_discovery_uri_prefix="http://"
--appc_store_dir="/tmp/Endpoint_SlaveEndpointTest_UnauthorizedRequest_0_Ffq1PH/store/appc"
--authenticate_http_executors="true" --authenticate_http_readonly="true" --authenticate_http_readwrite="true"
--authenticatee="crammd5" --authentication_backoff_factor="1secs" --authorizer="local" --cgroups_cpu_enable_pids_and_tids_count="false"
--cgroups_enable_cfs="false" --cgroups_hierarchy="/sys/fs/cgroup" --cgroups_limit_swap="false"
--cgroups_root="mesos" --container_disk_watch_interval="15secs" --containerizers="mesos" --credential="/tmp/Endpoint_SlaveEndpointTest_UnauthorizedRequest_0_Ffq1PH/credential"
--default_role="*" --disallow_sharing_agent_pid_namespace="false" --disk_watch_interval="1mins"
--docker="docker" --docker_kill_orphans="true" --docker_registry="https://registry-1.docker.io"
--docker_remove_delay="6hrs" --docker_socket="/var/run/docker.sock" --docker_stop_timeout="0ns"
--docker_store_dir="/tmp/Endpoint_SlaveEndpointTest_UnauthorizedRequest_0_Ffq1PH/store/docker"
--docker_volume_checkpoint_dir="/var/run/mesos/isolators/docker/volume" --enforce_container_disk_quota="false"
--executor_registration_timeout="1mins" --executor_reregistration_timeout="2secs" --executor_secret_key="/tmp/Endpoint_SlaveEndpointTest_UnauthorizedRequest_0_Ffq1PH/executor_secret_key"
--executor_shutdown_grace_period="5secs" --fetcher_cache_dir="/tmp/Endpoint_SlaveEndpointTest_UnauthorizedRequest_0_Ffq1PH/fetch"
--fetcher_cache_size="2GB" --frameworks_home="" --gc_delay="1weeks" --gc_disk_headroom="0.1"
--hadoop_home="" --help="false" --hostname_lookup="true" --http_command_executor="false" --http_credentials="/tmp/Endpoint_SlaveEndpointTest_UnauthorizedRequest_0_Ffq1PH/http_credentials"
--http_heartbeat_interval="30secs" --initialize_driver_logging="true" --isolation="posix/cpu,posix/mem"
--launcher="posix" --launcher_dir="/mesos/mesos-1.5.0/_build/src" --logbufsecs="0" --logging_level="INFO"
--max_completed_executors_per_framework="150" --oversubscribed_resources_interval="15secs"
--perf_duration="10secs" --perf_interval="1mins" --port="5051" --qos_correction_interval_min="0ns"
--quiet="false" --recover="reconnect" --recovery_timeout="15mins" --registration_backoff_factor="10ms"
--resources="cpus:2;gpus:0;mem:1024;disk:1024;ports:[31000-32000]" --revocable_cpu_low_priority="true"
--runtime_dir="/tmp/Endpoint_SlaveEndpointTest_UnauthorizedRequest_0_Ffq1PH" --sandbox_directory="/mnt/mesos/sandbox"
--strict="true" --switch_user="true" --systemd_enable_support="true" --systemd_runtime_directory="/run/systemd/system"
--version="false" --work_dir="/tmp/Endpoint_SlaveEndpointTest_UnauthorizedRequest_0_kYR8D2"
I0829 18:05:37.041795 30732 credentials.hpp:86] Loading credential for authentication from
'/tmp/Endpoint_SlaveEndpointTest_UnauthorizedRequest_0_Ffq1PH/credential'
I0829 18:05:37.042001 30732 slave.cpp:285] Agent using credential for: test-principal
I0829 18:05:37.042021 30732 credentials.hpp:37] Loading credentials for authentication from
'/tmp/Endpoint_SlaveEndpointTest_UnauthorizedRequest_0_Ffq1PH/http_credentials'
I0829 18:05:37.042294 30732 http.cpp:1045] Creating default 'basic' HTTP authenticator for
realm 'mesos-agent-executor'
I0829 18:05:37.042435 30732 http.cpp:1066] Creating default 'jwt' HTTP authenticator for realm
'mesos-agent-executor'
I0829 18:05:37.042634 30732 http.cpp:1045] Creating default 'basic' HTTP authenticator for
realm 'mesos-agent-readonly'
I0829 18:05:37.042724 30732 http.cpp:1066] Creating default 'jwt' HTTP authenticator for realm
'mesos-agent-readonly'
I0829 18:05:37.042901 30732 http.cpp:1045] Creating default 'basic' HTTP authenticator for
realm 'mesos-agent-readwrite'
I0829 18:05:37.042990 30732 http.cpp:1066] Creating default 'jwt' HTTP authenticator for realm
'mesos-agent-readwrite'
I0829 18:05:37.044433 30732 slave.cpp:581] Agent resources: [{"name":"cpus","scalar":{"value":2.0},"type":"SCALAR"},{"name":"mem","scalar":{"value":1024.0},"type":"SCALAR"},{"name":"disk","scalar":{"value":1024.0},"type":"SCALAR"},{"name":"ports","ranges":{"range":[{"begin":31000,"end":32000}]},"type":"RANGES"}]
I0829 18:05:37.044657 30732 slave.cpp:589] Agent attributes: [  ]
I0829 18:05:37.044670 30732 slave.cpp:598] Agent hostname: 978b25557a89
I0829 18:05:37.044796 30747 status_update_manager.cpp:177] Pausing sending status updates
I0829 18:05:37.046397 30733 state.cpp:64] Recovering state from '/tmp/Endpoint_SlaveEndpointTest_UnauthorizedRequest_0_kYR8D2/meta'
I0829 18:05:37.046702 30741 status_update_manager.cpp:203] Recovering status update manager
I0829 18:05:37.046888 30751 containerizer.cpp:646] Recovering containerizer
I0829 18:05:37.048259 30743 provisioner.cpp:416] Provisioner recovery complete
I0829 18:05:37.048574 30740 slave.cpp:6296] Finished recovery
I0829 18:05:37.049249 30740 slave.cpp:6478] Querying resource estimator for oversubscribable
resources
I0829 18:05:37.049584 30749 slave.cpp:6492] Received oversubscribable resources {} from the
resource estimator
I0829 18:05:37.051934 30745 process.cpp:3933] Handling HTTP event for process 'slave(810)'
with path: '/slave(810)/monitor/statistics'
I0829 18:05:37.053508 30741 http.cpp:1185] HTTP GET for /slave(810)/monitor/statistics from
172.17.0.4:43418
I0829 18:05:37.053576 30741 http.cpp:976] Authorizing principal 'test-principal' to GET the
'/monitor/statistics' endpoint
I0829 18:05:37.055479 30746 slave.cpp:859] Agent terminating
[       OK ] Endpoint/SlaveEndpointTest.UnauthorizedRequest/0 (29 ms)
[ RUN      ] Endpoint/SlaveEndpointTest.UnauthorizedRequest/1
I0829 18:05:37.067378  9649 containerizer.cpp:290] Using isolation { environment_secret, posix/cpu,
posix/mem, filesystem/posix, network/cni }
W0829 18:05:37.068747  9649 backend.cpp:76] Failed to create 'aufs' backend: AufsBackend requires
root privileges
W0829 18:05:37.068895  9649 backend.cpp:76] Failed to create 'bind' backend: BindBackend requires
root privileges
I0829 18:05:37.068929  9649 provisioner.cpp:255] Using default backend 'copy'
I0829 18:05:37.072829 30738 slave.cpp:252] Mesos agent started on (811)@172.17.0.4:36112
I0829 18:05:37.072876 30738 slave.cpp:253] Flags at startup: --acls="" --appc_simple_discovery_uri_prefix="http://"
--appc_store_dir="/tmp/Endpoint_SlaveEndpointTest_UnauthorizedRequest_1_wP1SQm/store/appc"
--authenticate_http_executors="true" --authenticate_http_readonly="true" --authenticate_http_readwrite="true"
--authenticatee="crammd5" --authentication_backoff_factor="1secs" --authorizer="local" --cgroups_cpu_enable_pids_and_tids_count="false"
--cgroups_enable_cfs="false" --cgroups_hierarchy="/sys/fs/cgroup" --cgroups_limit_swap="false"
--cgroups_root="mesos" --container_disk_watch_interval="15secs" --containerizers="mesos" --credential="/tmp/Endpoint_SlaveEndpointTest_UnauthorizedRequest_1_wP1SQm/credential"
--default_role="*" --disallow_sharing_agent_pid_namespace="false" --disk_watch_interval="1mins"
--docker="docker" --docker_kill_orphans="true" --docker_registry="https://registry-1.docker.io"
--docker_remove_delay="6hrs" --docker_socket="/var/run/docker.sock" --docker_stop_timeout="0ns"
--docker_store_dir="/tmp/Endpoint_SlaveEndpointTest_UnauthorizedRequest_1_wP1SQm/store/docker"
--docker_volume_checkpoint_dir="/var/run/mesos/isolators/docker/volume" --enforce_container_disk_quota="false"
--executor_registration_timeout="1mins" --executor_reregistration_timeout="2secs" --executor_secret_key="/tmp/Endpoint_SlaveEndpointTest_UnauthorizedRequest_1_wP1SQm/executor_secret_key"
--executor_shutdown_grace_period="5secs" --fetcher_cache_dir="/tmp/Endpoint_SlaveEndpointTest_UnauthorizedRequest_1_wP1SQm/fetch"
--fetcher_cache_size="2GB" --frameworks_home="" --gc_delay="1weeks" --gc_disk_headroom="0.1"
--hadoop_home="" --help="false" --hostname_lookup="true" --http_command_executor="false" --http_credentials="/tmp/Endpoint_SlaveEndpointTest_UnauthorizedRequest_1_wP1SQm/http_credentials"
--http_heartbeat_interval="30secs" --initialize_driver_logging="true" --isolation="posix/cpu,posix/mem"
--launcher="posix" --launcher_dir="/mesos/mesos-1.5.0/_build/src" --logbufsecs="0" --logging_level="INFO"
--max_completed_executors_per_framework="150" --oversubscribed_resources_interval="15secs"
--perf_duration="10secs" --perf_interval="1mins" --port="5051" --qos_correction_interval_min="0ns"
--quiet="false" --recover="reconnect" --recovery_timeout="15mins" --registration_backoff_factor="10ms"
--resources="cpus:2;gpus:0;mem:1024;disk:1024;ports:[31000-32000]" --revocable_cpu_low_priority="true"
--runtime_dir="/tmp/Endpoint_SlaveEndpointTest_UnauthorizedRequest_1_wP1SQm" --sandbox_directory="/mnt/mesos/sandbox"
--strict="true" --switch_user="true" --systemd_enable_support="true" --systemd_runtime_directory="/run/systemd/system"
--version="false" --work_dir="/tmp/Endpoint_SlaveEndpointTest_UnauthorizedRequest_1_ZuivAH"
I0829 18:05:37.073526 30738 credentials.hpp:86] Loading credential for authentication from
'/tmp/Endpoint_SlaveEndpointTest_UnauthorizedRequest_1_wP1SQm/credential'
I0829 18:05:37.073796 30738 slave.cpp:285] Agent using credential for: test-principal
I0829 18:05:37.073818 30738 credentials.hpp:37] Loading credentials for authentication from
'/tmp/Endpoint_SlaveEndpointTest_UnauthorizedRequest_1_wP1SQm/http_credentials'
I0829 18:05:37.074175 30738 http.cpp:1045] Creating default 'basic' HTTP authenticator for
realm 'mesos-agent-executor'
I0829 18:05:37.074376 30738 http.cpp:1066] Creating default 'jwt' HTTP authenticator for realm
'mesos-agent-executor'
I0829 18:05:37.074651 30738 http.cpp:1045] Creating default 'basic' HTTP authenticator for
realm 'mesos-agent-readonly'
I0829 18:05:37.074754 30738 http.cpp:1066] Creating default 'jwt' HTTP authenticator for realm
'mesos-agent-readonly'
I0829 18:05:37.074965 30738 http.cpp:1045] Creating default 'basic' HTTP authenticator for
realm 'mesos-agent-readwrite'
I0829 18:05:37.075067 30738 http.cpp:1066] Creating default 'jwt' HTTP authenticator for realm
'mesos-agent-readwrite'
I0829 18:05:37.076903 30738 slave.cpp:581] Agent resources: [{"name":"cpus","scalar":{"value":2.0},"type":"SCALAR"},{"name":"mem","scalar":{"value":1024.0},"type":"SCALAR"},{"name":"disk","scalar":{"value":1024.0},"type":"SCALAR"},{"name":"ports","ranges":{"range":[{"begin":31000,"end":32000}]},"type":"RANGES"}]
I0829 18:05:37.077203 30738 slave.cpp:589] Agent attributes: [  ]
I0829 18:05:37.077220 30738 slave.cpp:598] Agent hostname: 978b25557a89
I0829 18:05:37.077373 30741 status_update_manager.cpp:177] Pausing sending status updates
I0829 18:05:37.079322 30752 state.cpp:64] Recovering state from '/tmp/Endpoint_SlaveEndpointTest_UnauthorizedRequest_1_ZuivAH/meta'
I0829 18:05:37.079623 30755 status_update_manager.cpp:203] Recovering status update manager
I0829 18:05:37.079826 30743 containerizer.cpp:646] Recovering containerizer
I0829 18:05:37.081491 30746 provisioner.cpp:416] Provisioner recovery complete
I0829 18:05:37.081802 30749 slave.cpp:6296] Finished recovery
I0829 18:05:37.082303 30749 slave.cpp:6478] Querying resource estimator for oversubscribable
resources
I0829 18:05:37.082666 30753 slave.cpp:6492] Received oversubscribable resources {} from the
resource estimator
I0829 18:05:37.085479 30744 process.cpp:3933] Handling HTTP event for process 'slave(811)'
with path: '/slave(811)/monitor/statistics.json'
I0829 18:05:37.087280 30742 http.cpp:1185] HTTP GET for /slave(811)/monitor/statistics.json
from 172.17.0.4:43424
I0829 18:05:37.087371 30742 http.cpp:976] Authorizing principal 'test-principal' to GET the
'/monitor/statistics.json' endpoint
I0829 18:05:37.089200 30740 slave.cpp:859] Agent terminating
[       OK ] Endpoint/SlaveEndpointTest.UnauthorizedRequest/1 (33 ms)
[ RUN      ] Endpoint/SlaveEndpointTest.UnauthorizedRequest/2
I0829 18:05:37.102995  9649 containerizer.cpp:290] Using isolation { environment_secret, posix/cpu,
posix/mem, filesystem/posix, network/cni }
W0829 18:05:37.103555  9649 backend.cpp:76] Failed to create 'aufs' backend: AufsBackend requires
root privileges
W0829 18:05:37.103672  9649 backend.cpp:76] Failed to create 'bind' backend: BindBackend requires
root privileges
I0829 18:05:37.103713  9649 provisioner.cpp:255] Using default backend 'copy'
I0829 18:05:37.107409 30753 slave.cpp:252] Mesos agent started on (812)@172.17.0.4:36112
I0829 18:05:37.107434 30753 slave.cpp:253] Flags at startup: --acls="" --appc_simple_discovery_uri_prefix="http://"
--appc_store_dir="/tmp/Endpoint_SlaveEndpointTest_UnauthorizedRequest_2_p3ukc2/store/appc"
--authenticate_http_executors="true" --authenticate_http_readonly="true" --authenticate_http_readwrite="true"
--authenticatee="crammd5" --authentication_backoff_factor="1secs" --authorizer="local" --cgroups_cpu_enable_pids_and_tids_count="false"
--cgroups_enable_cfs="false" --cgroups_hierarchy="/sys/fs/cgroup" --cgroups_limit_swap="false"
--cgroups_root="mesos" --container_disk_watch_interval="15secs" --containerizers="mesos" --credential="/tmp/Endpoint_SlaveEndpointTest_UnauthorizedRequest_2_p3ukc2/credential"
--default_role="*" --disallow_sharing_agent_pid_namespace="false" --disk_watch_interval="1mins"
--docker="docker" --docker_kill_orphans="true" --docker_registry="https://registry-1.docker.io"
--docker_remove_delay="6hrs" --docker_socket="/var/run/docker.sock" --docker_stop_timeout="0ns"
--docker_store_dir="/tmp/Endpoint_SlaveEndpointTest_UnauthorizedRequest_2_p3ukc2/store/docker"
--docker_volume_checkpoint_dir="/var/run/mesos/isolators/docker/volume" --enforce_container_disk_quota="false"
--executor_registration_timeout="1mins" --executor_reregistration_timeout="2secs" --executor_secret_key="/tmp/Endpoint_SlaveEndpointTest_UnauthorizedRequest_2_p3ukc2/executor_secret_key"
--executor_shutdown_grace_period="5secs" --fetcher_cache_dir="/tmp/Endpoint_SlaveEndpointTest_UnauthorizedRequest_2_p3ukc2/fetch"
--fetcher_cache_size="2GB" --frameworks_home="" --gc_delay="1weeks" --gc_disk_headroom="0.1"
--hadoop_home="" --help="false" --hostname_lookup="true" --http_command_executor="false" --http_credentials="/tmp/Endpoint_SlaveEndpointTest_UnauthorizedRequest_2_p3ukc2/http_credentials"
--http_heartbeat_interval="30secs" --initialize_driver_logging="true" --isolation="posix/cpu,posix/mem"
--launcher="posix" --launcher_dir="/mesos/mesos-1.5.0/_build/src" --logbufsecs="0" --logging_level="INFO"
--max_completed_executors_per_framework="150" --oversubscribed_resources_interval="15secs"
--perf_duration="10secs" --perf_interval="1mins" --port="5051" --qos_correction_interval_min="0ns"
--quiet="false" --recover="reconnect" --recovery_timeout="15mins" --registration_backoff_factor="10ms"
--resources="cpus:2;gpus:0;mem:1024;disk:1024;ports:[31000-32000]" --revocable_cpu_low_priority="true"
--runtime_dir="/tmp/Endpoint_SlaveEndpointTest_UnauthorizedRequest_2_p3ukc2" --sandbox_directory="/mnt/mesos/sandbox"
--strict="true" --switch_user="true" --systemd_enable_support="true" --systemd_runtime_directory="/run/systemd/system"
--version="false" --work_dir="/tmp/Endpoint_SlaveEndpointTest_UnauthorizedRequest_2_YGrHQm"
I0829 18:05:37.107813 30753 credentials.hpp:86] Loading credential for authentication from
'/tmp/Endpoint_SlaveEndpointTest_UnauthorizedRequest_2_p3ukc2/credential'
I0829 18:05:37.107987 30753 slave.cpp:285] Agent using credential for: test-principal
I0829 18:05:37.108007 30753 credentials.hpp:37] Loading credentials for authentication from
'/tmp/Endpoint_SlaveEndpointTest_UnauthorizedRequest_2_p3ukc2/http_credentials'
I0829 18:05:37.108276 30753 http.cpp:1045] Creating default 'basic' HTTP authenticator for
realm 'mesos-agent-executor'
I0829 18:05:37.108408 30753 http.cpp:1066] Creating default 'jwt' HTTP authenticator for realm
'mesos-agent-executor'
I0829 18:05:37.108618 30753 http.cpp:1045] Creating default 'basic' HTTP authenticator for
realm 'mesos-agent-readonly'
I0829 18:05:37.108707 30753 http.cpp:1066] Creating default 'jwt' HTTP authenticator for realm
'mesos-agent-readonly'
I0829 18:05:37.108878 30753 http.cpp:1045] Creating default 'basic' HTTP authenticator for
realm 'mesos-agent-readwrite'
I0829 18:05:37.108969 30753 http.cpp:1066] Creating default 'jwt' HTTP authenticator for realm
'mesos-agent-readwrite'
I0829 18:05:37.110303 30753 slave.cpp:581] Agent resources: [{"name":"cpus","scalar":{"value":2.0},"type":"SCALAR"},{"name":"mem","scalar":{"value":1024.0},"type":"SCALAR"},{"name":"disk","scalar":{"value":1024.0},"type":"SCALAR"},{"name":"ports","ranges":{"range":[{"begin":31000,"end":32000}]},"type":"RANGES"}]
I0829 18:05:37.110520 30753 slave.cpp:589] Agent attributes: [  ]
I0829 18:05:37.110534 30753 slave.cpp:598] Agent hostname: 978b25557a89
I0829 18:05:37.110689 30732 status_update_manager.cpp:177] Pausing sending status updates
I0829 18:05:37.112251 30741 state.cpp:64] Recovering state from '/tmp/Endpoint_SlaveEndpointTest_UnauthorizedRequest_2_YGrHQm/meta'
I0829 18:05:37.112519 30735 status_update_manager.cpp:203] Recovering status update manager
I0829 18:05:37.112685 30734 containerizer.cpp:646] Recovering containerizer
I0829 18:05:37.114259 30745 provisioner.cpp:416] Provisioner recovery complete
I0829 18:05:37.114645 30753 slave.cpp:6296] Finished recovery
I0829 18:05:37.115414 30753 slave.cpp:6478] Querying resource estimator for oversubscribable
resources
I0829 18:05:37.115730 30736 slave.cpp:6492] Received oversubscribable resources {} from the
resource estimator
I0829 18:05:37.118211 30746 process.cpp:3933] Handling HTTP event for process 'slave(812)'
with path: '/slave(812)/containers'
I0829 18:05:37.120082 30737 http.cpp:1185] HTTP GET for /slave(812)/containers from 172.17.0.4:43434
I0829 18:05:37.120157 30737 http.cpp:976] Authorizing principal 'test-principal' to GET the
'/containers' endpoint
I0829 18:05:37.122027  9649 slave.cpp:859] Agent terminating
[       OK ] Endpoint/SlaveEndpointTest.UnauthorizedRequest/2 (32 ms)
[ RUN      ] Endpoint/SlaveEndpointTest.NoAuthorizer/0
I0829 18:05:37.133599  9649 containerizer.cpp:290] Using isolation { environment_secret, posix/cpu,
posix/mem, filesystem/posix, network/cni }
W0829 18:05:37.134088  9649 backend.cpp:76] Failed to create 'aufs' backend: AufsBackend requires
root privileges
W0829 18:05:37.134207  9649 backend.cpp:76] Failed to create 'bind' backend: BindBackend requires
root privileges
I0829 18:05:37.134243  9649 provisioner.cpp:255] Using default backend 'copy'
I0829 18:05:37.135879  9649 cluster.cpp:448] Creating default 'local' authorizer
I0829 18:05:37.137858 30735 slave.cpp:252] Mesos agent started on (813)@172.17.0.4:36112
I0829 18:05:37.137881 30735 slave.cpp:253] Flags at startup: --acls="" --appc_simple_discovery_uri_prefix="http://"
--appc_store_dir="/tmp/Endpoint_SlaveEndpointTest_NoAuthorizer_0_Qv8xQH/store/appc" --authenticate_http_executors="true"
--authenticate_http_readonly="true" --authenticate_http_readwrite="true" --authenticatee="crammd5"
--authentication_backoff_factor="1secs" --authorizer="local" --cgroups_cpu_enable_pids_and_tids_count="false"
--cgroups_enable_cfs="false" --cgroups_hierarchy="/sys/fs/cgroup" --cgroups_limit_swap="false"
--cgroups_root="mesos" --container_disk_watch_interval="15secs" --containerizers="mesos" --credential="/tmp/Endpoint_SlaveEndpointTest_NoAuthorizer_0_Qv8xQH/credential"
--default_role="*" --disallow_sharing_agent_pid_namespace="false" --disk_watch_interval="1mins"
--docker="docker" --docker_kill_orphans="true" --docker_registry="https://registry-1.docker.io"
--docker_remove_delay="6hrs" --docker_socket="/var/run/docker.sock" --docker_stop_timeout="0ns"
--docker_store_dir="/tmp/Endpoint_SlaveEndpointTest_NoAuthorizer_0_Qv8xQH/store/docker" --docker_volume_checkpoint_dir="/var/run/mesos/isolators/docker/volume"
--enforce_container_disk_quota="false" --executor_registration_timeout="1mins" --executor_reregistration_timeout="2secs"
--executor_secret_key="/tmp/Endpoint_SlaveEndpointTest_NoAuthorizer_0_Qv8xQH/executor_secret_key"
--executor_shutdown_grace_period="5secs" --fetcher_cache_dir="/tmp/Endpoint_SlaveEndpointTest_NoAuthorizer_0_Qv8xQH/fetch"
--fetcher_cache_size="2GB" --frameworks_home="" --gc_delay="1weeks" --gc_disk_headroom="0.1"
--hadoop_home="" --help="false" --hostname_lookup="true" --http_command_executor="false" --http_credentials="/tmp/Endpoint_SlaveEndpointTest_NoAuthorizer_0_Qv8xQH/http_credentials"
--http_heartbeat_interval="30secs" --initialize_driver_logging="true" --isolation="posix/cpu,posix/mem"
--launcher="posix" --launcher_dir="/mesos/mesos-1.5.0/_build/src" --logbufsecs="0" --logging_level="INFO"
--max_completed_executors_per_framework="150" --oversubscribed_resources_interval="15secs"
--perf_duration="10secs" --perf_interval="1mins" --port="5051" --qos_correction_interval_min="0ns"
--quiet="false" --recover="reconnect" --recovery_timeout="15mins" --registration_backoff_factor="10ms"
--resources="cpus:2;gpus:0;mem:1024;disk:1024;ports:[31000-32000]" --revocable_cpu_low_priority="true"
--runtime_dir="/tmp/Endpoint_SlaveEndpointTest_NoAuthorizer_0_Qv8xQH" --sandbox_directory="/mnt/mesos/sandbox"
--strict="true" --switch_user="true" --systemd_enable_support="true" --systemd_runtime_directory="/run/systemd/system"
--version="false" --work_dir="/tmp/Endpoint_SlaveEndpointTest_NoAuthorizer_0_93Ikq2"
I0829 18:05:37.138344 30735 credentials.hpp:86] Loading credential for authentication from
'/tmp/Endpoint_SlaveEndpointTest_NoAuthorizer_0_Qv8xQH/credential'
I0829 18:05:37.138510 30735 slave.cpp:285] Agent using credential for: test-principal
I0829 18:05:37.138538 30735 credentials.hpp:37] Loading credentials for authentication from
'/tmp/Endpoint_SlaveEndpointTest_NoAuthorizer_0_Qv8xQH/http_credentials'
I0829 18:05:37.138856 30735 http.cpp:1045] Creating default 'basic' HTTP authenticator for
realm 'mesos-agent-executor'
I0829 18:05:37.139000 30735 http.cpp:1066] Creating default 'jwt' HTTP authenticator for realm
'mesos-agent-executor'
I0829 18:05:37.139289 30735 http.cpp:1045] Creating default 'basic' HTTP authenticator for
realm 'mesos-agent-readonly'
I0829 18:05:37.139402 30735 http.cpp:1066] Creating default 'jwt' HTTP authenticator for realm
'mesos-agent-readonly'
I0829 18:05:37.139606 30735 http.cpp:1045] Creating default 'basic' HTTP authenticator for
realm 'mesos-agent-readwrite'
I0829 18:05:37.139703 30735 http.cpp:1066] Creating default 'jwt' HTTP authenticator for realm
'mesos-agent-readwrite'
I0829 18:05:37.141139 30735 slave.cpp:581] Agent resources: [{"name":"cpus","scalar":{"value":2.0},"type":"SCALAR"},{"name":"mem","scalar":{"value":1024.0},"type":"SCALAR"},{"name":"disk","scalar":{"value":1024.0},"type":"SCALAR"},{"name":"ports","ranges":{"range":[{"begin":31000,"end":32000}]},"type":"RANGES"}]
I0829 18:05:37.141465 30735 slave.cpp:589] Agent attributes: [  ]
I0829 18:05:37.141486 30735 slave.cpp:598] Agent hostname: 978b25557a89
I0829 18:05:37.141638 30753 status_update_manager.cpp:177] Pausing sending status updates
I0829 18:05:37.143373 30751 state.cpp:64] Recovering state from '/tmp/Endpoint_SlaveEndpointTest_NoAuthorizer_0_93Ikq2/meta'
I0829 18:05:37.143687 30750 status_update_manager.cpp:203] Recovering status update manager
I0829 18:05:37.143903 30740 containerizer.cpp:646] Recovering containerizer
I0829 18:05:37.145195 30736 provisioner.cpp:416] Provisioner recovery complete
I0829 18:05:37.145476 30743 slave.cpp:6296] Finished recovery
I0829 18:05:37.145908 30743 slave.cpp:6478] Querying resource estimator for oversubscribable
resources
I0829 18:05:37.146179 30739 slave.cpp:6492] Received oversubscribable resources {} from the
resource estimator
I0829 18:05:37.148408 30755 process.cpp:3933] Handling HTTP event for process 'slave(813)'
with path: '/slave(813)/monitor/statistics'
I0829 18:05:37.150045 30750 http.cpp:1185] HTTP GET for /slave(813)/monitor/statistics from
172.17.0.4:43440
I0829 18:05:37.150112 30750 http.cpp:976] Authorizing principal 'test-principal' to GET the
'/monitor/statistics' endpoint
I0829 18:05:37.152621 30749 slave.cpp:859] Agent terminating
[       OK ] Endpoint/SlaveEndpointTest.NoAuthorizer/0 (30 ms)
[ RUN      ] Endpoint/SlaveEndpointTest.NoAuthorizer/1
I0829 18:05:37.164818  9649 containerizer.cpp:290] Using isolation { environment_secret, posix/cpu,
posix/mem, filesystem/posix, network/cni }
W0829 18:05:37.165356  9649 backend.cpp:76] Failed to create 'aufs' backend: AufsBackend requires
root privileges
W0829 18:05:37.165479  9649 backend.cpp:76] Failed to create 'bind' backend: BindBackend requires
root privileges
I0829 18:05:37.165527  9649 provisioner.cpp:255] Using default backend 'copy'
I0829 18:05:37.167296  9649 cluster.cpp:448] Creating default 'local' authorizer
I0829 18:05:37.169209 30740 slave.cpp:252] Mesos agent started on (814)@172.17.0.4:36112
I0829 18:05:37.169227 30740 slave.cpp:253] Flags at startup: --acls="" --appc_simple_discovery_uri_prefix="http://"
--appc_store_dir="/tmp/Endpoint_SlaveEndpointTest_NoAuthorizer_1_Q5W6Mn/store/appc" --authenticate_http_executors="true"
--authenticate_http_readonly="true" --authenticate_http_readwrite="true" --authenticatee="crammd5"
--authentication_backoff_factor="1secs" --authorizer="local" --cgroups_cpu_enable_pids_and_tids_count="false"
--cgroups_enable_cfs="false" --cgroups_hierarchy="/sys/fs/cgroup" --cgroups_limit_swap="false"
--cgroups_root="mesos" --container_disk_watch_interval="15secs" --containerizers="mesos" --credential="/tmp/Endpoint_SlaveEndpointTest_NoAuthorizer_1_Q5W6Mn/credential"
--default_role="*" --disallow_sharing_agent_pid_namespace="false" --disk_watch_interval="1mins"
--docker="docker" --docker_kill_orphans="true" --docker_registry="https://registry-1.docker.io"
--docker_remove_delay="6hrs" --docker_socket="/var/run/docker.sock" --docker_stop_timeout="0ns"
--docker_store_dir="/tmp/Endpoint_SlaveEndpointTest_NoAuthorizer_1_Q5W6Mn/store/docker" --docker_volume_checkpoint_dir="/var/run/mesos/isolators/docker/volume"
--enforce_container_disk_quota="false" --executor_registration_timeout="1mins" --executor_reregistration_timeout="2secs"
--executor_secret_key="/tmp/Endpoint_SlaveEndpointTest_NoAuthorizer_1_Q5W6Mn/executor_secret_key"
--executor_shutdown_grace_period="5secs" --fetcher_cache_dir="/tmp/Endpoint_SlaveEndpointTest_NoAuthorizer_1_Q5W6Mn/fetch"
--fetcher_cache_size="2GB" --frameworks_home="" --gc_delay="1weeks" --gc_disk_headroom="0.1"
--hadoop_home="" --help="false" --hostname_lookup="true" --http_command_executor="false" --http_credentials="/tmp/Endpoint_SlaveEndpointTest_NoAuthorizer_1_Q5W6Mn/http_credentials"
--http_heartbeat_interval="30secs" --initialize_driver_logging="true" --isolation="posix/cpu,posix/mem"
--launcher="posix" --launcher_dir="/mesos/mesos-1.5.0/_build/src" --logbufsecs="0" --logging_level="INFO"
--max_completed_executors_per_framework="150" --oversubscribed_resources_interval="15secs"
--perf_duration="10secs" --perf_interval="1mins" --port="5051" --qos_correction_interval_min="0ns"
--quiet="false" --recover="reconnect" --recovery_timeout="15mins" --registration_backoff_factor="10ms"
--resources="cpus:2;gpus:0;mem:1024;disk:1024;ports:[31000-32000]" --revocable_cpu_low_priority="true"
--runtime_dir="/tmp/Endpoint_SlaveEndpointTest_NoAuthorizer_1_Q5W6Mn" --sandbox_directory="/mnt/mesos/sandbox"
--strict="true" --switch_user="true" --systemd_enable_support="true" --systemd_runtime_directory="/run/systemd/system"
--version="false" --work_dir="/tmp/Endpoint_SlaveEndpointTest_NoAuthorizer_1_P0NhiI"
I0829 18:05:37.169589 30740 credentials.hpp:86] Loading credential for authentication from
'/tmp/Endpoint_SlaveEndpointTest_NoAuthorizer_1_Q5W6Mn/credential'
I0829 18:05:37.169737 30740 slave.cpp:285] Agent using credential for: test-principal
I0829 18:05:37.169756 30740 credentials.hpp:37] Loading credentials for authentication from
'/tmp/Endpoint_SlaveEndpointTest_NoAuthorizer_1_Q5W6Mn/http_credentials'
I0829 18:05:37.170013 30740 http.cpp:1045] Creating default 'basic' HTTP authenticator for
realm 'mesos-agent-executor'
I0829 18:05:37.170131 30740 http.cpp:1066] Creating default 'jwt' HTTP authenticator for realm
'mesos-agent-executor'
I0829 18:05:37.170321 30740 http.cpp:1045] Creating default 'basic' HTTP authenticator for
realm 'mesos-agent-readonly'
I0829 18:05:37.170408 30740 http.cpp:1066] Creating default 'jwt' HTTP authenticator for realm
'mesos-agent-readonly'
I0829 18:05:37.170568 30740 http.cpp:1045] Creating default 'basic' HTTP authenticator for
realm 'mesos-agent-readwrite'
I0829 18:05:37.170661 30740 http.cpp:1066] Creating default 'jwt' HTTP authenticator for realm
'mesos-agent-readwrite'
I0829 18:05:37.171999 30740 slave.cpp:581] Agent resources: [{"name":"cpus","scalar":{"value":2.0},"type":"SCALAR"},{"name":"mem","scalar":{"value":1024.0},"type":"SCALAR"},{"name":"disk","scalar":{"value":1024.0},"type":"SCALAR"},{"name":"ports","ranges":{"range":[{"begin":31000,"end":32000}]},"type":"RANGES"}]
I0829 18:05:37.172215 30740 slave.cpp:589] Agent attributes: [  ]
I0829 18:05:37.172230 30740 slave.cpp:598] Agent hostname: 978b25557a89
I0829 18:05:37.172384 30745 status_update_manager.cpp:177] Pausing sending status updates
I0829 18:05:37.173820 30736 state.cpp:64] Recovering state from '/tmp/Endpoint_SlaveEndpointTest_NoAuthorizer_1_P0NhiI/meta'
I0829 18:05:37.174082 30753 status_update_manager.cpp:203] Recovering status update manager
I0829 18:05:37.174289 30755 containerizer.cpp:646] Recovering containerizer
I0829 18:05:37.175626 30742 provisioner.cpp:416] Provisioner recovery complete
I0829 18:05:37.175907 30734 slave.cpp:6296] Finished recovery
I0829 18:05:37.176343 30734 slave.cpp:6478] Querying resource estimator for oversubscribable
resources
I0829 18:05:37.176574 30751 slave.cpp:6492] Received oversubscribable resources {} from the
resource estimator
I0829 18:05:37.178663 30739 process.cpp:3933] Handling HTTP event for process 'slave(814)'
with path: '/slave(814)/monitor/statistics.json'
I0829 18:05:37.180403 30753 http.cpp:1185] HTTP GET for /slave(814)/monitor/statistics.json
from 172.17.0.4:43444
I0829 18:05:37.180495 30753 http.cpp:976] Authorizing principal 'test-principal' to GET the
'/monitor/statistics.json' endpoint
I0829 18:05:37.182837 30733 slave.cpp:859] Agent terminating
[       OK ] Endpoint/SlaveEndpointTest.NoAuthorizer/1 (29 ms)
[ RUN      ] Endpoint/SlaveEndpointTest.NoAuthorizer/2
I0829 18:05:37.195323  9649 containerizer.cpp:290] Using isolation { environment_secret, posix/cpu,
posix/mem, filesystem/posix, network/cni }
W0829 18:05:37.195842  9649 backend.cpp:76] Failed to create 'aufs' backend: AufsBackend requires
root privileges
W0829 18:05:37.195960  9649 backend.cpp:76] Failed to create 'bind' backend: BindBackend requires
root privileges
I0829 18:05:37.195996  9649 provisioner.cpp:255] Using default backend 'copy'
I0829 18:05:37.197733  9649 cluster.cpp:448] Creating default 'local' authorizer
I0829 18:05:37.199642 30755 slave.cpp:252] Mesos agent started on (815)@172.17.0.4:36112
I0829 18:05:37.199661 30755 slave.cpp:253] Flags at startup: --acls="" --appc_simple_discovery_uri_prefix="http://"
--appc_store_dir="/tmp/Endpoint_SlaveEndpointTest_NoAuthorizer_2_gdtN13/store/appc" --authenticate_http_executors="true"
--authenticate_http_readonly="true" --authenticate_http_readwrite="true" --authenticatee="crammd5"
--authentication_backoff_factor="1secs" --authorizer="local" --cgroups_cpu_enable_pids_and_tids_count="false"
--cgroups_enable_cfs="false" --cgroups_hierarchy="/sys/fs/cgroup" --cgroups_limit_swap="false"
--cgroups_root="mesos" --container_disk_watch_interval="15secs" --containerizers="mesos" --credential="/tmp/Endpoint_SlaveEndpointTest_NoAuthorizer_2_gdtN13/credential"
--default_role="*" --disallow_sharing_agent_pid_namespace="false" --disk_watch_interval="1mins"
--docker="docker" --docker_kill_orphans="true" --docker_registry="https://registry-1.docker.io"
--docker_remove_delay="6hrs" --docker_socket="/var/run/docker.sock" --docker_stop_timeout="0ns"
--docker_store_dir="/tmp/Endpoint_SlaveEndpointTest_NoAuthorizer_2_gdtN13/store/docker" --docker_volume_checkpoint_dir="/var/run/mesos/isolators/docker/volume"
--enforce_container_disk_quota="false" --executor_registration_timeout="1mins" --executor_reregistration_timeout="2secs"
--executor_secret_key="/tmp/Endpoint_SlaveEndpointTest_NoAuthorizer_2_gdtN13/executor_secret_key"
--executor_shutdown_grace_period="5secs" --fetcher_cache_dir="/tmp/Endpoint_SlaveEndpointTest_NoAuthorizer_2_gdtN13/fetch"
--fetcher_cache_size="2GB" --frameworks_home="" --gc_delay="1weeks" --gc_disk_headroom="0.1"
--hadoop_home="" --help="false" --hostname_lookup="true" --http_command_executor="false" --http_credentials="/tmp/Endpoint_SlaveEndpointTest_NoAuthorizer_2_gdtN13/http_credentials"
--http_heartbeat_interval="30secs" --initialize_driver_logging="true" --isolation="posix/cpu,posix/mem"
--launcher="posix" --launcher_dir="/mesos/mesos-1.5.0/_build/src" --logbufsecs="0" --logging_level="INFO"
--max_completed_executors_per_framework="150" --oversubscribed_resources_interval="15secs"
--perf_duration="10secs" --perf_interval="1mins" --port="5051" --qos_correction_interval_min="0ns"
--quiet="false" --recover="reconnect" --recovery_timeout="15mins" --registration_backoff_factor="10ms"
--resources="cpus:2;gpus:0;mem:1024;disk:1024;ports:[31000-32000]" --revocable_cpu_low_priority="true"
--runtime_dir="/tmp/Endpoint_SlaveEndpointTest_NoAuthorizer_2_gdtN13" --sandbox_directory="/mnt/mesos/sandbox"
--strict="true" --switch_user="true" --systemd_enable_support="true" --systemd_runtime_directory="/run/systemd/system"
--version="false" --work_dir="/tmp/Endpoint_SlaveEndpointTest_NoAuthorizer_2_L14qso"
I0829 18:05:37.200031 30755 credentials.hpp:86] Loading credential for authentication from
'/tmp/Endpoint_SlaveEndpointTest_NoAuthorizer_2_gdtN13/credential'
I0829 18:05:37.200184 30755 slave.cpp:285] Agent using credential for: test-principal
I0829 18:05:37.200206 30755 credentials.hpp:37] Loading credentials for authentication from
'/tmp/Endpoint_SlaveEndpointTest_NoAuthorizer_2_gdtN13/http_credentials'
I0829 18:05:37.200474 30755 http.cpp:1045] Creating default 'basic' HTTP authenticator for
realm 'mesos-agent-executor'
I0829 18:05:37.200598 30755 http.cpp:1066] Creating default 'jwt' HTTP authenticator for realm
'mesos-agent-executor'
I0829 18:05:37.200803 30755 http.cpp:1045] Creating default 'basic' HTTP authenticator for
realm 'mesos-agent-readonly'
I0829 18:05:37.200894 30755 http.cpp:1066] Creating default 'jwt' HTTP authenticator for realm
'mesos-agent-readonly'
I0829 18:05:37.201056 30755 http.cpp:1045] Creating default 'basic' HTTP authenticator for
realm 'mesos-agent-readwrite'
I0829 18:05:37.201148 30755 http.cpp:1066] Creating default 'jwt' HTTP authenticator for realm
'mesos-agent-readwrite'
I0829 18:05:37.202487 30755 slave.cpp:581] Agent resources: [{"name":"cpus","scalar":{"value":2.0},"type":"SCALAR"},{"name":"mem","scalar":{"value":1024.0},"type":"SCALAR"},{"name":"disk","scalar":{"value":1024.0},"type":"SCALAR"},{"name":"ports","ranges":{"range":[{"begin":31000,"end":32000}]},"type":"RANGES"}]
I0829 18:05:37.202705 30755 slave.cpp:589] Agent attributes: [  ]
I0829 18:05:37.202719 30755 slave.cpp:598] Agent hostname: 978b25557a89
I0829 18:05:37.202844 30753 status_update_manager.cpp:177] Pausing sending status updates
I0829 18:05:37.204524 30745 state.cpp:64] Recovering state from '/tmp/Endpoint_SlaveEndpointTest_NoAuthorizer_2_L14qso/meta'
I0829 18:05:37.204826 30740 status_update_manager.cpp:203] Recovering status update manager
I0829 18:05:37.205003 30743 containerizer.cpp:646] Recovering containerizer
I0829 18:05:37.206379 30738 provisioner.cpp:416] Provisioner recovery complete
I0829 18:05:37.206655 30748 slave.cpp:6296] Finished recovery
I0829 18:05:37.207085 30748 slave.cpp:6478] Querying resource estimator for oversubscribable
resources
I0829 18:05:37.207358 30754 slave.cpp:6492] Received oversubscribable resources {} from the
resource estimator
I0829 18:05:37.209434 30750 process.cpp:3933] Handling HTTP event for process 'slave(815)'
with path: '/slave(815)/containers'
I0829 18:05:37.211022 30739 http.cpp:1185] HTTP GET for /slave(815)/containers from 172.17.0.4:43452
I0829 18:05:37.211088 30739 http.cpp:976] Authorizing principal 'test-principal' to GET the
'/containers' endpoint
I0829 18:05:37.214006 30742 slave.cpp:859] Agent terminating
[       OK ] Endpoint/SlaveEndpointTest.NoAuthorizer/2 (30 ms)
[----------] 9 tests from Endpoint/SlaveEndpointTest (280 ms total)

[----------] 2 tests from ContainerizerType/DefaultContainerDNSFlagTest
[ RUN      ] ContainerizerType/DefaultContainerDNSFlagTest.ValidateFlag/0
[       OK ] ContainerizerType/DefaultContainerDNSFlagTest.ValidateFlag/0 (9 ms)
[ RUN      ] ContainerizerType/DefaultContainerDNSFlagTest.ValidateFlag/1
[       OK ] ContainerizerType/DefaultContainerDNSFlagTest.ValidateFlag/1 (9 ms)
[----------] 2 tests from ContainerizerType/DefaultContainerDNSFlagTest (18 ms total)

[----------] Global test environment tear-down
[==========] 1668 tests from 185 test cases ran. (537899 ms total)
[  PASSED  ] 1667 tests.
[  FAILED  ] 1 test, listed below:
[  FAILED  ] DefaultExecutorCheckTest.CommandCheckDeliveredAndReconciled

 1 FAILED TEST
  YOU HAVE 20 DISABLED TESTS

I0829 18:05:37.295413 30756 process.cpp:1072] Failed to accept socket: future discarded
make[4]: *** [check-local] Error 1
make[4]: Leaving directory `/mesos/mesos-1.5.0/_build/src'
make[3]: *** [check-am] Error 2
make[3]: Leaving directory `/mesos/mesos-1.5.0/_build/src'
make[2]: *** [check] Error 2
make[2]: Leaving directory `/mesos/mesos-1.5.0/_build/src'
make[1]: *** [check-recursive] Error 1
make[1]: Leaving directory `/mesos/mesos-1.5.0/_build'
make: *** [distcheck] Error 1
+ docker rmi mesos-1504026928-12712
Untagged: mesos-1504026928-12712:latest
Deleted: sha256:6a907a82b0be3cefce97797f2e36c0e4d2406f894bb193835314d85daa244c40
Deleted: sha256:137505f258b9f466c1ae074aa20054a9e97374b0f6e0f1ea92ec240146e8b1f5
Deleted: sha256:da0aca1c7400471eb6ecdbd8530c2a524a40314e381ee12ba18dfd4055867089
Deleted: sha256:3143a5cc077be088993a925c636fdc8d78109fdd4862ee6a065ade847781fce6
Deleted: sha256:ed3fc0f1320b8024ad56ee9c956906973529f534086034c73eb37e3283848ec5
Deleted: sha256:8138d52578fbd20b3eb43ce9f7684bc48ce07526fb9748a5ffcd3be136d2d987
Deleted: sha256:886cbc99a7300fc24e31fed99b3d75d08ff8d8d6e07769932aa769d5ed436838
Deleted: sha256:8981060970307ac04d4ea2629b2f062354a2349a6fe63abbe4bae0d57464dea1
Deleted: sha256:690df00a7b560f96024d170afa8a45e5a2a9a3dc1db57f8f291da3911027725d
Deleted: sha256:73d7dc803a37688caed64c02eab0d07a419afaeed9e0640ebddccb37a0e590fc
Deleted: sha256:7421300f2e172a1342fc7488d08caefcfcb0fb0ff68b0cbc3d091595d548fd53
Deleted: sha256:fe10bdf5683bb21dcdd56f6b648091a7d233d046c1e01e1b77ffe295ad3533ce
Deleted: sha256:66aca64683a5b0c7ed6dcdbc99ad02366ca5f9485c12fe810b514b148f1e854c
Deleted: sha256:fa337d7a4d7dd3f5c6e391175de67961e19e66c5a53c2f6419e54bb2d0dc9966
Deleted: sha256:a18f2cdf45320d99e813aca7aa41ccbca65c3332851f581539a2c852c21ca087
Deleted: sha256:070c3bbf5f01cada45da690e401e692541f7c36c9edcdf5bc073159c2b272a88
Deleted: sha256:f3726ffebf5e502f56c0c8cd7536d3e2e31348797d2bf163bcc88746364cbac4
Deleted: sha256:fd2b160973ca605ddcc049f2a39ed2878c5629288050dc5bb5eebd69f5540421
Deleted: sha256:4ac93e14289af8b54e97c1e9666b4c10788b65747c1ec7edeb4c57ef250b34e3
Deleted: sha256:530f801a6d8960bc5273c97a1883ce22034259ffbae63cfe5d6c2a0df3660b19
Deleted: sha256:f678bc8fd96a5878d903cd181864829021c2f6ea0daea2d2d3077f33903acd5e
Deleted: sha256:7a2a1685712bd39d960130d170888f5e6053ed060fd0b2b7854fe0ddaaeb7b12
Deleted: sha256:0b8ebbec8aafaddadbbe820c595fcac224158e083e943be2f9ff9d17d6556365
Deleted: sha256:8081bab33547695c61e2aabb5ccad6dca533b2cd7f2bd476e458873ddb11bada
Deleted: sha256:b535ad2e10912a2a48df7e011e6d980293dcb1e23e7ee28d804dd76b891f1e50
Build step 'Execute shell' marked build as failure
Not sending mail to unregistered user yujie.jay@gmail.com

Mime
View raw message