mesos-builds mailing list archives

Site index · List index
Message view « Date » · « Thread »
Top « Date » · « Thread »
From Apache Jenkins Server <jenk...@builds.apache.org>
Subject Build failed in Jenkins: Mesos-Buildbot » autotools,gcc,--verbose,GLOG_v=1 MESOS_VERBOSE=1,centos:7,(ubuntu)&&(!ubuntu-us1)&&(!ubuntu-eu2) #4117
Date Wed, 16 Aug 2017 04:18:28 GMT
See <https://builds.apache.org/job/Mesos-Buildbot/BUILDTOOL=autotools,COMPILER=gcc,CONFIGURATION=--verbose,ENVIRONMENT=GLOG_v=1%20MESOS_VERBOSE=1,OS=centos%3A7,label_exp=(ubuntu)&&(!ubuntu-us1)&&(!ubuntu-eu2)/4117/display/redirect?page=changes>

Changes:

[anand] Added the field `signal` to the `KillNestedContainer` call.

[anand] Added the `kill()` function to the containerizer interface.

[anand] Added `kill()` call to the composing containerizer.

[anand] Made `killNestedContainer()` use `kill()` on the containerizer.

[anand] Made the default executor support signal escalation.

[anand] Added support for kill policies to the default executor.

[anand] Added `kill()` support to the test containerizer interface.

------------------------------------------
[...truncated 30.56 MB...]
I0816 04:18:11.324836  6611 credentials.hpp:86] Loading credential for authentication from
'/tmp/Endpoint_SlaveEndpointTest_AuthorizedRequest_2_L9CwMU/credential'
I0816 04:18:11.325132  6611 slave.cpp:283] Agent using credential for: test-principal
I0816 04:18:11.325173  6611 credentials.hpp:37] Loading credentials for authentication from
'/tmp/Endpoint_SlaveEndpointTest_AuthorizedRequest_2_L9CwMU/http_credentials'
I0816 04:18:11.325597  6611 http.cpp:1026] Creating default 'basic' HTTP authenticator for
realm 'mesos-agent-readonly'
I0816 04:18:11.325884  6611 http.cpp:1026] Creating default 'basic' HTTP authenticator for
realm 'mesos-agent-readwrite'
I0816 04:18:11.328295  6611 slave.cpp:565] Agent resources: [{"name":"cpus","scalar":{"value":2.0},"type":"SCALAR"},{"name":"mem","scalar":{"value":1024.0},"type":"SCALAR"},{"name":"disk","scalar":{"value":1024.0},"type":"SCALAR"},{"name":"ports","ranges":{"range":[{"begin":31000,"end":32000}]},"type":"RANGES"}]
I0816 04:18:11.328753  6611 slave.cpp:573] Agent attributes: [  ]
I0816 04:18:11.328780  6611 slave.cpp:582] Agent hostname: 9a2014439fe9
I0816 04:18:11.329053  6618 status_update_manager.cpp:177] Pausing sending status updates
I0816 04:18:11.331643  6617 state.cpp:64] Recovering state from '/tmp/Endpoint_SlaveEndpointTest_AuthorizedRequest_2_IxqASt/meta'
I0816 04:18:11.331928  6620 status_update_manager.cpp:203] Recovering status update manager
I0816 04:18:11.332190  6610 containerizer.cpp:609] Recovering containerizer
I0816 04:18:11.334379  6619 provisioner.cpp:416] Provisioner recovery complete
I0816 04:18:11.334997  6608 slave.cpp:6210] Finished recovery
I0816 04:18:11.335907  6608 slave.cpp:6392] Querying resource estimator for oversubscribable
resources
I0816 04:18:11.336490  6600 slave.cpp:6406] Received oversubscribable resources {} from the
resource estimator
I0816 04:18:11.340411  6621 process.cpp:3933] Handling HTTP event for process 'slave(796)'
with path: '/slave(796)/containers'
I0816 04:18:11.342057  6615 http.cpp:1166] HTTP GET for /slave(796)/containers from 172.17.0.3:55758
I0816 04:18:11.342181  6615 http.cpp:957] Authorizing principal 'test-principal' to GET the
'/containers' endpoint
I0816 04:18:11.348423  6581 slave.cpp:843] Agent terminating
[       OK ] Endpoint/SlaveEndpointTest.AuthorizedRequest/2 (47 ms)
[ RUN      ] Endpoint/SlaveEndpointTest.UnauthorizedRequest/0
I0816 04:18:11.365643  6581 containerizer.cpp:246] Using isolation: posix/cpu,posix/mem,filesystem/posix,network/cni,environment_secret
W0816 04:18:11.366681  6581 backend.cpp:76] Failed to create 'aufs' backend: AufsBackend requires
root privileges
W0816 04:18:11.366881  6581 backend.cpp:76] Failed to create 'bind' backend: BindBackend requires
root privileges
I0816 04:18:11.366916  6581 provisioner.cpp:255] Using default backend 'copy'
I0816 04:18:11.373433  6603 slave.cpp:250] Mesos agent started on (797)@172.17.0.3:46867
I0816 04:18:11.373471  6603 slave.cpp:251] Flags at startup: --acls="" --appc_simple_discovery_uri_prefix="http://"
--appc_store_dir="/tmp/Endpoint_SlaveEndpointTest_UnauthorizedRequest_0_fy2ZME/store/appc"
--authenticate_http_readonly="true" --authenticate_http_readwrite="true" --authenticatee="crammd5"
--authentication_backoff_factor="1secs" --authorizer="local" --cgroups_cpu_enable_pids_and_tids_count="false"
--cgroups_enable_cfs="false" --cgroups_hierarchy="/sys/fs/cgroup" --cgroups_limit_swap="false"
--cgroups_root="mesos" --container_disk_watch_interval="15secs" --containerizers="mesos" --credential="/tmp/Endpoint_SlaveEndpointTest_UnauthorizedRequest_0_fy2ZME/credential"
--default_role="*" --disallow_sharing_agent_pid_namespace="false" --disk_watch_interval="1mins"
--docker="docker" --docker_kill_orphans="true" --docker_registry="https://registry-1.docker.io"
--docker_remove_delay="6hrs" --docker_socket="/var/run/docker.sock" --docker_stop_timeout="0ns"
--docker_store_dir="/tmp/Endpoint_SlaveEndpointTest_UnauthorizedRequest_0_fy2ZME/store/docker"
--docker_volume_checkpoint_dir="/var/run/mesos/isolators/docker/volume" --enforce_container_disk_quota="false"
--executor_registration_timeout="1mins" --executor_reregistration_timeout="2secs" --executor_shutdown_grace_period="5secs"
--fetcher_cache_dir="/tmp/Endpoint_SlaveEndpointTest_UnauthorizedRequest_0_fy2ZME/fetch" --fetcher_cache_size="2GB"
--frameworks_home="" --gc_delay="1weeks" --gc_disk_headroom="0.1" --hadoop_home="" --help="false"
--hostname_lookup="true" --http_command_executor="false" --http_credentials="/tmp/Endpoint_SlaveEndpointTest_UnauthorizedRequest_0_fy2ZME/http_credentials"
--http_heartbeat_interval="30secs" --initialize_driver_logging="true" --isolation="posix/cpu,posix/mem"
--launcher="posix" --launcher_dir="/mesos/mesos-1.4.0/_build/src" --logbufsecs="0" --logging_level="INFO"
--max_completed_executors_per_framework="150" --oversubscribed_resources_interval="15secs"
--perf_duration="10secs" --perf_interval="1mins" --port="5051" --qos_correction_interval_min="0ns"
--quiet="false" --recover="reconnect" --recovery_timeout="15mins" --registration_backoff_factor="10ms"
--resources="cpus:2;gpus:0;mem:1024;disk:1024;ports:[31000-32000]" --revocable_cpu_low_priority="true"
--runtime_dir="/tmp/Endpoint_SlaveEndpointTest_UnauthorizedRequest_0_fy2ZME" --sandbox_directory="/mnt/mesos/sandbox"
--strict="true" --switch_user="true" --systemd_enable_support="true" --systemd_runtime_directory="/run/systemd/system"
--version="false" --work_dir="/tmp/Endpoint_SlaveEndpointTest_UnauthorizedRequest_0_kTiRLd"
I0816 04:18:11.374094  6603 credentials.hpp:86] Loading credential for authentication from
'/tmp/Endpoint_SlaveEndpointTest_UnauthorizedRequest_0_fy2ZME/credential'
I0816 04:18:11.374305  6603 slave.cpp:283] Agent using credential for: test-principal
I0816 04:18:11.374337  6603 credentials.hpp:37] Loading credentials for authentication from
'/tmp/Endpoint_SlaveEndpointTest_UnauthorizedRequest_0_fy2ZME/http_credentials'
I0816 04:18:11.374658  6603 http.cpp:1026] Creating default 'basic' HTTP authenticator for
realm 'mesos-agent-readonly'
I0816 04:18:11.374878  6603 http.cpp:1026] Creating default 'basic' HTTP authenticator for
realm 'mesos-agent-readwrite'
I0816 04:18:11.376807  6603 slave.cpp:565] Agent resources: [{"name":"cpus","scalar":{"value":2.0},"type":"SCALAR"},{"name":"mem","scalar":{"value":1024.0},"type":"SCALAR"},{"name":"disk","scalar":{"value":1024.0},"type":"SCALAR"},{"name":"ports","ranges":{"range":[{"begin":31000,"end":32000}]},"type":"RANGES"}]
I0816 04:18:11.377135  6603 slave.cpp:573] Agent attributes: [  ]
I0816 04:18:11.377152  6603 slave.cpp:582] Agent hostname: 9a2014439fe9
I0816 04:18:11.377358  6612 status_update_manager.cpp:177] Pausing sending status updates
I0816 04:18:11.379334  6621 state.cpp:64] Recovering state from '/tmp/Endpoint_SlaveEndpointTest_UnauthorizedRequest_0_kTiRLd/meta'
I0816 04:18:11.379802  6602 status_update_manager.cpp:203] Recovering status update manager
I0816 04:18:11.380060  6619 containerizer.cpp:609] Recovering containerizer
I0816 04:18:11.382045  6617 provisioner.cpp:416] Provisioner recovery complete
I0816 04:18:11.382586  6621 slave.cpp:6210] Finished recovery
I0816 04:18:11.383313  6621 slave.cpp:6392] Querying resource estimator for oversubscribable
resources
I0816 04:18:11.383750  6623 slave.cpp:6406] Received oversubscribable resources {} from the
resource estimator
I0816 04:18:11.386687  6610 process.cpp:3933] Handling HTTP event for process 'slave(797)'
with path: '/slave(797)/monitor/statistics'
I0816 04:18:11.388581  6614 http.cpp:1166] HTTP GET for /slave(797)/monitor/statistics from
172.17.0.3:55760
I0816 04:18:11.388751  6614 http.cpp:957] Authorizing principal 'test-principal' to GET the
'/monitor/statistics' endpoint
I0816 04:18:11.392421  6581 slave.cpp:843] Agent terminating
[       OK ] Endpoint/SlaveEndpointTest.UnauthorizedRequest/0 (42 ms)
[ RUN      ] Endpoint/SlaveEndpointTest.UnauthorizedRequest/1
I0816 04:18:11.406541  6581 containerizer.cpp:246] Using isolation: posix/cpu,posix/mem,filesystem/posix,network/cni,environment_secret
W0816 04:18:11.407083  6581 backend.cpp:76] Failed to create 'aufs' backend: AufsBackend requires
root privileges
W0816 04:18:11.407196  6581 backend.cpp:76] Failed to create 'bind' backend: BindBackend requires
root privileges
I0816 04:18:11.407236  6581 provisioner.cpp:255] Using default backend 'copy'
I0816 04:18:11.411293  6608 slave.cpp:250] Mesos agent started on (798)@172.17.0.3:46867
I0816 04:18:11.411325  6608 slave.cpp:251] Flags at startup: --acls="" --appc_simple_discovery_uri_prefix="http://"
--appc_store_dir="/tmp/Endpoint_SlaveEndpointTest_UnauthorizedRequest_1_h4uHdp/store/appc"
--authenticate_http_readonly="true" --authenticate_http_readwrite="true" --authenticatee="crammd5"
--authentication_backoff_factor="1secs" --authorizer="local" --cgroups_cpu_enable_pids_and_tids_count="false"
--cgroups_enable_cfs="false" --cgroups_hierarchy="/sys/fs/cgroup" --cgroups_limit_swap="false"
--cgroups_root="mesos" --container_disk_watch_interval="15secs" --containerizers="mesos" --credential="/tmp/Endpoint_SlaveEndpointTest_UnauthorizedRequest_1_h4uHdp/credential"
--default_role="*" --disallow_sharing_agent_pid_namespace="false" --disk_watch_interval="1mins"
--docker="docker" --docker_kill_orphans="true" --docker_registry="https://registry-1.docker.io"
--docker_remove_delay="6hrs" --docker_socket="/var/run/docker.sock" --docker_stop_timeout="0ns"
--docker_store_dir="/tmp/Endpoint_SlaveEndpointTest_UnauthorizedRequest_1_h4uHdp/store/docker"
--docker_volume_checkpoint_dir="/var/run/mesos/isolators/docker/volume" --enforce_container_disk_quota="false"
--executor_registration_timeout="1mins" --executor_reregistration_timeout="2secs" --executor_shutdown_grace_period="5secs"
--fetcher_cache_dir="/tmp/Endpoint_SlaveEndpointTest_UnauthorizedRequest_1_h4uHdp/fetch" --fetcher_cache_size="2GB"
--frameworks_home="" --gc_delay="1weeks" --gc_disk_headroom="0.1" --hadoop_home="" --help="false"
--hostname_lookup="true" --http_command_executor="false" --http_credentials="/tmp/Endpoint_SlaveEndpointTest_UnauthorizedRequest_1_h4uHdp/http_credentials"
--http_heartbeat_interval="30secs" --initialize_driver_logging="true" --isolation="posix/cpu,posix/mem"
--launcher="posix" --launcher_dir="/mesos/mesos-1.4.0/_build/src" --logbufsecs="0" --logging_level="INFO"
--max_completed_executors_per_framework="150" --oversubscribed_resources_interval="15secs"
--perf_duration="10secs" --perf_interval="1mins" --port="5051" --qos_correction_interval_min="0ns"
--quiet="false" --recover="reconnect" --recovery_timeout="15mins" --registration_backoff_factor="10ms"
--resources="cpus:2;gpus:0;mem:1024;disk:1024;ports:[31000-32000]" --revocable_cpu_low_priority="true"
--runtime_dir="/tmp/Endpoint_SlaveEndpointTest_UnauthorizedRequest_1_h4uHdp" --sandbox_directory="/mnt/mesos/sandbox"
--strict="true" --switch_user="true" --systemd_enable_support="true" --systemd_runtime_directory="/run/systemd/system"
--version="false" --work_dir="/tmp/Endpoint_SlaveEndpointTest_UnauthorizedRequest_1_Id2a6X"
I0816 04:18:11.411726  6608 credentials.hpp:86] Loading credential for authentication from
'/tmp/Endpoint_SlaveEndpointTest_UnauthorizedRequest_1_h4uHdp/credential'
I0816 04:18:11.411901  6608 slave.cpp:283] Agent using credential for: test-principal
I0816 04:18:11.411942  6608 credentials.hpp:37] Loading credentials for authentication from
'/tmp/Endpoint_SlaveEndpointTest_UnauthorizedRequest_1_h4uHdp/http_credentials'
I0816 04:18:11.412233  6608 http.cpp:1026] Creating default 'basic' HTTP authenticator for
realm 'mesos-agent-readonly'
I0816 04:18:11.412447  6608 http.cpp:1026] Creating default 'basic' HTTP authenticator for
realm 'mesos-agent-readwrite'
I0816 04:18:11.414075  6608 slave.cpp:565] Agent resources: [{"name":"cpus","scalar":{"value":2.0},"type":"SCALAR"},{"name":"mem","scalar":{"value":1024.0},"type":"SCALAR"},{"name":"disk","scalar":{"value":1024.0},"type":"SCALAR"},{"name":"ports","ranges":{"range":[{"begin":31000,"end":32000}]},"type":"RANGES"}]
I0816 04:18:11.414458  6608 slave.cpp:573] Agent attributes: [  ]
I0816 04:18:11.414484  6608 slave.cpp:582] Agent hostname: 9a2014439fe9
I0816 04:18:11.414676  6601 status_update_manager.cpp:177] Pausing sending status updates
I0816 04:18:11.417071  6605 state.cpp:64] Recovering state from '/tmp/Endpoint_SlaveEndpointTest_UnauthorizedRequest_1_Id2a6X/meta'
I0816 04:18:11.417570  6605 status_update_manager.cpp:203] Recovering status update manager
I0816 04:18:11.417866  6623 containerizer.cpp:609] Recovering containerizer
I0816 04:18:11.419967  6618 provisioner.cpp:416] Provisioner recovery complete
I0816 04:18:11.420519  6602 slave.cpp:6210] Finished recovery
I0816 04:18:11.421025  6602 slave.cpp:6392] Querying resource estimator for oversubscribable
resources
I0816 04:18:11.421360  6622 slave.cpp:6406] Received oversubscribable resources {} from the
resource estimator
I0816 04:18:11.424230  6601 process.cpp:3933] Handling HTTP event for process 'slave(798)'
with path: '/slave(798)/monitor/statistics.json'
I0816 04:18:11.425902  6621 http.cpp:1166] HTTP GET for /slave(798)/monitor/statistics.json
from 172.17.0.3:55762
I0816 04:18:11.425981  6621 http.cpp:957] Authorizing principal 'test-principal' to GET the
'/monitor/statistics.json' endpoint
I0816 04:18:11.429523  6581 slave.cpp:843] Agent terminating
[       OK ] Endpoint/SlaveEndpointTest.UnauthorizedRequest/1 (36 ms)
[ RUN      ] Endpoint/SlaveEndpointTest.UnauthorizedRequest/2
I0816 04:18:11.444990  6581 containerizer.cpp:246] Using isolation: posix/cpu,posix/mem,filesystem/posix,network/cni,environment_secret
W0816 04:18:11.445572  6581 backend.cpp:76] Failed to create 'aufs' backend: AufsBackend requires
root privileges
W0816 04:18:11.445683  6581 backend.cpp:76] Failed to create 'bind' backend: BindBackend requires
root privileges
I0816 04:18:11.445727  6581 provisioner.cpp:255] Using default backend 'copy'
I0816 04:18:11.450670  6602 slave.cpp:250] Mesos agent started on (799)@172.17.0.3:46867
I0816 04:18:11.450706  6602 slave.cpp:251] Flags at startup: --acls="" --appc_simple_discovery_uri_prefix="http://"
--appc_store_dir="/tmp/Endpoint_SlaveEndpointTest_UnauthorizedRequest_2_OkFK09/store/appc"
--authenticate_http_readonly="true" --authenticate_http_readwrite="true" --authenticatee="crammd5"
--authentication_backoff_factor="1secs" --authorizer="local" --cgroups_cpu_enable_pids_and_tids_count="false"
--cgroups_enable_cfs="false" --cgroups_hierarchy="/sys/fs/cgroup" --cgroups_limit_swap="false"
--cgroups_root="mesos" --container_disk_watch_interval="15secs" --containerizers="mesos" --credential="/tmp/Endpoint_SlaveEndpointTest_UnauthorizedRequest_2_OkFK09/credential"
--default_role="*" --disallow_sharing_agent_pid_namespace="false" --disk_watch_interval="1mins"
--docker="docker" --docker_kill_orphans="true" --docker_registry="https://registry-1.docker.io"
--docker_remove_delay="6hrs" --docker_socket="/var/run/docker.sock" --docker_stop_timeout="0ns"
--docker_store_dir="/tmp/Endpoint_SlaveEndpointTest_UnauthorizedRequest_2_OkFK09/store/docker"
--docker_volume_checkpoint_dir="/var/run/mesos/isolators/docker/volume" --enforce_container_disk_quota="false"
--executor_registration_timeout="1mins" --executor_reregistration_timeout="2secs" --executor_shutdown_grace_period="5secs"
--fetcher_cache_dir="/tmp/Endpoint_SlaveEndpointTest_UnauthorizedRequest_2_OkFK09/fetch" --fetcher_cache_size="2GB"
--frameworks_home="" --gc_delay="1weeks" --gc_disk_headroom="0.1" --hadoop_home="" --help="false"
--hostname_lookup="true" --http_command_executor="false" --http_credentials="/tmp/Endpoint_SlaveEndpointTest_UnauthorizedRequest_2_OkFK09/http_credentials"
--http_heartbeat_interval="30secs" --initialize_driver_logging="true" --isolation="posix/cpu,posix/mem"
--launcher="posix" --launcher_dir="/mesos/mesos-1.4.0/_build/src" --logbufsecs="0" --logging_level="INFO"
--max_completed_executors_per_framework="150" --oversubscribed_resources_interval="15secs"
--perf_duration="10secs" --perf_interval="1mins" --port="5051" --qos_correction_interval_min="0ns"
--quiet="false" --recover="reconnect" --recovery_timeout="15mins" --registration_backoff_factor="10ms"
--resources="cpus:2;gpus:0;mem:1024;disk:1024;ports:[31000-32000]" --revocable_cpu_low_priority="true"
--runtime_dir="/tmp/Endpoint_SlaveEndpointTest_UnauthorizedRequest_2_OkFK09" --sandbox_directory="/mnt/mesos/sandbox"
--strict="true" --switch_user="true" --systemd_enable_support="true" --systemd_runtime_directory="/run/systemd/system"
--version="false" --work_dir="/tmp/Endpoint_SlaveEndpointTest_UnauthorizedRequest_2_cuECNI"
I0816 04:18:11.451159  6602 credentials.hpp:86] Loading credential for authentication from
'/tmp/Endpoint_SlaveEndpointTest_UnauthorizedRequest_2_OkFK09/credential'
I0816 04:18:11.451333  6602 slave.cpp:283] Agent using credential for: test-principal
I0816 04:18:11.451360  6602 credentials.hpp:37] Loading credentials for authentication from
'/tmp/Endpoint_SlaveEndpointTest_UnauthorizedRequest_2_OkFK09/http_credentials'
I0816 04:18:11.451630  6602 http.cpp:1026] Creating default 'basic' HTTP authenticator for
realm 'mesos-agent-readonly'
I0816 04:18:11.451815  6602 http.cpp:1026] Creating default 'basic' HTTP authenticator for
realm 'mesos-agent-readwrite'
I0816 04:18:11.453450  6602 slave.cpp:565] Agent resources: [{"name":"cpus","scalar":{"value":2.0},"type":"SCALAR"},{"name":"mem","scalar":{"value":1024.0},"type":"SCALAR"},{"name":"disk","scalar":{"value":1024.0},"type":"SCALAR"},{"name":"ports","ranges":{"range":[{"begin":31000,"end":32000}]},"type":"RANGES"}]
I0816 04:18:11.453722  6602 slave.cpp:573] Agent attributes: [  ]
I0816 04:18:11.453737  6602 slave.cpp:582] Agent hostname: 9a2014439fe9
I0816 04:18:11.453928  6603 status_update_manager.cpp:177] Pausing sending status updates
I0816 04:18:11.455528  6609 state.cpp:64] Recovering state from '/tmp/Endpoint_SlaveEndpointTest_UnauthorizedRequest_2_cuECNI/meta'
I0816 04:18:11.455868  6605 status_update_manager.cpp:203] Recovering status update manager
I0816 04:18:11.456142  6610 containerizer.cpp:609] Recovering containerizer
I0816 04:18:11.457940  6614 provisioner.cpp:416] Provisioner recovery complete
I0816 04:18:11.458504  6623 slave.cpp:6210] Finished recovery
I0816 04:18:11.459132  6623 slave.cpp:6392] Querying resource estimator for oversubscribable
resources
I0816 04:18:11.459441  6613 slave.cpp:6406] Received oversubscribable resources {} from the
resource estimator
I0816 04:18:11.462263  6603 process.cpp:3933] Handling HTTP event for process 'slave(799)'
with path: '/slave(799)/containers'
I0816 04:18:11.464103  6622 http.cpp:1166] HTTP GET for /slave(799)/containers from 172.17.0.3:55766
I0816 04:18:11.464200  6622 http.cpp:957] Authorizing principal 'test-principal' to GET the
'/containers' endpoint
I0816 04:18:11.466827  6581 slave.cpp:843] Agent terminating
[       OK ] Endpoint/SlaveEndpointTest.UnauthorizedRequest/2 (37 ms)
[ RUN      ] Endpoint/SlaveEndpointTest.NoAuthorizer/0
I0816 04:18:11.481287  6581 containerizer.cpp:246] Using isolation: posix/cpu,posix/mem,filesystem/posix,network/cni,environment_secret
W0816 04:18:11.481832  6581 backend.cpp:76] Failed to create 'aufs' backend: AufsBackend requires
root privileges
W0816 04:18:11.481946  6581 backend.cpp:76] Failed to create 'bind' backend: BindBackend requires
root privileges
I0816 04:18:11.481988  6581 provisioner.cpp:255] Using default backend 'copy'
I0816 04:18:11.483952  6581 cluster.cpp:448] Creating default 'local' authorizer
I0816 04:18:11.486091  6616 slave.cpp:250] Mesos agent started on (800)@172.17.0.3:46867
I0816 04:18:11.486117  6616 slave.cpp:251] Flags at startup: --acls="" --appc_simple_discovery_uri_prefix="http://"
--appc_store_dir="/tmp/Endpoint_SlaveEndpointTest_NoAuthorizer_0_KWy19U/store/appc" --authenticate_http_readonly="true"
--authenticate_http_readwrite="true" --authenticatee="crammd5" --authentication_backoff_factor="1secs"
--authorizer="local" --cgroups_cpu_enable_pids_and_tids_count="false" --cgroups_enable_cfs="false"
--cgroups_hierarchy="/sys/fs/cgroup" --cgroups_limit_swap="false" --cgroups_root="mesos" --container_disk_watch_interval="15secs"
--containerizers="mesos" --credential="/tmp/Endpoint_SlaveEndpointTest_NoAuthorizer_0_KWy19U/credential"
--default_role="*" --disallow_sharing_agent_pid_namespace="false" --disk_watch_interval="1mins"
--docker="docker" --docker_kill_orphans="true" --docker_registry="https://registry-1.docker.io"
--docker_remove_delay="6hrs" --docker_socket="/var/run/docker.sock" --docker_stop_timeout="0ns"
--docker_store_dir="/tmp/Endpoint_SlaveEndpointTest_NoAuthorizer_0_KWy19U/store/docker" --docker_volume_checkpoint_dir="/var/run/mesos/isolators/docker/volume"
--enforce_container_disk_quota="false" --executor_registration_timeout="1mins" --executor_reregistration_timeout="2secs"
--executor_shutdown_grace_period="5secs" --fetcher_cache_dir="/tmp/Endpoint_SlaveEndpointTest_NoAuthorizer_0_KWy19U/fetch"
--fetcher_cache_size="2GB" --frameworks_home="" --gc_delay="1weeks" --gc_disk_headroom="0.1"
--hadoop_home="" --help="false" --hostname_lookup="true" --http_command_executor="false" --http_credentials="/tmp/Endpoint_SlaveEndpointTest_NoAuthorizer_0_KWy19U/http_credentials"
--http_heartbeat_interval="30secs" --initialize_driver_logging="true" --isolation="posix/cpu,posix/mem"
--launcher="posix" --launcher_dir="/mesos/mesos-1.4.0/_build/src" --logbufsecs="0" --logging_level="INFO"
--max_completed_executors_per_framework="150" --oversubscribed_resources_interval="15secs"
--perf_duration="10secs" --perf_interval="1mins" --port="5051" --qos_correction_interval_min="0ns"
--quiet="false" --recover="reconnect" --recovery_timeout="15mins" --registration_backoff_factor="10ms"
--resources="cpus:2;gpus:0;mem:1024;disk:1024;ports:[31000-32000]" --revocable_cpu_low_priority="true"
--runtime_dir="/tmp/Endpoint_SlaveEndpointTest_NoAuthorizer_0_KWy19U" --sandbox_directory="/mnt/mesos/sandbox"
--strict="true" --switch_user="true" --systemd_enable_support="true" --systemd_runtime_directory="/run/systemd/system"
--version="false" --work_dir="/tmp/Endpoint_SlaveEndpointTest_NoAuthorizer_0_ftypRt"
I0816 04:18:11.486519  6616 credentials.hpp:86] Loading credential for authentication from
'/tmp/Endpoint_SlaveEndpointTest_NoAuthorizer_0_KWy19U/credential'
I0816 04:18:11.486702  6616 slave.cpp:283] Agent using credential for: test-principal
I0816 04:18:11.486727  6616 credentials.hpp:37] Loading credentials for authentication from
'/tmp/Endpoint_SlaveEndpointTest_NoAuthorizer_0_KWy19U/http_credentials'
I0816 04:18:11.486984  6616 http.cpp:1026] Creating default 'basic' HTTP authenticator for
realm 'mesos-agent-readonly'
I0816 04:18:11.487242  6616 http.cpp:1026] Creating default 'basic' HTTP authenticator for
realm 'mesos-agent-readwrite'
I0816 04:18:11.489002  6616 slave.cpp:565] Agent resources: [{"name":"cpus","scalar":{"value":2.0},"type":"SCALAR"},{"name":"mem","scalar":{"value":1024.0},"type":"SCALAR"},{"name":"disk","scalar":{"value":1024.0},"type":"SCALAR"},{"name":"ports","ranges":{"range":[{"begin":31000,"end":32000}]},"type":"RANGES"}]
I0816 04:18:11.489298  6616 slave.cpp:573] Agent attributes: [  ]
I0816 04:18:11.489328  6616 slave.cpp:582] Agent hostname: 9a2014439fe9
I0816 04:18:11.489476  6603 status_update_manager.cpp:177] Pausing sending status updates
I0816 04:18:11.491379  6617 state.cpp:64] Recovering state from '/tmp/Endpoint_SlaveEndpointTest_NoAuthorizer_0_ftypRt/meta'
I0816 04:18:11.491662  6619 status_update_manager.cpp:203] Recovering status update manager
I0816 04:18:11.491945  6600 containerizer.cpp:609] Recovering containerizer
I0816 04:18:11.493727  6603 provisioner.cpp:416] Provisioner recovery complete
I0816 04:18:11.494474  6608 slave.cpp:6210] Finished recovery
I0816 04:18:11.495044  6608 slave.cpp:6392] Querying resource estimator for oversubscribable
resources
I0816 04:18:11.495383  6615 slave.cpp:6406] Received oversubscribable resources {} from the
resource estimator
I0816 04:18:11.498716  6610 process.cpp:3933] Handling HTTP event for process 'slave(800)'
with path: '/slave(800)/monitor/statistics'
I0816 04:18:11.500386  6609 http.cpp:1166] HTTP GET for /slave(800)/monitor/statistics from
172.17.0.3:55768
I0816 04:18:11.500499  6609 http.cpp:957] Authorizing principal 'test-principal' to GET the
'/monitor/statistics' endpoint
I0816 04:18:11.504619  6581 slave.cpp:843] Agent terminating
[       OK ] Endpoint/SlaveEndpointTest.NoAuthorizer/0 (36 ms)
[ RUN      ] Endpoint/SlaveEndpointTest.NoAuthorizer/1
I0816 04:18:11.520653  6581 containerizer.cpp:246] Using isolation: posix/cpu,posix/mem,filesystem/posix,network/cni,environment_secret
W0816 04:18:11.521312  6581 backend.cpp:76] Failed to create 'aufs' backend: AufsBackend requires
root privileges
W0816 04:18:11.521456  6581 backend.cpp:76] Failed to create 'bind' backend: BindBackend requires
root privileges
I0816 04:18:11.521517  6581 provisioner.cpp:255] Using default backend 'copy'
I0816 04:18:11.523874  6581 cluster.cpp:448] Creating default 'local' authorizer
I0816 04:18:11.526294  6614 slave.cpp:250] Mesos agent started on (801)@172.17.0.3:46867
I0816 04:18:11.526340  6614 slave.cpp:251] Flags at startup: --acls="" --appc_simple_discovery_uri_prefix="http://"
--appc_store_dir="/tmp/Endpoint_SlaveEndpointTest_NoAuthorizer_1_mHfGFG/store/appc" --authenticate_http_readonly="true"
--authenticate_http_readwrite="true" --authenticatee="crammd5" --authentication_backoff_factor="1secs"
--authorizer="local" --cgroups_cpu_enable_pids_and_tids_count="false" --cgroups_enable_cfs="false"
--cgroups_hierarchy="/sys/fs/cgroup" --cgroups_limit_swap="false" --cgroups_root="mesos" --container_disk_watch_interval="15secs"
--containerizers="mesos" --credential="/tmp/Endpoint_SlaveEndpointTest_NoAuthorizer_1_mHfGFG/credential"
--default_role="*" --disallow_sharing_agent_pid_namespace="false" --disk_watch_interval="1mins"
--docker="docker" --docker_kill_orphans="true" --docker_registry="https://registry-1.docker.io"
--docker_remove_delay="6hrs" --docker_socket="/var/run/docker.sock" --docker_stop_timeout="0ns"
--docker_store_dir="/tmp/Endpoint_SlaveEndpointTest_NoAuthorizer_1_mHfGFG/store/docker" --docker_volume_checkpoint_dir="/var/run/mesos/isolators/docker/volume"
--enforce_container_disk_quota="false" --executor_registration_timeout="1mins" --executor_reregistration_timeout="2secs"
--executor_shutdown_grace_period="5secs" --fetcher_cache_dir="/tmp/Endpoint_SlaveEndpointTest_NoAuthorizer_1_mHfGFG/fetch"
--fetcher_cache_size="2GB" --frameworks_home="" --gc_delay="1weeks" --gc_disk_headroom="0.1"
--hadoop_home="" --help="false" --hostname_lookup="true" --http_command_executor="false" --http_credentials="/tmp/Endpoint_SlaveEndpointTest_NoAuthorizer_1_mHfGFG/http_credentials"
--http_heartbeat_interval="30secs" --initialize_driver_logging="true" --isolation="posix/cpu,posix/mem"
--launcher="posix" --launcher_dir="/mesos/mesos-1.4.0/_build/src" --logbufsecs="0" --logging_level="INFO"
--max_completed_executors_per_framework="150" --oversubscribed_resources_interval="15secs"
--perf_duration="10secs" --perf_interval="1mins" --port="5051" --qos_correction_interval_min="0ns"
--quiet="false" --recover="reconnect" --recovery_timeout="15mins" --registration_backoff_factor="10ms"
--resources="cpus:2;gpus:0;mem:1024;disk:1024;ports:[31000-32000]" --revocable_cpu_low_priority="true"
--runtime_dir="/tmp/Endpoint_SlaveEndpointTest_NoAuthorizer_1_mHfGFG" --sandbox_directory="/mnt/mesos/sandbox"
--strict="true" --switch_user="true" --systemd_enable_support="true" --systemd_runtime_directory="/run/systemd/system"
--version="false" --work_dir="/tmp/Endpoint_SlaveEndpointTest_NoAuthorizer_1_sTzjhf"
I0816 04:18:11.526818  6614 credentials.hpp:86] Loading credential for authentication from
'/tmp/Endpoint_SlaveEndpointTest_NoAuthorizer_1_mHfGFG/credential'
I0816 04:18:11.526983  6614 slave.cpp:283] Agent using credential for: test-principal
I0816 04:18:11.527010  6614 credentials.hpp:37] Loading credentials for authentication from
'/tmp/Endpoint_SlaveEndpointTest_NoAuthorizer_1_mHfGFG/http_credentials'
I0816 04:18:11.527266  6614 http.cpp:1026] Creating default 'basic' HTTP authenticator for
realm 'mesos-agent-readonly'
I0816 04:18:11.527434  6614 http.cpp:1026] Creating default 'basic' HTTP authenticator for
realm 'mesos-agent-readwrite'
I0816 04:18:11.529100  6614 slave.cpp:565] Agent resources: [{"name":"cpus","scalar":{"value":2.0},"type":"SCALAR"},{"name":"mem","scalar":{"value":1024.0},"type":"SCALAR"},{"name":"disk","scalar":{"value":1024.0},"type":"SCALAR"},{"name":"ports","ranges":{"range":[{"begin":31000,"end":32000}]},"type":"RANGES"}]
I0816 04:18:11.529363  6614 slave.cpp:573] Agent attributes: [  ]
I0816 04:18:11.529378  6614 slave.cpp:582] Agent hostname: 9a2014439fe9
I0816 04:18:11.529583  6602 status_update_manager.cpp:177] Pausing sending status updates
I0816 04:18:11.531116  6607 state.cpp:64] Recovering state from '/tmp/Endpoint_SlaveEndpointTest_NoAuthorizer_1_sTzjhf/meta'
I0816 04:18:11.531534  6612 status_update_manager.cpp:203] Recovering status update manager
I0816 04:18:11.531759  6621 containerizer.cpp:609] Recovering containerizer
I0816 04:18:11.533246  6619 provisioner.cpp:416] Provisioner recovery complete
I0816 04:18:11.533630  6613 slave.cpp:6210] Finished recovery
I0816 04:18:11.534168  6613 slave.cpp:6392] Querying resource estimator for oversubscribable
resources
I0816 04:18:11.534420  6616 slave.cpp:6406] Received oversubscribable resources {} from the
resource estimator
I0816 04:18:11.537207  6618 process.cpp:3933] Handling HTTP event for process 'slave(801)'
with path: '/slave(801)/monitor/statistics.json'
I0816 04:18:11.539041  6611 http.cpp:1166] HTTP GET for /slave(801)/monitor/statistics.json
from 172.17.0.3:55770
I0816 04:18:11.539168  6611 http.cpp:957] Authorizing principal 'test-principal' to GET the
'/monitor/statistics.json' endpoint
I0816 04:18:11.543509  6581 slave.cpp:843] Agent terminating
[       OK ] Endpoint/SlaveEndpointTest.NoAuthorizer/1 (39 ms)
[ RUN      ] Endpoint/SlaveEndpointTest.NoAuthorizer/2
I0816 04:18:11.557773  6581 containerizer.cpp:246] Using isolation: posix/cpu,posix/mem,filesystem/posix,network/cni,environment_secret
W0816 04:18:11.558349  6581 backend.cpp:76] Failed to create 'aufs' backend: AufsBackend requires
root privileges
W0816 04:18:11.558470  6581 backend.cpp:76] Failed to create 'bind' backend: BindBackend requires
root privileges
I0816 04:18:11.558509  6581 provisioner.cpp:255] Using default backend 'copy'
I0816 04:18:11.560453  6581 cluster.cpp:448] Creating default 'local' authorizer
I0816 04:18:11.562383  6605 slave.cpp:250] Mesos agent started on (802)@172.17.0.3:46867
I0816 04:18:11.562414  6605 slave.cpp:251] Flags at startup: --acls="" --appc_simple_discovery_uri_prefix="http://"
--appc_store_dir="/tmp/Endpoint_SlaveEndpointTest_NoAuthorizer_2_SvDdys/store/appc" --authenticate_http_readonly="true"
--authenticate_http_readwrite="true" --authenticatee="crammd5" --authentication_backoff_factor="1secs"
--authorizer="local" --cgroups_cpu_enable_pids_and_tids_count="false" --cgroups_enable_cfs="false"
--cgroups_hierarchy="/sys/fs/cgroup" --cgroups_limit_swap="false" --cgroups_root="mesos" --container_disk_watch_interval="15secs"
--containerizers="mesos" --credential="/tmp/Endpoint_SlaveEndpointTest_NoAuthorizer_2_SvDdys/credential"
--default_role="*" --disallow_sharing_agent_pid_namespace="false" --disk_watch_interval="1mins"
--docker="docker" --docker_kill_orphans="true" --docker_registry="https://registry-1.docker.io"
--docker_remove_delay="6hrs" --docker_socket="/var/run/docker.sock" --docker_stop_timeout="0ns"
--docker_store_dir="/tmp/Endpoint_SlaveEndpointTest_NoAuthorizer_2_SvDdys/store/docker" --docker_volume_checkpoint_dir="/var/run/mesos/isolators/docker/volume"
--enforce_container_disk_quota="false" --executor_registration_timeout="1mins" --executor_reregistration_timeout="2secs"
--executor_shutdown_grace_period="5secs" --fetcher_cache_dir="/tmp/Endpoint_SlaveEndpointTest_NoAuthorizer_2_SvDdys/fetch"
--fetcher_cache_size="2GB" --frameworks_home="" --gc_delay="1weeks" --gc_disk_headroom="0.1"
--hadoop_home="" --help="false" --hostname_lookup="true" --http_command_executor="false" --http_credentials="/tmp/Endpoint_SlaveEndpointTest_NoAuthorizer_2_SvDdys/http_credentials"
--http_heartbeat_interval="30secs" --initialize_driver_logging="true" --isolation="posix/cpu,posix/mem"
--launcher="posix" --launcher_dir="/mesos/mesos-1.4.0/_build/src" --logbufsecs="0" --logging_level="INFO"
--max_completed_executors_per_framework="150" --oversubscribed_resources_interval="15secs"
--perf_duration="10secs" --perf_interval="1mins" --port="5051" --qos_correction_interval_min="0ns"
--quiet="false" --recover="reconnect" --recovery_timeout="15mins" --registration_backoff_factor="10ms"
--resources="cpus:2;gpus:0;mem:1024;disk:1024;ports:[31000-32000]" --revocable_cpu_low_priority="true"
--runtime_dir="/tmp/Endpoint_SlaveEndpointTest_NoAuthorizer_2_SvDdys" --sandbox_directory="/mnt/mesos/sandbox"
--strict="true" --switch_user="true" --systemd_enable_support="true" --systemd_runtime_directory="/run/systemd/system"
--version="false" --work_dir="/tmp/Endpoint_SlaveEndpointTest_NoAuthorizer_2_nvYe40"
I0816 04:18:11.562768  6605 credentials.hpp:86] Loading credential for authentication from
'/tmp/Endpoint_SlaveEndpointTest_NoAuthorizer_2_SvDdys/credential'
I0816 04:18:11.562934  6605 slave.cpp:283] Agent using credential for: test-principal
I0816 04:18:11.562960  6605 credentials.hpp:37] Loading credentials for authentication from
'/tmp/Endpoint_SlaveEndpointTest_NoAuthorizer_2_SvDdys/http_credentials'
I0816 04:18:11.563225  6605 http.cpp:1026] Creating default 'basic' HTTP authenticator for
realm 'mesos-agent-readonly'
I0816 04:18:11.563452  6605 http.cpp:1026] Creating default 'basic' HTTP authenticator for
realm 'mesos-agent-readwrite'
I0816 04:18:11.565064  6605 slave.cpp:565] Agent resources: [{"name":"cpus","scalar":{"value":2.0},"type":"SCALAR"},{"name":"mem","scalar":{"value":1024.0},"type":"SCALAR"},{"name":"disk","scalar":{"value":1024.0},"type":"SCALAR"},{"name":"ports","ranges":{"range":[{"begin":31000,"end":32000}]},"type":"RANGES"}]
I0816 04:18:11.565309  6605 slave.cpp:573] Agent attributes: [  ]
I0816 04:18:11.565323  6605 slave.cpp:582] Agent hostname: 9a2014439fe9
I0816 04:18:11.565501  6600 status_update_manager.cpp:177] Pausing sending status updates
I0816 04:18:11.567863  6622 state.cpp:64] Recovering state from '/tmp/Endpoint_SlaveEndpointTest_NoAuthorizer_2_nvYe40/meta'
I0816 04:18:11.568239  6621 status_update_manager.cpp:203] Recovering status update manager
I0816 04:18:11.568430  6606 containerizer.cpp:609] Recovering containerizer
I0816 04:18:11.570576  6604 provisioner.cpp:416] Provisioner recovery complete
I0816 04:18:11.571162  6602 slave.cpp:6210] Finished recovery
I0816 04:18:11.571679  6602 slave.cpp:6392] Querying resource estimator for oversubscribable
resources
I0816 04:18:11.571949  6613 slave.cpp:6406] Received oversubscribable resources {} from the
resource estimator
I0816 04:18:11.574976  6607 process.cpp:3933] Handling HTTP event for process 'slave(802)'
with path: '/slave(802)/containers'
I0816 04:18:11.576469  6616 http.cpp:1166] HTTP GET for /slave(802)/containers from 172.17.0.3:55772
I0816 04:18:11.576619  6616 http.cpp:957] Authorizing principal 'test-principal' to GET the
'/containers' endpoint
I0816 04:18:11.581056  6581 slave.cpp:843] Agent terminating
[       OK ] Endpoint/SlaveEndpointTest.NoAuthorizer/2 (36 ms)
[----------] 9 tests from Endpoint/SlaveEndpointTest (355 ms total)

[----------] 2 tests from ContainerizerType/DefaultContainerDNSFlagTest
[ RUN      ] ContainerizerType/DefaultContainerDNSFlagTest.ValidateFlag/0
[       OK ] ContainerizerType/DefaultContainerDNSFlagTest.ValidateFlag/0 (20 ms)
[ RUN      ] ContainerizerType/DefaultContainerDNSFlagTest.ValidateFlag/1
[       OK ] ContainerizerType/DefaultContainerDNSFlagTest.ValidateFlag/1 (14 ms)
[----------] 2 tests from ContainerizerType/DefaultContainerDNSFlagTest (34 ms total)

[----------] Global test environment tear-down
[==========] 1652 tests from 182 test cases ran. (568968 ms total)
[  PASSED  ] 1650 tests.
[  FAILED  ] 2 tests, listed below:
[  FAILED  ] CommandExecutorCheckTest.CommandCheckDeliveredAndReconciled
[  FAILED  ] ExamplesTest.PersistentVolumeFramework

 2 FAILED TESTS
  YOU HAVE 20 DISABLED TESTS

I0816 04:18:11.699251  6624 process.cpp:1072] Failed to accept socket: future discarded
make[4]: *** [check-local] Error 1
make[4]: Leaving directory `/mesos/mesos-1.4.0/_build/src'
make[3]: *** [check-am] Error 2
make[3]: Leaving directory `/mesos/mesos-1.4.0/_build/src'
make[2]: *** [check] Error 2
make[2]: Leaving directory `/mesos/mesos-1.4.0/_build/src'
make[1]: *** [check-recursive] Error 1
make[1]: Leaving directory `/mesos/mesos-1.4.0/_build'
make: *** [distcheck] Error 1
+ docker rmi mesos-1502854464-30894
Untagged: mesos-1502854464-30894:latest
Deleted: sha256:b6e74edf38f7c704d1d5070caa68f3062f788eaca33925ede114617fc6917239
Deleted: sha256:9fb51c626a3a1fa54feef01e541e0c876b69e303abed581ac2ca71fe6513ffb8
Deleted: sha256:d5626053120626eb989b8ebcf78ca9e38ea77daf20fee9fbeb2cf8249738bacd
Deleted: sha256:04d92eba8417e17a01cd2357ef77ba50473142127eb8be72f264fa5a8bfa4f28
Deleted: sha256:95517ef321d00d03daf9705b384dde6cab3804f2119dcc54e1a364d222134068
Deleted: sha256:07bcc70eebf893b5942d0c11c22914da08da5977fae570a948f4aee199baa460
Deleted: sha256:9c0b13310859cfe5ba00b5d8a0ba71de515ee33ce2842285b5d0ca139ab199cd
Deleted: sha256:9db8c5ab2a0f149cf1882f2236f563bef48f3d4ed68f9bc85098d439787ab240
Deleted: sha256:93f26c3f47e0197801b0d64d7fc5ec522241c37153a53300898afa5cff8f3aa9
Deleted: sha256:17a68ac5d022db19dbfc1d87c0956a324454499688d19caa50e972fc3b1561c2
Deleted: sha256:7aebc6a72727c56cc2e328eb570b72ff51b5f84eda6bef0cadffa73854b1c34d
Deleted: sha256:56e0a8d3a362c67b9ae7ec813da5731e18ac89aefac26cf99f75a3c8c7be66de
Deleted: sha256:6cef08f3f4590b96758f07cdec9f85fb5c8802f32cf92178391486ad0c71b124
Deleted: sha256:17e1c1d572a7a307e96e6952c5fca1ded886c1dd94b98113f28c13a7bc398408
Deleted: sha256:d9bfdd888c13cfa2b9a5a9b5a1f98d0b599b61e6527a163945b8b3f9431e948d
Deleted: sha256:1660e01fb907c985ea1b0f3ac307a33438889d3c4801a0e59a779d092d12df6a
Deleted: sha256:8d568c5f74e7a463a9a088632e0b9add1cec0babca8b57773a0d3ccc5b7afa20
Deleted: sha256:bbc67590b6c28e854b1e81ee1eae454fecdee8bae083d5f8bdb8cd798d699d52
Deleted: sha256:a2a900f057b0394c061d4e9231be6f3cb49b34d3d3d66a81df57cfb210989786
Deleted: sha256:88b86e924150f4604407489cf0c4d2f42654e9227faadbb4c7c0823eceba43bf
Deleted: sha256:d6032a30d05f711196dfbbf4bf4d6d15c25031e393230196f1ac307f65bb093d
Deleted: sha256:2a49851ad6f14ba85ff6a95350b9485db80f267d30c2f9f9fb610619a57e3d33
Deleted: sha256:530b439181d723b49bdf185e05a4b05e023e093796a7d21796e8169123cf6a55
Deleted: sha256:0f147915b3b673c05476c1213557128c1af9439e0d005ced04aff82f9532d1ba
Deleted: sha256:60aaea2b2ac2fcefc303c5ec2d0b296a9cf54346180c80659815feb10e761d1d
Build step 'Execute shell' marked build as failure

Mime
View raw message