mesos-builds mailing list archives

Site index · List index
Message view « Date » · « Thread »
Top « Date » · « Thread »
From Apache Jenkins Server <jenk...@builds.apache.org>
Subject Build failed in Jenkins: Mesos-Reviewbot #18885
Date Wed, 16 Aug 2017 04:16:01 GMT
See <https://builds.apache.org/job/Mesos-Reviewbot/18885/display/redirect?page=changes>

Changes:

[anand] Added the field `signal` to the `KillNestedContainer` call.

[anand] Added the `kill()` function to the containerizer interface.

[anand] Added `kill()` call to the composing containerizer.

[anand] Made `killNestedContainer()` use `kill()` on the containerizer.

[anand] Made the default executor support signal escalation.

[anand] Added support for kill policies to the default executor.

[anand] Added `kill()` support to the test containerizer interface.

------------------------------------------
[...truncated 30.99 MB...]
I0816 04:15:54.098173  5276 slave.cpp:283] Agent using credential for: test-principal
I0816 04:15:54.098208  5276 credentials.hpp:37] Loading credentials for authentication from
'/tmp/Endpoint_SlaveEndpointTest_AuthorizedRequest_2_N1TWQ9/http_credentials'
I0816 04:15:54.098692  5276 http.cpp:1026] Creating default 'basic' HTTP authenticator for
realm 'mesos-agent-readonly'
I0816 04:15:54.099107  5276 http.cpp:1026] Creating default 'basic' HTTP authenticator for
realm 'mesos-agent-readwrite'
I0816 04:15:54.101517  5276 slave.cpp:565] Agent resources: [{"name":"cpus","scalar":{"value":2.0},"type":"SCALAR"},{"name":"mem","scalar":{"value":1024.0},"type":"SCALAR"},{"name":"disk","scalar":{"value":1024.0},"type":"SCALAR"},{"name":"ports","ranges":{"range":[{"begin":31000,"end":32000}]},"type":"RANGES"}]
I0816 04:15:54.101953  5276 slave.cpp:573] Agent attributes: [  ]
I0816 04:15:54.101974  5276 slave.cpp:582] Agent hostname: 7f6516f92249
I0816 04:15:54.102334  5274 status_update_manager.cpp:177] Pausing sending status updates
I0816 04:15:54.104732  5271 state.cpp:64] Recovering state from '/tmp/Endpoint_SlaveEndpointTest_AuthorizedRequest_2_X2s8Nr/meta'
I0816 04:15:54.105296  5273 status_update_manager.cpp:203] Recovering status update manager
I0816 04:15:54.105809  5276 containerizer.cpp:609] Recovering containerizer
I0816 04:15:54.108275  5278 provisioner.cpp:416] Provisioner recovery complete
I0816 04:15:54.108922  5277 slave.cpp:6210] Finished recovery
I0816 04:15:54.109514  5277 slave.cpp:6392] Querying resource estimator for oversubscribable
resources
I0816 04:15:54.109961  5273 slave.cpp:6406] Received oversubscribable resources {} from the
resource estimator
I0816 04:15:54.114300  5277 process.cpp:3933] Handling HTTP event for process 'slave(799)'
with path: '/slave(799)/containers'
I0816 04:15:54.116219  5276 http.cpp:1166] HTTP GET for /slave(799)/containers from 172.17.0.2:36300
I0816 04:15:54.116340  5276 http.cpp:957] Authorizing principal 'test-principal' to GET the
'/containers' endpoint
I0816 04:15:54.122911  5252 slave.cpp:843] Agent terminating
[       OK ] Endpoint/SlaveEndpointTest.AuthorizedRequest/2 (49 ms)
[ RUN      ] Endpoint/SlaveEndpointTest.UnauthorizedRequest/0
I0816 04:15:54.140388  5252 containerizer.cpp:246] Using isolation: posix/cpu,posix/mem,filesystem/posix,network/cni,environment_secret
W0816 04:15:54.141149  5252 backend.cpp:76] Failed to create 'overlay' backend: OverlayBackend
requires root privileges
W0816 04:15:54.141345  5252 backend.cpp:76] Failed to create 'bind' backend: BindBackend requires
root privileges
I0816 04:15:54.141386  5252 provisioner.cpp:255] Using default backend 'copy'
I0816 04:15:54.147025  5275 slave.cpp:250] Mesos agent started on (800)@172.17.0.2:40823
I0816 04:15:54.147066  5275 slave.cpp:251] Flags at startup: --acls="" --appc_simple_discovery_uri_prefix="http://"
--appc_store_dir="/tmp/Endpoint_SlaveEndpointTest_UnauthorizedRequest_0_rM1Qt0/store/appc"
--authenticate_http_readonly="true" --authenticate_http_readwrite="true" --authenticatee="crammd5"
--authentication_backoff_factor="1secs" --authorizer="local" --cgroups_cpu_enable_pids_and_tids_count="false"
--cgroups_enable_cfs="false" --cgroups_hierarchy="/sys/fs/cgroup" --cgroups_limit_swap="false"
--cgroups_root="mesos" --container_disk_watch_interval="15secs" --containerizers="mesos" --credential="/tmp/Endpoint_SlaveEndpointTest_UnauthorizedRequest_0_rM1Qt0/credential"
--default_role="*" --disallow_sharing_agent_pid_namespace="false" --disk_watch_interval="1mins"
--docker="docker" --docker_kill_orphans="true" --docker_registry="https://registry-1.docker.io"
--docker_remove_delay="6hrs" --docker_socket="/var/run/docker.sock" --docker_stop_timeout="0ns"
--docker_store_dir="/tmp/Endpoint_SlaveEndpointTest_UnauthorizedRequest_0_rM1Qt0/store/docker"
--docker_volume_checkpoint_dir="/var/run/mesos/isolators/docker/volume" --enforce_container_disk_quota="false"
--executor_registration_timeout="1mins" --executor_reregistration_timeout="2secs" --executor_shutdown_grace_period="5secs"
--fetcher_cache_dir="/tmp/Endpoint_SlaveEndpointTest_UnauthorizedRequest_0_rM1Qt0/fetch" --fetcher_cache_size="2GB"
--frameworks_home="" --gc_delay="1weeks" --gc_disk_headroom="0.1" --hadoop_home="" --help="false"
--hostname_lookup="true" --http_command_executor="false" --http_credentials="/tmp/Endpoint_SlaveEndpointTest_UnauthorizedRequest_0_rM1Qt0/http_credentials"
--http_heartbeat_interval="30secs" --initialize_driver_logging="true" --isolation="posix/cpu,posix/mem"
--launcher="posix" --launcher_dir="/mesos/mesos-1.4.0/_build/src" --logbufsecs="0" --logging_level="INFO"
--max_completed_executors_per_framework="150" --oversubscribed_resources_interval="15secs"
--perf_duration="10secs" --perf_interval="1mins" --port="5051" --qos_correction_interval_min="0ns"
--quiet="false" --recover="reconnect" --recovery_timeout="15mins" --registration_backoff_factor="10ms"
--resources="cpus:2;gpus:0;mem:1024;disk:1024;ports:[31000-32000]" --revocable_cpu_low_priority="true"
--runtime_dir="/tmp/Endpoint_SlaveEndpointTest_UnauthorizedRequest_0_rM1Qt0" --sandbox_directory="/mnt/mesos/sandbox"
--strict="true" --switch_user="true" --systemd_enable_support="true" --systemd_runtime_directory="/run/systemd/system"
--version="false" --work_dir="/tmp/Endpoint_SlaveEndpointTest_UnauthorizedRequest_0_9gnVii"
I0816 04:15:54.147897  5275 credentials.hpp:86] Loading credential for authentication from
'/tmp/Endpoint_SlaveEndpointTest_UnauthorizedRequest_0_rM1Qt0/credential'
I0816 04:15:54.148260  5275 slave.cpp:283] Agent using credential for: test-principal
I0816 04:15:54.148293  5275 credentials.hpp:37] Loading credentials for authentication from
'/tmp/Endpoint_SlaveEndpointTest_UnauthorizedRequest_0_rM1Qt0/http_credentials'
I0816 04:15:54.148756  5275 http.cpp:1026] Creating default 'basic' HTTP authenticator for
realm 'mesos-agent-readonly'
I0816 04:15:54.149130  5275 http.cpp:1026] Creating default 'basic' HTTP authenticator for
realm 'mesos-agent-readwrite'
I0816 04:15:54.151491  5275 slave.cpp:565] Agent resources: [{"name":"cpus","scalar":{"value":2.0},"type":"SCALAR"},{"name":"mem","scalar":{"value":1024.0},"type":"SCALAR"},{"name":"disk","scalar":{"value":1024.0},"type":"SCALAR"},{"name":"ports","ranges":{"range":[{"begin":31000,"end":32000}]},"type":"RANGES"}]
I0816 04:15:54.151923  5275 slave.cpp:573] Agent attributes: [  ]
I0816 04:15:54.151945  5275 slave.cpp:582] Agent hostname: 7f6516f92249
I0816 04:15:54.152207  5272 status_update_manager.cpp:177] Pausing sending status updates
I0816 04:15:54.154395  5278 state.cpp:64] Recovering state from '/tmp/Endpoint_SlaveEndpointTest_UnauthorizedRequest_0_9gnVii/meta'
I0816 04:15:54.154819  5273 status_update_manager.cpp:203] Recovering status update manager
I0816 04:15:54.155302  5275 containerizer.cpp:609] Recovering containerizer
I0816 04:15:54.157505  5273 provisioner.cpp:416] Provisioner recovery complete
I0816 04:15:54.158242  5278 slave.cpp:6210] Finished recovery
I0816 04:15:54.158895  5278 slave.cpp:6392] Querying resource estimator for oversubscribable
resources
I0816 04:15:54.159310  5272 slave.cpp:6406] Received oversubscribable resources {} from the
resource estimator
I0816 04:15:54.163195  5273 process.cpp:3933] Handling HTTP event for process 'slave(800)'
with path: '/slave(800)/monitor/statistics'
I0816 04:15:54.165282  5276 http.cpp:1166] HTTP GET for /slave(800)/monitor/statistics from
172.17.0.2:36302
I0816 04:15:54.165401  5276 http.cpp:957] Authorizing principal 'test-principal' to GET the
'/monitor/statistics' endpoint
I0816 04:15:54.169167  5252 slave.cpp:843] Agent terminating
[       OK ] Endpoint/SlaveEndpointTest.UnauthorizedRequest/0 (46 ms)
[ RUN      ] Endpoint/SlaveEndpointTest.UnauthorizedRequest/1
I0816 04:15:54.186713  5252 containerizer.cpp:246] Using isolation: posix/cpu,posix/mem,filesystem/posix,network/cni,environment_secret
W0816 04:15:54.187480  5252 backend.cpp:76] Failed to create 'overlay' backend: OverlayBackend
requires root privileges
W0816 04:15:54.187676  5252 backend.cpp:76] Failed to create 'bind' backend: BindBackend requires
root privileges
I0816 04:15:54.187717  5252 provisioner.cpp:255] Using default backend 'copy'
I0816 04:15:54.193264  5272 slave.cpp:250] Mesos agent started on (801)@172.17.0.2:40823
I0816 04:15:54.193305  5272 slave.cpp:251] Flags at startup: --acls="" --appc_simple_discovery_uri_prefix="http://"
--appc_store_dir="/tmp/Endpoint_SlaveEndpointTest_UnauthorizedRequest_1_j67fBR/store/appc"
--authenticate_http_readonly="true" --authenticate_http_readwrite="true" --authenticatee="crammd5"
--authentication_backoff_factor="1secs" --authorizer="local" --cgroups_cpu_enable_pids_and_tids_count="false"
--cgroups_enable_cfs="false" --cgroups_hierarchy="/sys/fs/cgroup" --cgroups_limit_swap="false"
--cgroups_root="mesos" --container_disk_watch_interval="15secs" --containerizers="mesos" --credential="/tmp/Endpoint_SlaveEndpointTest_UnauthorizedRequest_1_j67fBR/credential"
--default_role="*" --disallow_sharing_agent_pid_namespace="false" --disk_watch_interval="1mins"
--docker="docker" --docker_kill_orphans="true" --docker_registry="https://registry-1.docker.io"
--docker_remove_delay="6hrs" --docker_socket="/var/run/docker.sock" --docker_stop_timeout="0ns"
--docker_store_dir="/tmp/Endpoint_SlaveEndpointTest_UnauthorizedRequest_1_j67fBR/store/docker"
--docker_volume_checkpoint_dir="/var/run/mesos/isolators/docker/volume" --enforce_container_disk_quota="false"
--executor_registration_timeout="1mins" --executor_reregistration_timeout="2secs" --executor_shutdown_grace_period="5secs"
--fetcher_cache_dir="/tmp/Endpoint_SlaveEndpointTest_UnauthorizedRequest_1_j67fBR/fetch" --fetcher_cache_size="2GB"
--frameworks_home="" --gc_delay="1weeks" --gc_disk_headroom="0.1" --hadoop_home="" --help="false"
--hostname_lookup="true" --http_command_executor="false" --http_credentials="/tmp/Endpoint_SlaveEndpointTest_UnauthorizedRequest_1_j67fBR/http_credentials"
--http_heartbeat_interval="30secs" --initialize_driver_logging="true" --isolation="posix/cpu,posix/mem"
--launcher="posix" --launcher_dir="/mesos/mesos-1.4.0/_build/src" --logbufsecs="0" --logging_level="INFO"
--max_completed_executors_per_framework="150" --oversubscribed_resources_interval="15secs"
--perf_duration="10secs" --perf_interval="1mins" --port="5051" --qos_correction_interval_min="0ns"
--quiet="false" --recover="reconnect" --recovery_timeout="15mins" --registration_backoff_factor="10ms"
--resources="cpus:2;gpus:0;mem:1024;disk:1024;ports:[31000-32000]" --revocable_cpu_low_priority="true"
--runtime_dir="/tmp/Endpoint_SlaveEndpointTest_UnauthorizedRequest_1_j67fBR" --sandbox_directory="/mnt/mesos/sandbox"
--strict="true" --switch_user="true" --systemd_enable_support="true" --systemd_runtime_directory="/run/systemd/system"
--version="false" --work_dir="/tmp/Endpoint_SlaveEndpointTest_UnauthorizedRequest_1_F7DPi9"
I0816 04:15:54.194051  5272 credentials.hpp:86] Loading credential for authentication from
'/tmp/Endpoint_SlaveEndpointTest_UnauthorizedRequest_1_j67fBR/credential'
I0816 04:15:54.194308  5272 slave.cpp:283] Agent using credential for: test-principal
I0816 04:15:54.194330  5272 credentials.hpp:37] Loading credentials for authentication from
'/tmp/Endpoint_SlaveEndpointTest_UnauthorizedRequest_1_j67fBR/http_credentials'
I0816 04:15:54.194679  5272 http.cpp:1026] Creating default 'basic' HTTP authenticator for
realm 'mesos-agent-readonly'
I0816 04:15:54.194957  5272 http.cpp:1026] Creating default 'basic' HTTP authenticator for
realm 'mesos-agent-readwrite'
I0816 04:15:54.197145  5272 slave.cpp:565] Agent resources: [{"name":"cpus","scalar":{"value":2.0},"type":"SCALAR"},{"name":"mem","scalar":{"value":1024.0},"type":"SCALAR"},{"name":"disk","scalar":{"value":1024.0},"type":"SCALAR"},{"name":"ports","ranges":{"range":[{"begin":31000,"end":32000}]},"type":"RANGES"}]
I0816 04:15:54.197574  5272 slave.cpp:573] Agent attributes: [  ]
I0816 04:15:54.197600  5272 slave.cpp:582] Agent hostname: 7f6516f92249
I0816 04:15:54.197872  5275 status_update_manager.cpp:177] Pausing sending status updates
I0816 04:15:54.199928  5274 state.cpp:64] Recovering state from '/tmp/Endpoint_SlaveEndpointTest_UnauthorizedRequest_1_F7DPi9/meta'
I0816 04:15:54.200631  5278 status_update_manager.cpp:203] Recovering status update manager
I0816 04:15:54.200882  5277 containerizer.cpp:609] Recovering containerizer
I0816 04:15:54.203035  5273 provisioner.cpp:416] Provisioner recovery complete
I0816 04:15:54.203661  5278 slave.cpp:6210] Finished recovery
I0816 04:15:54.204319  5278 slave.cpp:6392] Querying resource estimator for oversubscribable
resources
I0816 04:15:54.204789  5276 slave.cpp:6406] Received oversubscribable resources {} from the
resource estimator
I0816 04:15:54.208844  5272 process.cpp:3933] Handling HTTP event for process 'slave(801)'
with path: '/slave(801)/monitor/statistics.json'
I0816 04:15:54.210732  5277 http.cpp:1166] HTTP GET for /slave(801)/monitor/statistics.json
from 172.17.0.2:36304
I0816 04:15:54.210846  5277 http.cpp:957] Authorizing principal 'test-principal' to GET the
'/monitor/statistics.json' endpoint
I0816 04:15:54.214205  5276 slave.cpp:843] Agent terminating
[       OK ] Endpoint/SlaveEndpointTest.UnauthorizedRequest/1 (44 ms)
[ RUN      ] Endpoint/SlaveEndpointTest.UnauthorizedRequest/2
I0816 04:15:54.231397  5252 containerizer.cpp:246] Using isolation: posix/cpu,posix/mem,filesystem/posix,network/cni,environment_secret
W0816 04:15:54.232156  5252 backend.cpp:76] Failed to create 'overlay' backend: OverlayBackend
requires root privileges
W0816 04:15:54.232352  5252 backend.cpp:76] Failed to create 'bind' backend: BindBackend requires
root privileges
I0816 04:15:54.232391  5252 provisioner.cpp:255] Using default backend 'copy'
I0816 04:15:54.238085  5273 slave.cpp:250] Mesos agent started on (802)@172.17.0.2:40823
I0816 04:15:54.238160  5273 slave.cpp:251] Flags at startup: --acls="" --appc_simple_discovery_uri_prefix="http://"
--appc_store_dir="/tmp/Endpoint_SlaveEndpointTest_UnauthorizedRequest_2_D4VLbJ/store/appc"
--authenticate_http_readonly="true" --authenticate_http_readwrite="true" --authenticatee="crammd5"
--authentication_backoff_factor="1secs" --authorizer="local" --cgroups_cpu_enable_pids_and_tids_count="false"
--cgroups_enable_cfs="false" --cgroups_hierarchy="/sys/fs/cgroup" --cgroups_limit_swap="false"
--cgroups_root="mesos" --container_disk_watch_interval="15secs" --containerizers="mesos" --credential="/tmp/Endpoint_SlaveEndpointTest_UnauthorizedRequest_2_D4VLbJ/credential"
--default_role="*" --disallow_sharing_agent_pid_namespace="false" --disk_watch_interval="1mins"
--docker="docker" --docker_kill_orphans="true" --docker_registry="https://registry-1.docker.io"
--docker_remove_delay="6hrs" --docker_socket="/var/run/docker.sock" --docker_stop_timeout="0ns"
--docker_store_dir="/tmp/Endpoint_SlaveEndpointTest_UnauthorizedRequest_2_D4VLbJ/store/docker"
--docker_volume_checkpoint_dir="/var/run/mesos/isolators/docker/volume" --enforce_container_disk_quota="false"
--executor_registration_timeout="1mins" --executor_reregistration_timeout="2secs" --executor_shutdown_grace_period="5secs"
--fetcher_cache_dir="/tmp/Endpoint_SlaveEndpointTest_UnauthorizedRequest_2_D4VLbJ/fetch" --fetcher_cache_size="2GB"
--frameworks_home="" --gc_delay="1weeks" --gc_disk_headroom="0.1" --hadoop_home="" --help="false"
--hostname_lookup="true" --http_command_executor="false" --http_credentials="/tmp/Endpoint_SlaveEndpointTest_UnauthorizedRequest_2_D4VLbJ/http_credentials"
--http_heartbeat_interval="30secs" --initialize_driver_logging="true" --isolation="posix/cpu,posix/mem"
--launcher="posix" --launcher_dir="/mesos/mesos-1.4.0/_build/src" --logbufsecs="0" --logging_level="INFO"
--max_completed_executors_per_framework="150" --oversubscribed_resources_interval="15secs"
--perf_duration="10secs" --perf_interval="1mins" --port="5051" --qos_correction_interval_min="0ns"
--quiet="false" --recover="reconnect" --recovery_timeout="15mins" --registration_backoff_factor="10ms"
--resources="cpus:2;gpus:0;mem:1024;disk:1024;ports:[31000-32000]" --revocable_cpu_low_priority="true"
--runtime_dir="/tmp/Endpoint_SlaveEndpointTest_UnauthorizedRequest_2_D4VLbJ" --sandbox_directory="/mnt/mesos/sandbox"
--strict="true" --switch_user="true" --systemd_enable_support="true" --systemd_runtime_directory="/run/systemd/system"
--version="false" --work_dir="/tmp/Endpoint_SlaveEndpointTest_UnauthorizedRequest_2_FJR5L0"
I0816 04:15:54.239107  5273 credentials.hpp:86] Loading credential for authentication from
'/tmp/Endpoint_SlaveEndpointTest_UnauthorizedRequest_2_D4VLbJ/credential'
I0816 04:15:54.239722  5273 slave.cpp:283] Agent using credential for: test-principal
I0816 04:15:54.239791  5273 credentials.hpp:37] Loading credentials for authentication from
'/tmp/Endpoint_SlaveEndpointTest_UnauthorizedRequest_2_D4VLbJ/http_credentials'
I0816 04:15:54.240461  5273 http.cpp:1026] Creating default 'basic' HTTP authenticator for
realm 'mesos-agent-readonly'
I0816 04:15:54.240939  5273 http.cpp:1026] Creating default 'basic' HTTP authenticator for
realm 'mesos-agent-readwrite'
I0816 04:15:54.243404  5273 slave.cpp:565] Agent resources: [{"name":"cpus","scalar":{"value":2.0},"type":"SCALAR"},{"name":"mem","scalar":{"value":1024.0},"type":"SCALAR"},{"name":"disk","scalar":{"value":1024.0},"type":"SCALAR"},{"name":"ports","ranges":{"range":[{"begin":31000,"end":32000}]},"type":"RANGES"}]
I0816 04:15:54.244128  5273 slave.cpp:573] Agent attributes: [  ]
I0816 04:15:54.244292  5273 slave.cpp:582] Agent hostname: 7f6516f92249
I0816 04:15:54.244654  5276 status_update_manager.cpp:177] Pausing sending status updates
I0816 04:15:54.246986  5271 state.cpp:64] Recovering state from '/tmp/Endpoint_SlaveEndpointTest_UnauthorizedRequest_2_FJR5L0/meta'
I0816 04:15:54.247596  5277 status_update_manager.cpp:203] Recovering status update manager
I0816 04:15:54.247925  5275 containerizer.cpp:609] Recovering containerizer
I0816 04:15:54.250246  5271 provisioner.cpp:416] Provisioner recovery complete
I0816 04:15:54.251135  5277 slave.cpp:6210] Finished recovery
I0816 04:15:54.251770  5277 slave.cpp:6392] Querying resource estimator for oversubscribable
resources
I0816 04:15:54.252231  5278 slave.cpp:6406] Received oversubscribable resources {} from the
resource estimator
I0816 04:15:54.256278  5273 process.cpp:3933] Handling HTTP event for process 'slave(802)'
with path: '/slave(802)/containers'
I0816 04:15:54.258581  5271 http.cpp:1166] HTTP GET for /slave(802)/containers from 172.17.0.2:36306
I0816 04:15:54.258785  5271 http.cpp:957] Authorizing principal 'test-principal' to GET the
'/containers' endpoint
I0816 04:15:54.263283  5252 slave.cpp:843] Agent terminating
[       OK ] Endpoint/SlaveEndpointTest.UnauthorizedRequest/2 (48 ms)
[ RUN      ] Endpoint/SlaveEndpointTest.NoAuthorizer/0
I0816 04:15:54.281132  5252 containerizer.cpp:246] Using isolation: posix/cpu,posix/mem,filesystem/posix,network/cni,environment_secret
W0816 04:15:54.281898  5252 backend.cpp:76] Failed to create 'overlay' backend: OverlayBackend
requires root privileges
W0816 04:15:54.282091  5252 backend.cpp:76] Failed to create 'bind' backend: BindBackend requires
root privileges
I0816 04:15:54.282132  5252 provisioner.cpp:255] Using default backend 'copy'
I0816 04:15:54.284824  5252 cluster.cpp:448] Creating default 'local' authorizer
I0816 04:15:54.287858  5276 slave.cpp:250] Mesos agent started on (803)@172.17.0.2:40823
I0816 04:15:54.287899  5276 slave.cpp:251] Flags at startup: --acls="" --appc_simple_discovery_uri_prefix="http://"
--appc_store_dir="/tmp/Endpoint_SlaveEndpointTest_NoAuthorizer_0_z80ShB/store/appc" --authenticate_http_readonly="true"
--authenticate_http_readwrite="true" --authenticatee="crammd5" --authentication_backoff_factor="1secs"
--authorizer="local" --cgroups_cpu_enable_pids_and_tids_count="false" --cgroups_enable_cfs="false"
--cgroups_hierarchy="/sys/fs/cgroup" --cgroups_limit_swap="false" --cgroups_root="mesos" --container_disk_watch_interval="15secs"
--containerizers="mesos" --credential="/tmp/Endpoint_SlaveEndpointTest_NoAuthorizer_0_z80ShB/credential"
--default_role="*" --disallow_sharing_agent_pid_namespace="false" --disk_watch_interval="1mins"
--docker="docker" --docker_kill_orphans="true" --docker_registry="https://registry-1.docker.io"
--docker_remove_delay="6hrs" --docker_socket="/var/run/docker.sock" --docker_stop_timeout="0ns"
--docker_store_dir="/tmp/Endpoint_SlaveEndpointTest_NoAuthorizer_0_z80ShB/store/docker" --docker_volume_checkpoint_dir="/var/run/mesos/isolators/docker/volume"
--enforce_container_disk_quota="false" --executor_registration_timeout="1mins" --executor_reregistration_timeout="2secs"
--executor_shutdown_grace_period="5secs" --fetcher_cache_dir="/tmp/Endpoint_SlaveEndpointTest_NoAuthorizer_0_z80ShB/fetch"
--fetcher_cache_size="2GB" --frameworks_home="" --gc_delay="1weeks" --gc_disk_headroom="0.1"
--hadoop_home="" --help="false" --hostname_lookup="true" --http_command_executor="false" --http_credentials="/tmp/Endpoint_SlaveEndpointTest_NoAuthorizer_0_z80ShB/http_credentials"
--http_heartbeat_interval="30secs" --initialize_driver_logging="true" --isolation="posix/cpu,posix/mem"
--launcher="posix" --launcher_dir="/mesos/mesos-1.4.0/_build/src" --logbufsecs="0" --logging_level="INFO"
--max_completed_executors_per_framework="150" --oversubscribed_resources_interval="15secs"
--perf_duration="10secs" --perf_interval="1mins" --port="5051" --qos_correction_interval_min="0ns"
--quiet="false" --recover="reconnect" --recovery_timeout="15mins" --registration_backoff_factor="10ms"
--resources="cpus:2;gpus:0;mem:1024;disk:1024;ports:[31000-32000]" --revocable_cpu_low_priority="true"
--runtime_dir="/tmp/Endpoint_SlaveEndpointTest_NoAuthorizer_0_z80ShB" --sandbox_directory="/mnt/mesos/sandbox"
--strict="true" --switch_user="true" --systemd_enable_support="true" --systemd_runtime_directory="/run/systemd/system"
--version="false" --work_dir="/tmp/Endpoint_SlaveEndpointTest_NoAuthorizer_0_Jx0eKS"
I0816 04:15:54.288727  5276 credentials.hpp:86] Loading credential for authentication from
'/tmp/Endpoint_SlaveEndpointTest_NoAuthorizer_0_z80ShB/credential'
I0816 04:15:54.289089  5276 slave.cpp:283] Agent using credential for: test-principal
I0816 04:15:54.289124  5276 credentials.hpp:37] Loading credentials for authentication from
'/tmp/Endpoint_SlaveEndpointTest_NoAuthorizer_0_z80ShB/http_credentials'
I0816 04:15:54.289602  5276 http.cpp:1026] Creating default 'basic' HTTP authenticator for
realm 'mesos-agent-readonly'
I0816 04:15:54.289983  5276 http.cpp:1026] Creating default 'basic' HTTP authenticator for
realm 'mesos-agent-readwrite'
I0816 04:15:54.292315  5276 slave.cpp:565] Agent resources: [{"name":"cpus","scalar":{"value":2.0},"type":"SCALAR"},{"name":"mem","scalar":{"value":1024.0},"type":"SCALAR"},{"name":"disk","scalar":{"value":1024.0},"type":"SCALAR"},{"name":"ports","ranges":{"range":[{"begin":31000,"end":32000}]},"type":"RANGES"}]
I0816 04:15:54.292750  5276 slave.cpp:573] Agent attributes: [  ]
I0816 04:15:54.292773  5276 slave.cpp:582] Agent hostname: 7f6516f92249
I0816 04:15:54.293143  5275 status_update_manager.cpp:177] Pausing sending status updates
I0816 04:15:54.295486  5276 state.cpp:64] Recovering state from '/tmp/Endpoint_SlaveEndpointTest_NoAuthorizer_0_Jx0eKS/meta'
I0816 04:15:54.295886  5275 status_update_manager.cpp:203] Recovering status update manager
I0816 04:15:54.296161  5275 containerizer.cpp:609] Recovering containerizer
I0816 04:15:54.298442  5274 provisioner.cpp:416] Provisioner recovery complete
I0816 04:15:54.299173  5275 slave.cpp:6210] Finished recovery
I0816 04:15:54.299927  5275 slave.cpp:6392] Querying resource estimator for oversubscribable
resources
I0816 04:15:54.300384  5272 slave.cpp:6406] Received oversubscribable resources {} from the
resource estimator
I0816 04:15:54.304710  5273 process.cpp:3933] Handling HTTP event for process 'slave(803)'
with path: '/slave(803)/monitor/statistics'
I0816 04:15:54.306797  5274 http.cpp:1166] HTTP GET for /slave(803)/monitor/statistics from
172.17.0.2:36308
I0816 04:15:54.307128  5274 http.cpp:957] Authorizing principal 'test-principal' to GET the
'/monitor/statistics' endpoint
I0816 04:15:54.312497  5275 slave.cpp:843] Agent terminating
[       OK ] Endpoint/SlaveEndpointTest.NoAuthorizer/0 (49 ms)
[ RUN      ] Endpoint/SlaveEndpointTest.NoAuthorizer/1
I0816 04:15:54.330654  5252 containerizer.cpp:246] Using isolation: posix/cpu,posix/mem,filesystem/posix,network/cni,environment_secret
W0816 04:15:54.331419  5252 backend.cpp:76] Failed to create 'overlay' backend: OverlayBackend
requires root privileges
W0816 04:15:54.331614  5252 backend.cpp:76] Failed to create 'bind' backend: BindBackend requires
root privileges
I0816 04:15:54.331655  5252 provisioner.cpp:255] Using default backend 'copy'
I0816 04:15:54.334331  5252 cluster.cpp:448] Creating default 'local' authorizer
I0816 04:15:54.337383  5271 slave.cpp:250] Mesos agent started on (804)@172.17.0.2:40823
I0816 04:15:54.337425  5271 slave.cpp:251] Flags at startup: --acls="" --appc_simple_discovery_uri_prefix="http://"
--appc_store_dir="/tmp/Endpoint_SlaveEndpointTest_NoAuthorizer_1_1uLQTt/store/appc" --authenticate_http_readonly="true"
--authenticate_http_readwrite="true" --authenticatee="crammd5" --authentication_backoff_factor="1secs"
--authorizer="local" --cgroups_cpu_enable_pids_and_tids_count="false" --cgroups_enable_cfs="false"
--cgroups_hierarchy="/sys/fs/cgroup" --cgroups_limit_swap="false" --cgroups_root="mesos" --container_disk_watch_interval="15secs"
--containerizers="mesos" --credential="/tmp/Endpoint_SlaveEndpointTest_NoAuthorizer_1_1uLQTt/credential"
--default_role="*" --disallow_sharing_agent_pid_namespace="false" --disk_watch_interval="1mins"
--docker="docker" --docker_kill_orphans="true" --docker_registry="https://registry-1.docker.io"
--docker_remove_delay="6hrs" --docker_socket="/var/run/docker.sock" --docker_stop_timeout="0ns"
--docker_store_dir="/tmp/Endpoint_SlaveEndpointTest_NoAuthorizer_1_1uLQTt/store/docker" --docker_volume_checkpoint_dir="/var/run/mesos/isolators/docker/volume"
--enforce_container_disk_quota="false" --executor_registration_timeout="1mins" --executor_reregistration_timeout="2secs"
--executor_shutdown_grace_period="5secs" --fetcher_cache_dir="/tmp/Endpoint_SlaveEndpointTest_NoAuthorizer_1_1uLQTt/fetch"
--fetcher_cache_size="2GB" --frameworks_home="" --gc_delay="1weeks" --gc_disk_headroom="0.1"
--hadoop_home="" --help="false" --hostname_lookup="true" --http_command_executor="false" --http_credentials="/tmp/Endpoint_SlaveEndpointTest_NoAuthorizer_1_1uLQTt/http_credentials"
--http_heartbeat_interval="30secs" --initialize_driver_logging="true" --isolation="posix/cpu,posix/mem"
--launcher="posix" --launcher_dir="/mesos/mesos-1.4.0/_build/src" --logbufsecs="0" --logging_level="INFO"
--max_completed_executors_per_framework="150" --oversubscribed_resources_interval="15secs"
--perf_duration="10secs" --perf_interval="1mins" --port="5051" --qos_correction_interval_min="0ns"
--quiet="false" --recover="reconnect" --recovery_timeout="15mins" --registration_backoff_factor="10ms"
--resources="cpus:2;gpus:0;mem:1024;disk:1024;ports:[31000-32000]" --revocable_cpu_low_priority="true"
--runtime_dir="/tmp/Endpoint_SlaveEndpointTest_NoAuthorizer_1_1uLQTt" --sandbox_directory="/mnt/mesos/sandbox"
--strict="true" --switch_user="true" --systemd_enable_support="true" --systemd_runtime_directory="/run/systemd/system"
--version="false" --work_dir="/tmp/Endpoint_SlaveEndpointTest_NoAuthorizer_1_XUKbeL"
I0816 04:15:54.338441  5271 credentials.hpp:86] Loading credential for authentication from
'/tmp/Endpoint_SlaveEndpointTest_NoAuthorizer_1_1uLQTt/credential'
I0816 04:15:54.338897  5271 slave.cpp:283] Agent using credential for: test-principal
I0816 04:15:54.338932  5271 credentials.hpp:37] Loading credentials for authentication from
'/tmp/Endpoint_SlaveEndpointTest_NoAuthorizer_1_1uLQTt/http_credentials'
I0816 04:15:54.339422  5271 http.cpp:1026] Creating default 'basic' HTTP authenticator for
realm 'mesos-agent-readonly'
I0816 04:15:54.339938  5271 http.cpp:1026] Creating default 'basic' HTTP authenticator for
realm 'mesos-agent-readwrite'
I0816 04:15:54.342489  5271 slave.cpp:565] Agent resources: [{"name":"cpus","scalar":{"value":2.0},"type":"SCALAR"},{"name":"mem","scalar":{"value":1024.0},"type":"SCALAR"},{"name":"disk","scalar":{"value":1024.0},"type":"SCALAR"},{"name":"ports","ranges":{"range":[{"begin":31000,"end":32000}]},"type":"RANGES"}]
I0816 04:15:54.342958  5271 slave.cpp:573] Agent attributes: [  ]
I0816 04:15:54.342978  5271 slave.cpp:582] Agent hostname: 7f6516f92249
I0816 04:15:54.343333  5272 status_update_manager.cpp:177] Pausing sending status updates
I0816 04:15:54.346087  5275 state.cpp:64] Recovering state from '/tmp/Endpoint_SlaveEndpointTest_NoAuthorizer_1_XUKbeL/meta'
I0816 04:15:54.346534  5274 status_update_manager.cpp:203] Recovering status update manager
I0816 04:15:54.347174  5273 containerizer.cpp:609] Recovering containerizer
I0816 04:15:54.349750  5275 provisioner.cpp:416] Provisioner recovery complete
I0816 04:15:54.350543  5273 slave.cpp:6210] Finished recovery
I0816 04:15:54.351434  5273 slave.cpp:6392] Querying resource estimator for oversubscribable
resources
I0816 04:15:54.352250  5272 slave.cpp:6406] Received oversubscribable resources {} from the
resource estimator
I0816 04:15:54.356441  5273 process.cpp:3933] Handling HTTP event for process 'slave(804)'
with path: '/slave(804)/monitor/statistics.json'
I0816 04:15:54.358808  5274 http.cpp:1166] HTTP GET for /slave(804)/monitor/statistics.json
from 172.17.0.2:36310
I0816 04:15:54.358932  5274 http.cpp:957] Authorizing principal 'test-principal' to GET the
'/monitor/statistics.json' endpoint
I0816 04:15:54.364148  5278 slave.cpp:843] Agent terminating
[       OK ] Endpoint/SlaveEndpointTest.NoAuthorizer/1 (50 ms)
[ RUN      ] Endpoint/SlaveEndpointTest.NoAuthorizer/2
I0816 04:15:54.382192  5252 containerizer.cpp:246] Using isolation: posix/cpu,posix/mem,filesystem/posix,network/cni,environment_secret
W0816 04:15:54.382964  5252 backend.cpp:76] Failed to create 'overlay' backend: OverlayBackend
requires root privileges
W0816 04:15:54.383157  5252 backend.cpp:76] Failed to create 'bind' backend: BindBackend requires
root privileges
I0816 04:15:54.383198  5252 provisioner.cpp:255] Using default backend 'copy'
I0816 04:15:54.385900  5252 cluster.cpp:448] Creating default 'local' authorizer
I0816 04:15:54.388917  5278 slave.cpp:250] Mesos agent started on (805)@172.17.0.2:40823
I0816 04:15:54.388958  5278 slave.cpp:251] Flags at startup: --acls="" --appc_simple_discovery_uri_prefix="http://"
--appc_store_dir="/tmp/Endpoint_SlaveEndpointTest_NoAuthorizer_2_H8E52m/store/appc" --authenticate_http_readonly="true"
--authenticate_http_readwrite="true" --authenticatee="crammd5" --authentication_backoff_factor="1secs"
--authorizer="local" --cgroups_cpu_enable_pids_and_tids_count="false" --cgroups_enable_cfs="false"
--cgroups_hierarchy="/sys/fs/cgroup" --cgroups_limit_swap="false" --cgroups_root="mesos" --container_disk_watch_interval="15secs"
--containerizers="mesos" --credential="/tmp/Endpoint_SlaveEndpointTest_NoAuthorizer_2_H8E52m/credential"
--default_role="*" --disallow_sharing_agent_pid_namespace="false" --disk_watch_interval="1mins"
--docker="docker" --docker_kill_orphans="true" --docker_registry="https://registry-1.docker.io"
--docker_remove_delay="6hrs" --docker_socket="/var/run/docker.sock" --docker_stop_timeout="0ns"
--docker_store_dir="/tmp/Endpoint_SlaveEndpointTest_NoAuthorizer_2_H8E52m/store/docker" --docker_volume_checkpoint_dir="/var/run/mesos/isolators/docker/volume"
--enforce_container_disk_quota="false" --executor_registration_timeout="1mins" --executor_reregistration_timeout="2secs"
--executor_shutdown_grace_period="5secs" --fetcher_cache_dir="/tmp/Endpoint_SlaveEndpointTest_NoAuthorizer_2_H8E52m/fetch"
--fetcher_cache_size="2GB" --frameworks_home="" --gc_delay="1weeks" --gc_disk_headroom="0.1"
--hadoop_home="" --help="false" --hostname_lookup="true" --http_command_executor="false" --http_credentials="/tmp/Endpoint_SlaveEndpointTest_NoAuthorizer_2_H8E52m/http_credentials"
--http_heartbeat_interval="30secs" --initialize_driver_logging="true" --isolation="posix/cpu,posix/mem"
--launcher="posix" --launcher_dir="/mesos/mesos-1.4.0/_build/src" --logbufsecs="0" --logging_level="INFO"
--max_completed_executors_per_framework="150" --oversubscribed_resources_interval="15secs"
--perf_duration="10secs" --perf_interval="1mins" --port="5051" --qos_correction_interval_min="0ns"
--quiet="false" --recover="reconnect" --recovery_timeout="15mins" --registration_backoff_factor="10ms"
--resources="cpus:2;gpus:0;mem:1024;disk:1024;ports:[31000-32000]" --revocable_cpu_low_priority="true"
--runtime_dir="/tmp/Endpoint_SlaveEndpointTest_NoAuthorizer_2_H8E52m" --sandbox_directory="/mnt/mesos/sandbox"
--strict="true" --switch_user="true" --systemd_enable_support="true" --systemd_runtime_directory="/run/systemd/system"
--version="false" --work_dir="/tmp/Endpoint_SlaveEndpointTest_NoAuthorizer_2_1uq7eE"
I0816 04:15:54.389700  5278 credentials.hpp:86] Loading credential for authentication from
'/tmp/Endpoint_SlaveEndpointTest_NoAuthorizer_2_H8E52m/credential'
I0816 04:15:54.389962  5278 slave.cpp:283] Agent using credential for: test-principal
I0816 04:15:54.389989  5278 credentials.hpp:37] Loading credentials for authentication from
'/tmp/Endpoint_SlaveEndpointTest_NoAuthorizer_2_H8E52m/http_credentials'
I0816 04:15:54.390365  5278 http.cpp:1026] Creating default 'basic' HTTP authenticator for
realm 'mesos-agent-readonly'
I0816 04:15:54.390628  5278 http.cpp:1026] Creating default 'basic' HTTP authenticator for
realm 'mesos-agent-readwrite'
I0816 04:15:54.392802  5278 slave.cpp:565] Agent resources: [{"name":"cpus","scalar":{"value":2.0},"type":"SCALAR"},{"name":"mem","scalar":{"value":1024.0},"type":"SCALAR"},{"name":"disk","scalar":{"value":1024.0},"type":"SCALAR"},{"name":"ports","ranges":{"range":[{"begin":31000,"end":32000}]},"type":"RANGES"}]
I0816 04:15:54.393234  5278 slave.cpp:573] Agent attributes: [  ]
I0816 04:15:54.393256  5278 slave.cpp:582] Agent hostname: 7f6516f92249
I0816 04:15:54.393579  5275 status_update_manager.cpp:177] Pausing sending status updates
I0816 04:15:54.395607  5271 state.cpp:64] Recovering state from '/tmp/Endpoint_SlaveEndpointTest_NoAuthorizer_2_1uq7eE/meta'
I0816 04:15:54.396147  5274 status_update_manager.cpp:203] Recovering status update manager
I0816 04:15:54.396409  5277 containerizer.cpp:609] Recovering containerizer
I0816 04:15:54.398713  5275 provisioner.cpp:416] Provisioner recovery complete
I0816 04:15:54.399250  5278 slave.cpp:6210] Finished recovery
I0816 04:15:54.399847  5278 slave.cpp:6392] Querying resource estimator for oversubscribable
resources
I0816 04:15:54.400317  5275 slave.cpp:6406] Received oversubscribable resources {} from the
resource estimator
I0816 04:15:54.404371  5278 process.cpp:3933] Handling HTTP event for process 'slave(805)'
with path: '/slave(805)/containers'
I0816 04:15:54.406515  5273 http.cpp:1166] HTTP GET for /slave(805)/containers from 172.17.0.2:36312
I0816 04:15:54.406944  5273 http.cpp:957] Authorizing principal 'test-principal' to GET the
'/containers' endpoint
I0816 04:15:54.413307  5273 slave.cpp:843] Agent terminating
[       OK ] Endpoint/SlaveEndpointTest.NoAuthorizer/2 (49 ms)
[----------] 9 tests from Endpoint/SlaveEndpointTest (465 ms total)

[----------] 2 tests from ContainerizerType/DefaultContainerDNSFlagTest
[ RUN      ] ContainerizerType/DefaultContainerDNSFlagTest.ValidateFlag/0
[       OK ] ContainerizerType/DefaultContainerDNSFlagTest.ValidateFlag/0 (19 ms)
[ RUN      ] ContainerizerType/DefaultContainerDNSFlagTest.ValidateFlag/1
[       OK ] ContainerizerType/DefaultContainerDNSFlagTest.ValidateFlag/1 (19 ms)
[----------] 2 tests from ContainerizerType/DefaultContainerDNSFlagTest (38 ms total)

[----------] Global test environment tear-down
[==========] 1655 tests from 182 test cases ran. (784827 ms total)
[  PASSED  ] 1651 tests.
[  FAILED  ] 4 tests, listed below:
[  FAILED  ] DefaultExecutorCheckTest.CommandCheckDeliveredAndReconciled
[  FAILED  ] DefaultExecutorCheckTest.CommandCheckStatusChange
[  FAILED  ] DefaultExecutorCheckTest.CommandCheckSeesParentsEnv
[  FAILED  ] DefaultExecutorCheckTest.CommandCheckSharesWorkDirWithTask

 4 FAILED TESTS
  YOU HAVE 20 DISABLED TESTS

I0816 04:15:54.598412  5279 process.cpp:1072] Failed to accept socket: future discarded
make[4]: *** [check-local] Error 1
make[4]: Leaving directory `/mesos/mesos-1.4.0/_build/src'
make[3]: *** [check-am] Error 2
make[3]: Leaving directory `/mesos/mesos-1.4.0/_build/src'
make[2]: *** [check] Error 2
make[2]: Leaving directory `/mesos/mesos-1.4.0/_build/src'
make[1]: *** [check-recursive] Error 1
make[1]: Leaving directory `/mesos/mesos-1.4.0/_build'
make: *** [distcheck] Error 1
+ docker rmi mesos-1502850440-536
Untagged: mesos-1502850440-536:latest
Deleted: sha256:ea62253b259d7f96a90f823f55b6babf2810eda7cb354d8922f6d4140025f8b7
Deleted: sha256:016062ecf3c6e83ce2c0a3369d6c0b6878ae68da9a75b693e6f42466a671451e
Deleted: sha256:46a5ae23fa40b477c599f9380d5ccbe8dfd601de9d9b7a8c1b33660c9c2989eb
Deleted: sha256:36ffcb947fd31da3500e236c687c856035fe280afb39834741347847914862a6
Deleted: sha256:4274c50d6fc46c0838e1c1c5919a261796e16ce6c1449e7a347b3d7ecb40b52c
Deleted: sha256:0bacada46b0024c583635110962390278ff1ab6992cb119a87b3e71ef512a3c2
Deleted: sha256:c16d459f902885e41bd22eaa6fb7e6c6b7de29ff5b21912711cc705bdbb257b3
Deleted: sha256:e77aa555402fcb5c574b7e5a71f68a10d84b75c23743040bba96efef88742f6c
Deleted: sha256:5e2222ecc4cb55e75373f4f9bd079e3367ad150c8e95d07c8e8d271b9298c043
Deleted: sha256:d38ed6d9ef4bca4b7332ee1b769be88368359187c4f44077f70bb586cd4850b4
Deleted: sha256:6baf25e65a2b1fe6d622a658da8f05b60b87a5831fb783ed16fe44fc7b921470
Deleted: sha256:2fcb5dd9a76699423f055e70d50d73746de3eee502a4f66e817fcb8a8f395bfb
Deleted: sha256:235eb984080459e0de9c9a1fe16141427d6c14331c2e6fb5f10d044a679f90f0
Deleted: sha256:e861ca0ecb51997e0bf363c636ce795588b9010574c69ffe1af45d3a55509a33
Deleted: sha256:1b43c10a08a4e1174d38f6d4388016494b248eed81b9681316973213b25bef28
Deleted: sha256:3a615339b0c6b7b94a68d31091008ba3766bac0b984dee81223286c335439dc9
Deleted: sha256:05949493db883eb9a8fd3c0da354cd6bdf1d8fc59caa4f999ed0982cd397f448
Deleted: sha256:a32bb49b937fbb253eee54dcabee203ad27413edd2e0459ff7e6f955fb03425b
Deleted: sha256:dcea08f9975ba265a2cdd2fd1e429b78043e4bedf7ff1758c047e0c7179ebc2b
Deleted: sha256:9cb048fb498b19925421af0a5d690b62eb235bf14ae72561daf050dc0814f2a4
Deleted: sha256:579fe9fe29c87ebf3e20594aa503120f48d1059e2fef90ffa12a758c23246aff
Deleted: sha256:9406ae1454f65bbf3b0c58956d1b3f43f2e5ff63009595c24ce20ac2804543cd
Deleted: sha256:155c917194116bd51aaa96424cfa53c2a0b8c8289bc8004ccebbcf50ab2ab299
Deleted: sha256:ca2be25280674d56112c78817b3b2675303137fb9e7b6a62410c4b2f86c8e3d4
Build step 'Execute shell' marked build as failure

Mime
View raw message