mesos-builds mailing list archives

Site index · List index
Message view « Date » · « Thread »
Top « Date » · « Thread »
From Apache Jenkins Server <jenk...@builds.apache.org>
Subject Build failed in Jenkins: Mesos-Buildbot » cmake,gcc,--verbose,GLOG_v=1 MESOS_VERBOSE=1,centos:7,(ubuntu)&&(!ubuntu-us1)&&(!ubuntu-eu2) #4066
Date Fri, 04 Aug 2017 12:12:43 GMT
See <https://builds.apache.org/job/Mesos-Buildbot/BUILDTOOL=cmake,COMPILER=gcc,CONFIGURATION=--verbose,ENVIRONMENT=GLOG_v=1%20MESOS_VERBOSE=1,OS=centos%3A7,label_exp=(ubuntu)&&(!ubuntu-us1)&&(!ubuntu-eu2)/4066/display/redirect?page=changes>

Changes:

[alexr] Logged when an offer is removed.

[alexr] Fixed slaves_unreachable metric.

[alexr] Added missing metrics to tests.

[alexr] Adjusted the style in metrics tests for consistency.

------------------------------------------
[...truncated 28.51 MB...]
I0804 12:12:22.625279 31562 http.cpp:957] Authorizing principal 'test-principal' to GET the
'/monitor/statistics.json' endpoint
I0804 12:12:22.628841 31554 slave.cpp:843] Agent terminating
[       OK ] Endpoint/SlaveEndpointTest.AuthorizedRequest/1 (32 ms)
[ RUN      ] Endpoint/SlaveEndpointTest.AuthorizedRequest/2
I0804 12:12:22.641644 31554 containerizer.cpp:246] Using isolation: posix/cpu,posix/mem,filesystem/posix,network/cni,environment_secret
W0804 12:12:22.642227 31554 backend.cpp:76] Failed to create 'aufs' backend: AufsBackend requires
root privileges
W0804 12:12:22.642343 31554 backend.cpp:76] Failed to create 'bind' backend: BindBackend requires
root privileges
I0804 12:12:22.642375 31554 provisioner.cpp:255] Using default backend 'copy'
I0804 12:12:22.646297 31565 slave.cpp:250] Mesos agent started on (791)@172.17.0.2:46624
I0804 12:12:22.646317 31565 slave.cpp:251] Flags at startup: --acls="" --appc_simple_discovery_uri_prefix="http://"
--appc_store_dir="/tmp/Endpoint_SlaveEndpointTest_AuthorizedRequest_2_rpBGCc/store/appc" --authenticate_http_readonly="true"
--authenticate_http_readwrite="true" --authenticatee="crammd5" --authentication_backoff_factor="1secs"
--authorizer="local" --cgroups_cpu_enable_pids_and_tids_count="false" --cgroups_enable_cfs="false"
--cgroups_hierarchy="/sys/fs/cgroup" --cgroups_limit_swap="false" --cgroups_root="mesos" --container_disk_watch_interval="15secs"
--containerizers="mesos" --credential="/tmp/Endpoint_SlaveEndpointTest_AuthorizedRequest_2_rpBGCc/credential"
--default_role="*" --disk_watch_interval="1mins" --docker="docker" --docker_kill_orphans="true"
--docker_registry="https://registry-1.docker.io" --docker_remove_delay="6hrs" --docker_socket="/var/run/docker.sock"
--docker_stop_timeout="0ns" --docker_store_dir="/tmp/Endpoint_SlaveEndpointTest_AuthorizedRequest_2_rpBGCc/store/docker"
--docker_volume_checkpoint_dir="/var/run/mesos/isolators/docker/volume" --enforce_container_disk_quota="false"
--executor_registration_timeout="1mins" --executor_reregistration_timeout="2secs" --executor_shutdown_grace_period="5secs"
--fetcher_cache_dir="/tmp/Endpoint_SlaveEndpointTest_AuthorizedRequest_2_rpBGCc/fetch" --fetcher_cache_size="2GB"
--frameworks_home="" --gc_delay="1weeks" --gc_disk_headroom="0.1" --hadoop_home="" --help="false"
--hostname_lookup="true" --http_command_executor="false" --http_credentials="/tmp/Endpoint_SlaveEndpointTest_AuthorizedRequest_2_rpBGCc/http_credentials"
--http_heartbeat_interval="30secs" --initialize_driver_logging="true" --isolation="posix/cpu,posix/mem"
--launcher="posix" --launcher_dir="/mesos/build/src" --logbufsecs="0" --logging_level="INFO"
--max_completed_executors_per_framework="150" --oversubscribed_resources_interval="15secs"
--perf_duration="10secs" --perf_interval="1mins" --port="5051" --qos_correction_interval_min="0ns"
--quiet="false" --recover="reconnect" --recovery_timeout="15mins" --registration_backoff_factor="10ms"
--resources="cpus:2;gpus:0;mem:1024;disk:1024;ports:[31000-32000]" --revocable_cpu_low_priority="true"
--runtime_dir="/tmp/Endpoint_SlaveEndpointTest_AuthorizedRequest_2_rpBGCc" --sandbox_directory="/mnt/mesos/sandbox"
--strict="true" --switch_user="true" --systemd_enable_support="true" --systemd_runtime_directory="/run/systemd/system"
--version="false" --work_dir="/tmp/Endpoint_SlaveEndpointTest_AuthorizedRequest_2_d7xkJw"
I0804 12:12:22.646720 31565 credentials.hpp:86] Loading credential for authentication from
'/tmp/Endpoint_SlaveEndpointTest_AuthorizedRequest_2_rpBGCc/credential'
I0804 12:12:22.646870 31565 slave.cpp:283] Agent using credential for: test-principal
I0804 12:12:22.646891 31565 credentials.hpp:37] Loading credentials for authentication from
'/tmp/Endpoint_SlaveEndpointTest_AuthorizedRequest_2_rpBGCc/http_credentials'
I0804 12:12:22.647131 31565 http.cpp:1026] Creating default 'basic' HTTP authenticator for
realm 'mesos-agent-readonly'
I0804 12:12:22.647289 31565 http.cpp:1026] Creating default 'basic' HTTP authenticator for
realm 'mesos-agent-readwrite'
I0804 12:12:22.648851 31565 slave.cpp:565] Agent resources: [{"name":"cpus","scalar":{"value":2.0},"type":"SCALAR"},{"name":"mem","scalar":{"value":1024.0},"type":"SCALAR"},{"name":"disk","scalar":{"value":1024.0},"type":"SCALAR"},{"name":"ports","ranges":{"range":[{"begin":31000,"end":32000}]},"type":"RANGES"}]
I0804 12:12:22.649088 31565 slave.cpp:573] Agent attributes: [  ]
I0804 12:12:22.649101 31565 slave.cpp:582] Agent hostname: 5118842e43f1
I0804 12:12:22.649272 31561 status_update_manager.cpp:177] Pausing sending status updates
I0804 12:12:22.650657 31557 state.cpp:64] Recovering state from '/tmp/Endpoint_SlaveEndpointTest_AuthorizedRequest_2_d7xkJw/meta'
I0804 12:12:22.651072 31564 status_update_manager.cpp:203] Recovering status update manager
I0804 12:12:22.651278 31560 containerizer.cpp:598] Recovering containerizer
I0804 12:12:22.652957 31562 provisioner.cpp:416] Provisioner recovery complete
I0804 12:12:22.653367 31570 slave.cpp:6207] Finished recovery
I0804 12:12:22.653846 31570 slave.cpp:6389] Querying resource estimator for oversubscribable
resources
I0804 12:12:22.654093 31557 slave.cpp:6403] Received oversubscribable resources {} from the
resource estimator
I0804 12:12:22.656889 31561 process.cpp:3933] Handling HTTP event for process 'slave(791)'
with path: '/slave(791)/containers'
I0804 12:12:22.658198 31556 http.cpp:1166] HTTP GET for /slave(791)/containers from 172.17.0.2:56228
I0804 12:12:22.658294 31556 http.cpp:957] Authorizing principal 'test-principal' to GET the
'/containers' endpoint
I0804 12:12:22.662294 31554 slave.cpp:843] Agent terminating
[       OK ] Endpoint/SlaveEndpointTest.AuthorizedRequest/2 (33 ms)
[ RUN      ] Endpoint/SlaveEndpointTest.UnauthorizedRequest/0
I0804 12:12:22.679142 31554 containerizer.cpp:246] Using isolation: posix/cpu,posix/mem,filesystem/posix,network/cni,environment_secret
W0804 12:12:22.679736 31554 backend.cpp:76] Failed to create 'aufs' backend: AufsBackend requires
root privileges
W0804 12:12:22.679855 31554 backend.cpp:76] Failed to create 'bind' backend: BindBackend requires
root privileges
I0804 12:12:22.679888 31554 provisioner.cpp:255] Using default backend 'copy'
I0804 12:12:22.683393 31563 slave.cpp:250] Mesos agent started on (792)@172.17.0.2:46624
I0804 12:12:22.683409 31563 slave.cpp:251] Flags at startup: --acls="" --appc_simple_discovery_uri_prefix="http://"
--appc_store_dir="/tmp/Endpoint_SlaveEndpointTest_UnauthorizedRequest_0_PN2swU/store/appc"
--authenticate_http_readonly="true" --authenticate_http_readwrite="true" --authenticatee="crammd5"
--authentication_backoff_factor="1secs" --authorizer="local" --cgroups_cpu_enable_pids_and_tids_count="false"
--cgroups_enable_cfs="false" --cgroups_hierarchy="/sys/fs/cgroup" --cgroups_limit_swap="false"
--cgroups_root="mesos" --container_disk_watch_interval="15secs" --containerizers="mesos" --credential="/tmp/Endpoint_SlaveEndpointTest_UnauthorizedRequest_0_PN2swU/credential"
--default_role="*" --disk_watch_interval="1mins" --docker="docker" --docker_kill_orphans="true"
--docker_registry="https://registry-1.docker.io" --docker_remove_delay="6hrs" --docker_socket="/var/run/docker.sock"
--docker_stop_timeout="0ns" --docker_store_dir="/tmp/Endpoint_SlaveEndpointTest_UnauthorizedRequest_0_PN2swU/store/docker"
--docker_volume_checkpoint_dir="/var/run/mesos/isolators/docker/volume" --enforce_container_disk_quota="false"
--executor_registration_timeout="1mins" --executor_reregistration_timeout="2secs" --executor_shutdown_grace_period="5secs"
--fetcher_cache_dir="/tmp/Endpoint_SlaveEndpointTest_UnauthorizedRequest_0_PN2swU/fetch" --fetcher_cache_size="2GB"
--frameworks_home="" --gc_delay="1weeks" --gc_disk_headroom="0.1" --hadoop_home="" --help="false"
--hostname_lookup="true" --http_command_executor="false" --http_credentials="/tmp/Endpoint_SlaveEndpointTest_UnauthorizedRequest_0_PN2swU/http_credentials"
--http_heartbeat_interval="30secs" --initialize_driver_logging="true" --isolation="posix/cpu,posix/mem"
--launcher="posix" --launcher_dir="/mesos/build/src" --logbufsecs="0" --logging_level="INFO"
--max_completed_executors_per_framework="150" --oversubscribed_resources_interval="15secs"
--perf_duration="10secs" --perf_interval="1mins" --port="5051" --qos_correction_interval_min="0ns"
--quiet="false" --recover="reconnect" --recovery_timeout="15mins" --registration_backoff_factor="10ms"
--resources="cpus:2;gpus:0;mem:1024;disk:1024;ports:[31000-32000]" --revocable_cpu_low_priority="true"
--runtime_dir="/tmp/Endpoint_SlaveEndpointTest_UnauthorizedRequest_0_PN2swU" --sandbox_directory="/mnt/mesos/sandbox"
--strict="true" --switch_user="true" --systemd_enable_support="true" --systemd_runtime_directory="/run/systemd/system"
--version="false" --work_dir="/tmp/Endpoint_SlaveEndpointTest_UnauthorizedRequest_0_PhR1we"
I0804 12:12:22.683784 31563 credentials.hpp:86] Loading credential for authentication from
'/tmp/Endpoint_SlaveEndpointTest_UnauthorizedRequest_0_PN2swU/credential'
I0804 12:12:22.683944 31563 slave.cpp:283] Agent using credential for: test-principal
I0804 12:12:22.683966 31563 credentials.hpp:37] Loading credentials for authentication from
'/tmp/Endpoint_SlaveEndpointTest_UnauthorizedRequest_0_PN2swU/http_credentials'
I0804 12:12:22.684227 31563 http.cpp:1026] Creating default 'basic' HTTP authenticator for
realm 'mesos-agent-readonly'
I0804 12:12:22.684397 31563 http.cpp:1026] Creating default 'basic' HTTP authenticator for
realm 'mesos-agent-readwrite'
I0804 12:12:22.686017 31563 slave.cpp:565] Agent resources: [{"name":"cpus","scalar":{"value":2.0},"type":"SCALAR"},{"name":"mem","scalar":{"value":1024.0},"type":"SCALAR"},{"name":"disk","scalar":{"value":1024.0},"type":"SCALAR"},{"name":"ports","ranges":{"range":[{"begin":31000,"end":32000}]},"type":"RANGES"}]
I0804 12:12:22.686252 31563 slave.cpp:573] Agent attributes: [  ]
I0804 12:12:22.686264 31563 slave.cpp:582] Agent hostname: 5118842e43f1
I0804 12:12:22.686401 31560 status_update_manager.cpp:177] Pausing sending status updates
I0804 12:12:22.687521 31570 state.cpp:64] Recovering state from '/tmp/Endpoint_SlaveEndpointTest_UnauthorizedRequest_0_PhR1we/meta'
I0804 12:12:22.687829 31555 status_update_manager.cpp:203] Recovering status update manager
I0804 12:12:22.688002 31569 containerizer.cpp:598] Recovering containerizer
I0804 12:12:22.689218 31557 provisioner.cpp:416] Provisioner recovery complete
I0804 12:12:22.689661 31568 slave.cpp:6207] Finished recovery
I0804 12:12:22.690052 31568 slave.cpp:6389] Querying resource estimator for oversubscribable
resources
I0804 12:12:22.690265 31565 slave.cpp:6403] Received oversubscribable resources {} from the
resource estimator
I0804 12:12:22.692631 31566 process.cpp:3933] Handling HTTP event for process 'slave(792)'
with path: '/slave(792)/monitor/statistics'
I0804 12:12:22.693795 31568 http.cpp:1166] HTTP GET for /slave(792)/monitor/statistics from
172.17.0.2:56229
I0804 12:12:22.693879 31568 http.cpp:957] Authorizing principal 'test-principal' to GET the
'/monitor/statistics' endpoint
I0804 12:12:22.696377 31554 slave.cpp:843] Agent terminating
[       OK ] Endpoint/SlaveEndpointTest.UnauthorizedRequest/0 (29 ms)
[ RUN      ] Endpoint/SlaveEndpointTest.UnauthorizedRequest/1
I0804 12:12:22.708382 31554 containerizer.cpp:246] Using isolation: posix/cpu,posix/mem,filesystem/posix,network/cni,environment_secret
W0804 12:12:22.708973 31554 backend.cpp:76] Failed to create 'aufs' backend: AufsBackend requires
root privileges
W0804 12:12:22.709089 31554 backend.cpp:76] Failed to create 'bind' backend: BindBackend requires
root privileges
I0804 12:12:22.709122 31554 provisioner.cpp:255] Using default backend 'copy'
I0804 12:12:22.712296 31566 slave.cpp:250] Mesos agent started on (793)@172.17.0.2:46624
I0804 12:12:22.712314 31566 slave.cpp:251] Flags at startup: --acls="" --appc_simple_discovery_uri_prefix="http://"
--appc_store_dir="/tmp/Endpoint_SlaveEndpointTest_UnauthorizedRequest_1_rhFqKC/store/appc"
--authenticate_http_readonly="true" --authenticate_http_readwrite="true" --authenticatee="crammd5"
--authentication_backoff_factor="1secs" --authorizer="local" --cgroups_cpu_enable_pids_and_tids_count="false"
--cgroups_enable_cfs="false" --cgroups_hierarchy="/sys/fs/cgroup" --cgroups_limit_swap="false"
--cgroups_root="mesos" --container_disk_watch_interval="15secs" --containerizers="mesos" --credential="/tmp/Endpoint_SlaveEndpointTest_UnauthorizedRequest_1_rhFqKC/credential"
--default_role="*" --disk_watch_interval="1mins" --docker="docker" --docker_kill_orphans="true"
--docker_registry="https://registry-1.docker.io" --docker_remove_delay="6hrs" --docker_socket="/var/run/docker.sock"
--docker_stop_timeout="0ns" --docker_store_dir="/tmp/Endpoint_SlaveEndpointTest_UnauthorizedRequest_1_rhFqKC/store/docker"
--docker_volume_checkpoint_dir="/var/run/mesos/isolators/docker/volume" --enforce_container_disk_quota="false"
--executor_registration_timeout="1mins" --executor_reregistration_timeout="2secs" --executor_shutdown_grace_period="5secs"
--fetcher_cache_dir="/tmp/Endpoint_SlaveEndpointTest_UnauthorizedRequest_1_rhFqKC/fetch" --fetcher_cache_size="2GB"
--frameworks_home="" --gc_delay="1weeks" --gc_disk_headroom="0.1" --hadoop_home="" --help="false"
--hostname_lookup="true" --http_command_executor="false" --http_credentials="/tmp/Endpoint_SlaveEndpointTest_UnauthorizedRequest_1_rhFqKC/http_credentials"
--http_heartbeat_interval="30secs" --initialize_driver_logging="true" --isolation="posix/cpu,posix/mem"
--launcher="posix" --launcher_dir="/mesos/build/src" --logbufsecs="0" --logging_level="INFO"
--max_completed_executors_per_framework="150" --oversubscribed_resources_interval="15secs"
--perf_duration="10secs" --perf_interval="1mins" --port="5051" --qos_correction_interval_min="0ns"
--quiet="false" --recover="reconnect" --recovery_timeout="15mins" --registration_backoff_factor="10ms"
--resources="cpus:2;gpus:0;mem:1024;disk:1024;ports:[31000-32000]" --revocable_cpu_low_priority="true"
--runtime_dir="/tmp/Endpoint_SlaveEndpointTest_UnauthorizedRequest_1_rhFqKC" --sandbox_directory="/mnt/mesos/sandbox"
--strict="true" --switch_user="true" --systemd_enable_support="true" --systemd_runtime_directory="/run/systemd/system"
--version="false" --work_dir="/tmp/Endpoint_SlaveEndpointTest_UnauthorizedRequest_1_XwdeGW"
I0804 12:12:22.712791 31566 credentials.hpp:86] Loading credential for authentication from
'/tmp/Endpoint_SlaveEndpointTest_UnauthorizedRequest_1_rhFqKC/credential'
I0804 12:12:22.712960 31566 slave.cpp:283] Agent using credential for: test-principal
I0804 12:12:22.712980 31566 credentials.hpp:37] Loading credentials for authentication from
'/tmp/Endpoint_SlaveEndpointTest_UnauthorizedRequest_1_rhFqKC/http_credentials'
I0804 12:12:22.713240 31566 http.cpp:1026] Creating default 'basic' HTTP authenticator for
realm 'mesos-agent-readonly'
I0804 12:12:22.713418 31566 http.cpp:1026] Creating default 'basic' HTTP authenticator for
realm 'mesos-agent-readwrite'
I0804 12:12:22.715046 31566 slave.cpp:565] Agent resources: [{"name":"cpus","scalar":{"value":2.0},"type":"SCALAR"},{"name":"mem","scalar":{"value":1024.0},"type":"SCALAR"},{"name":"disk","scalar":{"value":1024.0},"type":"SCALAR"},{"name":"ports","ranges":{"range":[{"begin":31000,"end":32000}]},"type":"RANGES"}]
I0804 12:12:22.715283 31566 slave.cpp:573] Agent attributes: [  ]
I0804 12:12:22.715294 31566 slave.cpp:582] Agent hostname: 5118842e43f1
I0804 12:12:22.715453 31560 status_update_manager.cpp:177] Pausing sending status updates
I0804 12:12:22.716918 31570 state.cpp:64] Recovering state from '/tmp/Endpoint_SlaveEndpointTest_UnauthorizedRequest_1_XwdeGW/meta'
I0804 12:12:22.717203 31564 status_update_manager.cpp:203] Recovering status update manager
I0804 12:12:22.717427 31558 containerizer.cpp:598] Recovering containerizer
I0804 12:12:22.719188 31564 provisioner.cpp:416] Provisioner recovery complete
I0804 12:12:22.719631 31557 slave.cpp:6207] Finished recovery
I0804 12:12:22.719959 31557 slave.cpp:6389] Querying resource estimator for oversubscribable
resources
I0804 12:12:22.720243 31559 slave.cpp:6403] Received oversubscribable resources {} from the
resource estimator
I0804 12:12:22.722728 31563 process.cpp:3933] Handling HTTP event for process 'slave(793)'
with path: '/slave(793)/monitor/statistics.json'
I0804 12:12:22.724004 31556 http.cpp:1166] HTTP GET for /slave(793)/monitor/statistics.json
from 172.17.0.2:56230
I0804 12:12:22.724093 31556 http.cpp:957] Authorizing principal 'test-principal' to GET the
'/monitor/statistics.json' endpoint
I0804 12:12:22.726367 31554 slave.cpp:843] Agent terminating
[       OK ] Endpoint/SlaveEndpointTest.UnauthorizedRequest/1 (29 ms)
[ RUN      ] Endpoint/SlaveEndpointTest.UnauthorizedRequest/2
I0804 12:12:22.738107 31554 containerizer.cpp:246] Using isolation: posix/cpu,posix/mem,filesystem/posix,network/cni,environment_secret
W0804 12:12:22.738695 31554 backend.cpp:76] Failed to create 'aufs' backend: AufsBackend requires
root privileges
W0804 12:12:22.738811 31554 backend.cpp:76] Failed to create 'bind' backend: BindBackend requires
root privileges
I0804 12:12:22.738843 31554 provisioner.cpp:255] Using default backend 'copy'
I0804 12:12:22.742934 31560 slave.cpp:250] Mesos agent started on (794)@172.17.0.2:46624
I0804 12:12:22.742962 31560 slave.cpp:251] Flags at startup: --acls="" --appc_simple_discovery_uri_prefix="http://"
--appc_store_dir="/tmp/Endpoint_SlaveEndpointTest_UnauthorizedRequest_2_9O7Jhl/store/appc"
--authenticate_http_readonly="true" --authenticate_http_readwrite="true" --authenticatee="crammd5"
--authentication_backoff_factor="1secs" --authorizer="local" --cgroups_cpu_enable_pids_and_tids_count="false"
--cgroups_enable_cfs="false" --cgroups_hierarchy="/sys/fs/cgroup" --cgroups_limit_swap="false"
--cgroups_root="mesos" --container_disk_watch_interval="15secs" --containerizers="mesos" --credential="/tmp/Endpoint_SlaveEndpointTest_UnauthorizedRequest_2_9O7Jhl/credential"
--default_role="*" --disk_watch_interval="1mins" --docker="docker" --docker_kill_orphans="true"
--docker_registry="https://registry-1.docker.io" --docker_remove_delay="6hrs" --docker_socket="/var/run/docker.sock"
--docker_stop_timeout="0ns" --docker_store_dir="/tmp/Endpoint_SlaveEndpointTest_UnauthorizedRequest_2_9O7Jhl/store/docker"
--docker_volume_checkpoint_dir="/var/run/mesos/isolators/docker/volume" --enforce_container_disk_quota="false"
--executor_registration_timeout="1mins" --executor_reregistration_timeout="2secs" --executor_shutdown_grace_period="5secs"
--fetcher_cache_dir="/tmp/Endpoint_SlaveEndpointTest_UnauthorizedRequest_2_9O7Jhl/fetch" --fetcher_cache_size="2GB"
--frameworks_home="" --gc_delay="1weeks" --gc_disk_headroom="0.1" --hadoop_home="" --help="false"
--hostname_lookup="true" --http_command_executor="false" --http_credentials="/tmp/Endpoint_SlaveEndpointTest_UnauthorizedRequest_2_9O7Jhl/http_credentials"
--http_heartbeat_interval="30secs" --initialize_driver_logging="true" --isolation="posix/cpu,posix/mem"
--launcher="posix" --launcher_dir="/mesos/build/src" --logbufsecs="0" --logging_level="INFO"
--max_completed_executors_per_framework="150" --oversubscribed_resources_interval="15secs"
--perf_duration="10secs" --perf_interval="1mins" --port="5051" --qos_correction_interval_min="0ns"
--quiet="false" --recover="reconnect" --recovery_timeout="15mins" --registration_backoff_factor="10ms"
--resources="cpus:2;gpus:0;mem:1024;disk:1024;ports:[31000-32000]" --revocable_cpu_low_priority="true"
--runtime_dir="/tmp/Endpoint_SlaveEndpointTest_UnauthorizedRequest_2_9O7Jhl" --sandbox_directory="/mnt/mesos/sandbox"
--strict="true" --switch_user="true" --systemd_enable_support="true" --systemd_runtime_directory="/run/systemd/system"
--version="false" --work_dir="/tmp/Endpoint_SlaveEndpointTest_UnauthorizedRequest_2_DKcI8E"
I0804 12:12:22.743448 31560 credentials.hpp:86] Loading credential for authentication from
'/tmp/Endpoint_SlaveEndpointTest_UnauthorizedRequest_2_9O7Jhl/credential'
I0804 12:12:22.743607 31560 slave.cpp:283] Agent using credential for: test-principal
I0804 12:12:22.743631 31560 credentials.hpp:37] Loading credentials for authentication from
'/tmp/Endpoint_SlaveEndpointTest_UnauthorizedRequest_2_9O7Jhl/http_credentials'
I0804 12:12:22.743942 31560 http.cpp:1026] Creating default 'basic' HTTP authenticator for
realm 'mesos-agent-readonly'
I0804 12:12:22.744120 31560 http.cpp:1026] Creating default 'basic' HTTP authenticator for
realm 'mesos-agent-readwrite'
I0804 12:12:22.745736 31560 slave.cpp:565] Agent resources: [{"name":"cpus","scalar":{"value":2.0},"type":"SCALAR"},{"name":"mem","scalar":{"value":1024.0},"type":"SCALAR"},{"name":"disk","scalar":{"value":1024.0},"type":"SCALAR"},{"name":"ports","ranges":{"range":[{"begin":31000,"end":32000}]},"type":"RANGES"}]
I0804 12:12:22.745977 31560 slave.cpp:573] Agent attributes: [  ]
I0804 12:12:22.745997 31560 slave.cpp:582] Agent hostname: 5118842e43f1
I0804 12:12:22.746160 31561 status_update_manager.cpp:177] Pausing sending status updates
I0804 12:12:22.747629 31556 state.cpp:64] Recovering state from '/tmp/Endpoint_SlaveEndpointTest_UnauthorizedRequest_2_DKcI8E/meta'
I0804 12:12:22.748015 31563 status_update_manager.cpp:203] Recovering status update manager
I0804 12:12:22.748343 31568 containerizer.cpp:598] Recovering containerizer
I0804 12:12:22.750071 31558 provisioner.cpp:416] Provisioner recovery complete
I0804 12:12:22.750521 31559 slave.cpp:6207] Finished recovery
I0804 12:12:22.750975 31559 slave.cpp:6389] Querying resource estimator for oversubscribable
resources
I0804 12:12:22.751315 31555 slave.cpp:6403] Received oversubscribable resources {} from the
resource estimator
I0804 12:12:22.753852 31570 process.cpp:3933] Handling HTTP event for process 'slave(794)'
with path: '/slave(794)/containers'
I0804 12:12:22.755148 31556 http.cpp:1166] HTTP GET for /slave(794)/containers from 172.17.0.2:56231
I0804 12:12:22.755223 31556 http.cpp:957] Authorizing principal 'test-principal' to GET the
'/containers' endpoint
I0804 12:12:22.758306 31554 slave.cpp:843] Agent terminating
[       OK ] Endpoint/SlaveEndpointTest.UnauthorizedRequest/2 (32 ms)
[ RUN      ] Endpoint/SlaveEndpointTest.NoAuthorizer/0
I0804 12:12:22.771260 31554 containerizer.cpp:246] Using isolation: posix/cpu,posix/mem,filesystem/posix,network/cni,environment_secret
W0804 12:12:22.771848 31554 backend.cpp:76] Failed to create 'aufs' backend: AufsBackend requires
root privileges
W0804 12:12:22.771962 31554 backend.cpp:76] Failed to create 'bind' backend: BindBackend requires
root privileges
I0804 12:12:22.771994 31554 provisioner.cpp:255] Using default backend 'copy'
I0804 12:12:22.774107 31554 cluster.cpp:448] Creating default 'local' authorizer
I0804 12:12:22.776203 31570 slave.cpp:250] Mesos agent started on (795)@172.17.0.2:46624
I0804 12:12:22.776222 31570 slave.cpp:251] Flags at startup: --acls="" --appc_simple_discovery_uri_prefix="http://"
--appc_store_dir="/tmp/Endpoint_SlaveEndpointTest_NoAuthorizer_0_J9S093/store/appc" --authenticate_http_readonly="true"
--authenticate_http_readwrite="true" --authenticatee="crammd5" --authentication_backoff_factor="1secs"
--authorizer="local" --cgroups_cpu_enable_pids_and_tids_count="false" --cgroups_enable_cfs="false"
--cgroups_hierarchy="/sys/fs/cgroup" --cgroups_limit_swap="false" --cgroups_root="mesos" --container_disk_watch_interval="15secs"
--containerizers="mesos" --credential="/tmp/Endpoint_SlaveEndpointTest_NoAuthorizer_0_J9S093/credential"
--default_role="*" --disk_watch_interval="1mins" --docker="docker" --docker_kill_orphans="true"
--docker_registry="https://registry-1.docker.io" --docker_remove_delay="6hrs" --docker_socket="/var/run/docker.sock"
--docker_stop_timeout="0ns" --docker_store_dir="/tmp/Endpoint_SlaveEndpointTest_NoAuthorizer_0_J9S093/store/docker"
--docker_volume_checkpoint_dir="/var/run/mesos/isolators/docker/volume" --enforce_container_disk_quota="false"
--executor_registration_timeout="1mins" --executor_reregistration_timeout="2secs" --executor_shutdown_grace_period="5secs"
--fetcher_cache_dir="/tmp/Endpoint_SlaveEndpointTest_NoAuthorizer_0_J9S093/fetch" --fetcher_cache_size="2GB"
--frameworks_home="" --gc_delay="1weeks" --gc_disk_headroom="0.1" --hadoop_home="" --help="false"
--hostname_lookup="true" --http_command_executor="false" --http_credentials="/tmp/Endpoint_SlaveEndpointTest_NoAuthorizer_0_J9S093/http_credentials"
--http_heartbeat_interval="30secs" --initialize_driver_logging="true" --isolation="posix/cpu,posix/mem"
--launcher="posix" --launcher_dir="/mesos/build/src" --logbufsecs="0" --logging_level="INFO"
--max_completed_executors_per_framework="150" --oversubscribed_resources_interval="15secs"
--perf_duration="10secs" --perf_interval="1mins" --port="5051" --qos_correction_interval_min="0ns"
--quiet="false" --recover="reconnect" --recovery_timeout="15mins" --registration_backoff_factor="10ms"
--resources="cpus:2;gpus:0;mem:1024;disk:1024;ports:[31000-32000]" --revocable_cpu_low_priority="true"
--runtime_dir="/tmp/Endpoint_SlaveEndpointTest_NoAuthorizer_0_J9S093" --sandbox_directory="/mnt/mesos/sandbox"
--strict="true" --switch_user="true" --systemd_enable_support="true" --systemd_runtime_directory="/run/systemd/system"
--version="false" --work_dir="/tmp/Endpoint_SlaveEndpointTest_NoAuthorizer_0_bf1FVn"
I0804 12:12:22.776701 31570 credentials.hpp:86] Loading credential for authentication from
'/tmp/Endpoint_SlaveEndpointTest_NoAuthorizer_0_J9S093/credential'
I0804 12:12:22.776850 31570 slave.cpp:283] Agent using credential for: test-principal
I0804 12:12:22.776870 31570 credentials.hpp:37] Loading credentials for authentication from
'/tmp/Endpoint_SlaveEndpointTest_NoAuthorizer_0_J9S093/http_credentials'
I0804 12:12:22.777180 31570 http.cpp:1026] Creating default 'basic' HTTP authenticator for
realm 'mesos-agent-readonly'
I0804 12:12:22.777390 31570 http.cpp:1026] Creating default 'basic' HTTP authenticator for
realm 'mesos-agent-readwrite'
I0804 12:12:22.779026 31570 slave.cpp:565] Agent resources: [{"name":"cpus","scalar":{"value":2.0},"type":"SCALAR"},{"name":"mem","scalar":{"value":1024.0},"type":"SCALAR"},{"name":"disk","scalar":{"value":1024.0},"type":"SCALAR"},{"name":"ports","ranges":{"range":[{"begin":31000,"end":32000}]},"type":"RANGES"}]
I0804 12:12:22.779259 31570 slave.cpp:573] Agent attributes: [  ]
I0804 12:12:22.779270 31570 slave.cpp:582] Agent hostname: 5118842e43f1
I0804 12:12:22.779397 31561 status_update_manager.cpp:177] Pausing sending status updates
I0804 12:12:22.781289 31564 state.cpp:64] Recovering state from '/tmp/Endpoint_SlaveEndpointTest_NoAuthorizer_0_bf1FVn/meta'
I0804 12:12:22.781599 31557 status_update_manager.cpp:203] Recovering status update manager
I0804 12:12:22.781770 31557 containerizer.cpp:598] Recovering containerizer
I0804 12:12:22.783393 31560 provisioner.cpp:416] Provisioner recovery complete
I0804 12:12:22.783860 31567 slave.cpp:6207] Finished recovery
I0804 12:12:22.784307 31567 slave.cpp:6389] Querying resource estimator for oversubscribable
resources
I0804 12:12:22.784541 31564 slave.cpp:6403] Received oversubscribable resources {} from the
resource estimator
I0804 12:12:22.787017 31558 process.cpp:3933] Handling HTTP event for process 'slave(795)'
with path: '/slave(795)/monitor/statistics'
I0804 12:12:22.788317 31566 http.cpp:1166] HTTP GET for /slave(795)/monitor/statistics from
172.17.0.2:56232
I0804 12:12:22.788403 31566 http.cpp:957] Authorizing principal 'test-principal' to GET the
'/monitor/statistics' endpoint
I0804 12:12:22.791744 31554 slave.cpp:843] Agent terminating
[       OK ] Endpoint/SlaveEndpointTest.NoAuthorizer/0 (33 ms)
[ RUN      ] Endpoint/SlaveEndpointTest.NoAuthorizer/1
I0804 12:12:22.806355 31554 containerizer.cpp:246] Using isolation: posix/cpu,posix/mem,filesystem/posix,network/cni,environment_secret
W0804 12:12:22.806833 31554 backend.cpp:76] Failed to create 'aufs' backend: AufsBackend requires
root privileges
W0804 12:12:22.806929 31554 backend.cpp:76] Failed to create 'bind' backend: BindBackend requires
root privileges
I0804 12:12:22.806962 31554 provisioner.cpp:255] Using default backend 'copy'
I0804 12:12:22.808547 31554 cluster.cpp:448] Creating default 'local' authorizer
I0804 12:12:22.810104 31563 slave.cpp:250] Mesos agent started on (796)@172.17.0.2:46624
I0804 12:12:22.810123 31563 slave.cpp:251] Flags at startup: --acls="" --appc_simple_discovery_uri_prefix="http://"
--appc_store_dir="/tmp/Endpoint_SlaveEndpointTest_NoAuthorizer_1_VfUToN/store/appc" --authenticate_http_readonly="true"
--authenticate_http_readwrite="true" --authenticatee="crammd5" --authentication_backoff_factor="1secs"
--authorizer="local" --cgroups_cpu_enable_pids_and_tids_count="false" --cgroups_enable_cfs="false"
--cgroups_hierarchy="/sys/fs/cgroup" --cgroups_limit_swap="false" --cgroups_root="mesos" --container_disk_watch_interval="15secs"
--containerizers="mesos" --credential="/tmp/Endpoint_SlaveEndpointTest_NoAuthorizer_1_VfUToN/credential"
--default_role="*" --disk_watch_interval="1mins" --docker="docker" --docker_kill_orphans="true"
--docker_registry="https://registry-1.docker.io" --docker_remove_delay="6hrs" --docker_socket="/var/run/docker.sock"
--docker_stop_timeout="0ns" --docker_store_dir="/tmp/Endpoint_SlaveEndpointTest_NoAuthorizer_1_VfUToN/store/docker"
--docker_volume_checkpoint_dir="/var/run/mesos/isolators/docker/volume" --enforce_container_disk_quota="false"
--executor_registration_timeout="1mins" --executor_reregistration_timeout="2secs" --executor_shutdown_grace_period="5secs"
--fetcher_cache_dir="/tmp/Endpoint_SlaveEndpointTest_NoAuthorizer_1_VfUToN/fetch" --fetcher_cache_size="2GB"
--frameworks_home="" --gc_delay="1weeks" --gc_disk_headroom="0.1" --hadoop_home="" --help="false"
--hostname_lookup="true" --http_command_executor="false" --http_credentials="/tmp/Endpoint_SlaveEndpointTest_NoAuthorizer_1_VfUToN/http_credentials"
--http_heartbeat_interval="30secs" --initialize_driver_logging="true" --isolation="posix/cpu,posix/mem"
--launcher="posix" --launcher_dir="/mesos/build/src" --logbufsecs="0" --logging_level="INFO"
--max_completed_executors_per_framework="150" --oversubscribed_resources_interval="15secs"
--perf_duration="10secs" --perf_interval="1mins" --port="5051" --qos_correction_interval_min="0ns"
--quiet="false" --recover="reconnect" --recovery_timeout="15mins" --registration_backoff_factor="10ms"
--resources="cpus:2;gpus:0;mem:1024;disk:1024;ports:[31000-32000]" --revocable_cpu_low_priority="true"
--runtime_dir="/tmp/Endpoint_SlaveEndpointTest_NoAuthorizer_1_VfUToN" --sandbox_directory="/mnt/mesos/sandbox"
--strict="true" --switch_user="true" --systemd_enable_support="true" --systemd_runtime_directory="/run/systemd/system"
--version="false" --work_dir="/tmp/Endpoint_SlaveEndpointTest_NoAuthorizer_1_TXgP46"
I0804 12:12:22.810660 31563 credentials.hpp:86] Loading credential for authentication from
'/tmp/Endpoint_SlaveEndpointTest_NoAuthorizer_1_VfUToN/credential'
I0804 12:12:22.810804 31563 slave.cpp:283] Agent using credential for: test-principal
I0804 12:12:22.810824 31563 credentials.hpp:37] Loading credentials for authentication from
'/tmp/Endpoint_SlaveEndpointTest_NoAuthorizer_1_VfUToN/http_credentials'
I0804 12:12:22.811074 31563 http.cpp:1026] Creating default 'basic' HTTP authenticator for
realm 'mesos-agent-readonly'
I0804 12:12:22.811216 31563 http.cpp:1026] Creating default 'basic' HTTP authenticator for
realm 'mesos-agent-readwrite'
I0804 12:12:22.812924 31563 slave.cpp:565] Agent resources: [{"name":"cpus","scalar":{"value":2.0},"type":"SCALAR"},{"name":"mem","scalar":{"value":1024.0},"type":"SCALAR"},{"name":"disk","scalar":{"value":1024.0},"type":"SCALAR"},{"name":"ports","ranges":{"range":[{"begin":31000,"end":32000}]},"type":"RANGES"}]
I0804 12:12:22.813160 31563 slave.cpp:573] Agent attributes: [  ]
I0804 12:12:22.813171 31563 slave.cpp:582] Agent hostname: 5118842e43f1
I0804 12:12:22.813325 31560 status_update_manager.cpp:177] Pausing sending status updates
I0804 12:12:22.814734 31565 state.cpp:64] Recovering state from '/tmp/Endpoint_SlaveEndpointTest_NoAuthorizer_1_TXgP46/meta'
I0804 12:12:22.815058 31568 status_update_manager.cpp:203] Recovering status update manager
I0804 12:12:22.815255 31559 containerizer.cpp:598] Recovering containerizer
I0804 12:12:22.816931 31566 provisioner.cpp:416] Provisioner recovery complete
I0804 12:12:22.817298 31570 slave.cpp:6207] Finished recovery
I0804 12:12:22.817844 31570 slave.cpp:6389] Querying resource estimator for oversubscribable
resources
I0804 12:12:22.818171 31569 slave.cpp:6403] Received oversubscribable resources {} from the
resource estimator
I0804 12:12:22.820528 31558 process.cpp:3933] Handling HTTP event for process 'slave(796)'
with path: '/slave(796)/monitor/statistics.json'
I0804 12:12:22.821885 31563 http.cpp:1166] HTTP GET for /slave(796)/monitor/statistics.json
from 172.17.0.2:56233
I0804 12:12:22.821964 31563 http.cpp:957] Authorizing principal 'test-principal' to GET the
'/monitor/statistics.json' endpoint
I0804 12:12:22.825893 31554 slave.cpp:843] Agent terminating
[       OK ] Endpoint/SlaveEndpointTest.NoAuthorizer/1 (32 ms)
[ RUN      ] Endpoint/SlaveEndpointTest.NoAuthorizer/2
I0804 12:12:22.839092 31554 containerizer.cpp:246] Using isolation: posix/cpu,posix/mem,filesystem/posix,network/cni,environment_secret
W0804 12:12:22.839747 31554 backend.cpp:76] Failed to create 'aufs' backend: AufsBackend requires
root privileges
W0804 12:12:22.839879 31554 backend.cpp:76] Failed to create 'bind' backend: BindBackend requires
root privileges
I0804 12:12:22.839913 31554 provisioner.cpp:255] Using default backend 'copy'
I0804 12:12:22.842034 31554 cluster.cpp:448] Creating default 'local' authorizer
I0804 12:12:22.844085 31560 slave.cpp:250] Mesos agent started on (797)@172.17.0.2:46624
I0804 12:12:22.844110 31560 slave.cpp:251] Flags at startup: --acls="" --appc_simple_discovery_uri_prefix="http://"
--appc_store_dir="/tmp/Endpoint_SlaveEndpointTest_NoAuthorizer_2_40y3Yw/store/appc" --authenticate_http_readonly="true"
--authenticate_http_readwrite="true" --authenticatee="crammd5" --authentication_backoff_factor="1secs"
--authorizer="local" --cgroups_cpu_enable_pids_and_tids_count="false" --cgroups_enable_cfs="false"
--cgroups_hierarchy="/sys/fs/cgroup" --cgroups_limit_swap="false" --cgroups_root="mesos" --container_disk_watch_interval="15secs"
--containerizers="mesos" --credential="/tmp/Endpoint_SlaveEndpointTest_NoAuthorizer_2_40y3Yw/credential"
--default_role="*" --disk_watch_interval="1mins" --docker="docker" --docker_kill_orphans="true"
--docker_registry="https://registry-1.docker.io" --docker_remove_delay="6hrs" --docker_socket="/var/run/docker.sock"
--docker_stop_timeout="0ns" --docker_store_dir="/tmp/Endpoint_SlaveEndpointTest_NoAuthorizer_2_40y3Yw/store/docker"
--docker_volume_checkpoint_dir="/var/run/mesos/isolators/docker/volume" --enforce_container_disk_quota="false"
--executor_registration_timeout="1mins" --executor_reregistration_timeout="2secs" --executor_shutdown_grace_period="5secs"
--fetcher_cache_dir="/tmp/Endpoint_SlaveEndpointTest_NoAuthorizer_2_40y3Yw/fetch" --fetcher_cache_size="2GB"
--frameworks_home="" --gc_delay="1weeks" --gc_disk_headroom="0.1" --hadoop_home="" --help="false"
--hostname_lookup="true" --http_command_executor="false" --http_credentials="/tmp/Endpoint_SlaveEndpointTest_NoAuthorizer_2_40y3Yw/http_credentials"
--http_heartbeat_interval="30secs" --initialize_driver_logging="true" --isolation="posix/cpu,posix/mem"
--launcher="posix" --launcher_dir="/mesos/build/src" --logbufsecs="0" --logging_level="INFO"
--max_completed_executors_per_framework="150" --oversubscribed_resources_interval="15secs"
--perf_duration="10secs" --perf_interval="1mins" --port="5051" --qos_correction_interval_min="0ns"
--quiet="false" --recover="reconnect" --recovery_timeout="15mins" --registration_backoff_factor="10ms"
--resources="cpus:2;gpus:0;mem:1024;disk:1024;ports:[31000-32000]" --revocable_cpu_low_priority="true"
--runtime_dir="/tmp/Endpoint_SlaveEndpointTest_NoAuthorizer_2_40y3Yw" --sandbox_directory="/mnt/mesos/sandbox"
--strict="true" --switch_user="true" --systemd_enable_support="true" --systemd_runtime_directory="/run/systemd/system"
--version="false" --work_dir="/tmp/Endpoint_SlaveEndpointTest_NoAuthorizer_2_a6jHzQ"
I0804 12:12:22.844749 31560 credentials.hpp:86] Loading credential for authentication from
'/tmp/Endpoint_SlaveEndpointTest_NoAuthorizer_2_40y3Yw/credential'
I0804 12:12:22.844924 31560 slave.cpp:283] Agent using credential for: test-principal
I0804 12:12:22.844946 31560 credentials.hpp:37] Loading credentials for authentication from
'/tmp/Endpoint_SlaveEndpointTest_NoAuthorizer_2_40y3Yw/http_credentials'
I0804 12:12:22.845208 31560 http.cpp:1026] Creating default 'basic' HTTP authenticator for
realm 'mesos-agent-readonly'
I0804 12:12:22.845362 31560 http.cpp:1026] Creating default 'basic' HTTP authenticator for
realm 'mesos-agent-readwrite'
I0804 12:12:22.846921 31560 slave.cpp:565] Agent resources: [{"name":"cpus","scalar":{"value":2.0},"type":"SCALAR"},{"name":"mem","scalar":{"value":1024.0},"type":"SCALAR"},{"name":"disk","scalar":{"value":1024.0},"type":"SCALAR"},{"name":"ports","ranges":{"range":[{"begin":31000,"end":32000}]},"type":"RANGES"}]
I0804 12:12:22.847157 31560 slave.cpp:573] Agent attributes: [  ]
I0804 12:12:22.847167 31560 slave.cpp:582] Agent hostname: 5118842e43f1
I0804 12:12:22.847313 31570 status_update_manager.cpp:177] Pausing sending status updates
I0804 12:12:22.848768 31564 state.cpp:64] Recovering state from '/tmp/Endpoint_SlaveEndpointTest_NoAuthorizer_2_a6jHzQ/meta'
I0804 12:12:22.849076 31565 status_update_manager.cpp:203] Recovering status update manager
I0804 12:12:22.849328 31558 containerizer.cpp:598] Recovering containerizer
I0804 12:12:22.850896 31557 provisioner.cpp:416] Provisioner recovery complete
I0804 12:12:22.851300 31557 slave.cpp:6207] Finished recovery
I0804 12:12:22.851754 31557 slave.cpp:6389] Querying resource estimator for oversubscribable
resources
I0804 12:12:22.852035 31566 slave.cpp:6403] Received oversubscribable resources {} from the
resource estimator
I0804 12:12:22.854472 31560 process.cpp:3933] Handling HTTP event for process 'slave(797)'
with path: '/slave(797)/containers'
I0804 12:12:22.855769 31557 http.cpp:1166] HTTP GET for /slave(797)/containers from 172.17.0.2:56234
I0804 12:12:22.855850 31557 http.cpp:957] Authorizing principal 'test-principal' to GET the
'/containers' endpoint
I0804 12:12:22.859800 31563 slave.cpp:843] Agent terminating
[       OK ] Endpoint/SlaveEndpointTest.NoAuthorizer/2 (34 ms)
[----------] 9 tests from Endpoint/SlaveEndpointTest (298 ms total)

[----------] Global test environment tear-down
[==========] 1599 tests from 174 test cases ran. (425726 ms total)
[  PASSED  ] 1598 tests.
[  FAILED  ] 1 test, listed below:
[  FAILED  ] PersistentVolumeEndpointsTest.DynamicReservationRoleMismatch

 1 FAILED TEST
  YOU HAVE 20 DISABLED TESTS

I0804 12:12:22.925936 31571 process.cpp:1072] Failed to accept socket: future discarded
make[3]: *** [CMakeFiles/check] Error 1
make[3]: Leaving directory `/mesos/build'
make[2]: *** [CMakeFiles/check.dir/all] Error 2
make[2]: Leaving directory `/mesos/build'
make[1]: *** [CMakeFiles/check.dir/rule] Error 2
make[1]: Leaving directory `/mesos/build'
make: *** [check] Error 2
+ docker rmi mesos-1501845809-29742
Untagged: mesos-1501845809-29742:latest
Deleted: sha256:022beb71d45c6efd1f37d4844974bc5c1d1db34253aedba3023bbbdc39b5dfbf
Deleted: sha256:866b6ee34ee836d2d07b54dda07cc5e1dce26bfac5103941afc5e156ef84b2bc
Deleted: sha256:a5789967e5257299ac4cee90565b56f9b12b7231c9e3de28b1e4bd928bcb2435
Deleted: sha256:9584bf671b65ab3eff99ad4dc083f78b01f14e6ec19aef5a8b4efe8d6f0668fa
Deleted: sha256:b84ac400ae6edfce2d44950fa49c9dd534c7eb9677d2f87cdebe0bef3589c7a8
Deleted: sha256:5387ef7a866815da47a8f20160aec09e305f499306cd82de0b2b269c274dbb19
Deleted: sha256:7d277bdec6b6813ed94ed67adf42275ea4b71e6d6bcdca8b34127761c29dc899
Deleted: sha256:42995c5e7fb71bdda04521ac4f2bcf1837a90ac6db0a2e42815bb1db6dabda15
Deleted: sha256:6c9a7602cfca90b97554450710f8cfb31df97346281d0188322b1a34aecf4d27
Deleted: sha256:7d205afa1edee5e52a152c0abefe057e9c196d5cdc68cd5d47591c688e8b9530
Deleted: sha256:fe3183327982e2192a479b80d38e5385be7b49c11f077654e3c46efaeaa541b4
Deleted: sha256:6038e9aac14f4d2b1ee75f32d5bdb97989487aed84952d6ac69f8e95a849b261
Deleted: sha256:a10a2105ba89a347b1b3b5262e31f2fc5aec4cf812c81b23f4ae2d40ce9c2e8a
Deleted: sha256:681724fb4fad181e1ff5859a97f8e5adcd05e201521a1bd343949f66d07c4fb2
Deleted: sha256:41a3cf2ad66bdd40dacc0387659a5e2b3f765eb435a76dcbda171d290fd81cd5
Deleted: sha256:eaa609bca34413daeb76dad8b179364ee37dcfc2de2ece055d618cba946cfbdd
Deleted: sha256:43cca0beff5e5c21ffd74c567a6f1db13f5afaacda9be43f942fb6f34d248e1b
Deleted: sha256:a808b61e423eba89baa5ca93894580be5c4df654fc833b6f62faf4244866058c
Deleted: sha256:bb8057480a24f5e5991c8d177241dd38aa1ab272b0d685899eb5c82c18afa1ca
Deleted: sha256:de28f51b8436dccb668a686ef2ee3108f4d37069bf66216a00252e9225a227c6
Deleted: sha256:16cdb10d379835ad247060aefaab3d3e5759f080e6175d8bbe09c02ed3ffd57d
Deleted: sha256:216f01fc4a7579fb01661f9220c794d61c5ad0ecfe028280531681cf9043b6c5
Deleted: sha256:cbcd408b3705100ed49e7d201fa43d4f4e20bdc066b9afc2c7173ed450bf68cd
Deleted: sha256:72d6c97f680b5a3e2a8a8f8bfdd3732b4d92c82b78d8f09556355a89dc44f4be
Deleted: sha256:47291b5efff78a50a5ab533b5ac8b900d287124ec16329ba9bfc118c22be4f0a
Build step 'Execute shell' marked build as failure

Mime
View raw message