mesos-builds mailing list archives

Site index · List index
Message view « Date » · « Thread »
Top « Date » · « Thread »
From Apache Jenkins Server <jenk...@builds.apache.org>
Subject Build failed in Jenkins: Mesos-Buildbot » autotools,gcc,--verbose --enable-libevent --enable-ssl,GLOG_v=1 MESOS_VERBOSE=1,centos:7,(ubuntu)&&(!ubuntu-us1)&&(!ubuntu-eu2) #4028
Date Tue, 01 Aug 2017 01:25:55 GMT
See <https://builds.apache.org/job/Mesos-Buildbot/BUILDTOOL=autotools,COMPILER=gcc,CONFIGURATION=--verbose%20--enable-libevent%20--enable-ssl,ENVIRONMENT=GLOG_v=1%20MESOS_VERBOSE=1,OS=centos%3A7,label_exp=(ubuntu)&&(!ubuntu-us1)&&(!ubuntu-eu2)/4028/display/redirect>

------------------------------------------
[...truncated 31.76 MB...]
W0801 01:25:42.875310  9348 backend.cpp:76] Failed to create 'aufs' backend: AufsBackend requires
root privileges
W0801 01:25:42.875417  9348 backend.cpp:76] Failed to create 'bind' backend: BindBackend requires
root privileges
I0801 01:25:42.875457  9348 provisioner.cpp:255] Using default backend 'copy'
I0801 01:25:42.878639 30163 slave.cpp:250] Mesos agent started on (799)@172.17.0.6:45102
I0801 01:25:42.878672 30163 slave.cpp:251] Flags at startup: --acls="" --appc_simple_discovery_uri_prefix="http://"
--appc_store_dir="/tmp/Endpoint_SlaveEndpointTest_UnauthorizedRequest_0_rQaWDS/store/appc"
--authenticate_http_executors="true" --authenticate_http_readonly="true" --authenticate_http_readwrite="true"
--authenticatee="crammd5" --authentication_backoff_factor="1secs" --authorizer="local" --cgroups_cpu_enable_pids_and_tids_count="false"
--cgroups_enable_cfs="false" --cgroups_hierarchy="/sys/fs/cgroup" --cgroups_limit_swap="false"
--cgroups_root="mesos" --container_disk_watch_interval="15secs" --containerizers="mesos" --credential="/tmp/Endpoint_SlaveEndpointTest_UnauthorizedRequest_0_rQaWDS/credential"
--default_role="*" --disk_watch_interval="1mins" --docker="docker" --docker_kill_orphans="true"
--docker_registry="https://registry-1.docker.io" --docker_remove_delay="6hrs" --docker_socket="/var/run/docker.sock"
--docker_stop_timeout="0ns" --docker_store_dir="/tmp/Endpoint_SlaveEndpointTest_UnauthorizedRequest_0_rQaWDS/store/docker"
--docker_volume_checkpoint_dir="/var/run/mesos/isolators/docker/volume" --enforce_container_disk_quota="false"
--executor_registration_timeout="1mins" --executor_reregistration_timeout="2secs" --executor_secret_key="/tmp/Endpoint_SlaveEndpointTest_UnauthorizedRequest_0_rQaWDS/executor_secret_key"
--executor_shutdown_grace_period="5secs" --fetcher_cache_dir="/tmp/Endpoint_SlaveEndpointTest_UnauthorizedRequest_0_rQaWDS/fetch"
--fetcher_cache_size="2GB" --frameworks_home="" --gc_delay="1weeks" --gc_disk_headroom="0.1"
--hadoop_home="" --help="false" --hostname_lookup="true" --http_command_executor="false" --http_credentials="/tmp/Endpoint_SlaveEndpointTest_UnauthorizedRequest_0_rQaWDS/http_credentials"
--http_heartbeat_interval="30secs" --initialize_driver_logging="true" --isolation="posix/cpu,posix/mem"
--launcher="posix" --launcher_dir="/mesos/mesos-1.4.0/_build/src" --logbufsecs="0" --logging_level="INFO"
--max_completed_executors_per_framework="150" --oversubscribed_resources_interval="15secs"
--perf_duration="10secs" --perf_interval="1mins" --port="5051" --qos_correction_interval_min="0ns"
--quiet="false" --recover="reconnect" --recovery_timeout="15mins" --registration_backoff_factor="10ms"
--resources="cpus:2;gpus:0;mem:1024;disk:1024;ports:[31000-32000]" --revocable_cpu_low_priority="true"
--runtime_dir="/tmp/Endpoint_SlaveEndpointTest_UnauthorizedRequest_0_rQaWDS" --sandbox_directory="/mnt/mesos/sandbox"
--strict="true" --switch_user="true" --systemd_enable_support="true" --systemd_runtime_directory="/run/systemd/system"
--version="false" --work_dir="/tmp/Endpoint_SlaveEndpointTest_UnauthorizedRequest_0_fofhiu"
I0801 01:25:42.879129 30163 credentials.hpp:86] Loading credential for authentication from
'/tmp/Endpoint_SlaveEndpointTest_UnauthorizedRequest_0_rQaWDS/credential'
I0801 01:25:42.879325 30163 slave.cpp:283] Agent using credential for: test-principal
I0801 01:25:42.879351 30163 credentials.hpp:37] Loading credentials for authentication from
'/tmp/Endpoint_SlaveEndpointTest_UnauthorizedRequest_0_rQaWDS/http_credentials'
I0801 01:25:42.879685 30163 http.cpp:993] Creating default 'basic' HTTP authenticator for
realm 'mesos-agent-executor'
I0801 01:25:42.879827 30163 http.cpp:1014] Creating default 'jwt' HTTP authenticator for realm
'mesos-agent-executor'
I0801 01:25:42.880033 30163 http.cpp:993] Creating default 'basic' HTTP authenticator for
realm 'mesos-agent-readonly'
I0801 01:25:42.880144 30163 http.cpp:1014] Creating default 'jwt' HTTP authenticator for realm
'mesos-agent-readonly'
I0801 01:25:42.880295 30163 http.cpp:993] Creating default 'basic' HTTP authenticator for
realm 'mesos-agent-readwrite'
I0801 01:25:42.880391 30163 http.cpp:1014] Creating default 'jwt' HTTP authenticator for realm
'mesos-agent-readwrite'
I0801 01:25:42.881778 30163 slave.cpp:565] Agent resources: [{"name":"cpus","scalar":{"value":2.0},"type":"SCALAR"},{"name":"mem","scalar":{"value":1024.0},"type":"SCALAR"},{"name":"disk","scalar":{"value":1024.0},"type":"SCALAR"},{"name":"ports","ranges":{"range":[{"begin":31000,"end":32000}]},"type":"RANGES"}]
I0801 01:25:42.882009 30163 slave.cpp:573] Agent attributes: [  ]
I0801 01:25:42.882030 30163 slave.cpp:582] Agent hostname: a292b053491a
I0801 01:25:42.882455 30152 status_update_manager.cpp:177] Pausing sending status updates
I0801 01:25:42.884093 30161 state.cpp:64] Recovering state from '/tmp/Endpoint_SlaveEndpointTest_UnauthorizedRequest_0_fofhiu/meta'
I0801 01:25:42.884517 30169 status_update_manager.cpp:203] Recovering status update manager
I0801 01:25:42.884752 30158 containerizer.cpp:582] Recovering containerizer
I0801 01:25:42.886656 30153 provisioner.cpp:416] Provisioner recovery complete
I0801 01:25:42.887065 30148 slave.cpp:6207] Finished recovery
I0801 01:25:42.887598 30148 slave.cpp:6389] Querying resource estimator for oversubscribable
resources
I0801 01:25:42.887928 30149 slave.cpp:6403] Received oversubscribable resources {} from the
resource estimator
I0801 01:25:42.890957 30160 process.cpp:3836] Handling HTTP event for process 'slave(799)'
with path: '/slave(799)/monitor/statistics'
I0801 01:25:42.892894 30166 http.cpp:1133] HTTP GET for /slave(799)/monitor/statistics from
172.17.0.6:55350
I0801 01:25:42.892987 30166 http.cpp:957] Authorizing principal 'test-principal' to GET the
'/monitor/statistics' endpoint
I0801 01:25:42.894836 30151 slave.cpp:843] Agent terminating
[       OK ] Endpoint/SlaveEndpointTest.UnauthorizedRequest/0 (32 ms)
[ RUN      ] Endpoint/SlaveEndpointTest.UnauthorizedRequest/1
I0801 01:25:42.906278  9348 containerizer.cpp:230] Using isolation: posix/cpu,posix/mem,filesystem/posix,network/cni,environment_secret
W0801 01:25:42.906800  9348 backend.cpp:76] Failed to create 'aufs' backend: AufsBackend requires
root privileges
W0801 01:25:42.906911  9348 backend.cpp:76] Failed to create 'bind' backend: BindBackend requires
root privileges
I0801 01:25:42.906950  9348 provisioner.cpp:255] Using default backend 'copy'
I0801 01:25:42.910233 30169 slave.cpp:250] Mesos agent started on (800)@172.17.0.6:45102
I0801 01:25:42.910259 30169 slave.cpp:251] Flags at startup: --acls="" --appc_simple_discovery_uri_prefix="http://"
--appc_store_dir="/tmp/Endpoint_SlaveEndpointTest_UnauthorizedRequest_1_exGsis/store/appc"
--authenticate_http_executors="true" --authenticate_http_readonly="true" --authenticate_http_readwrite="true"
--authenticatee="crammd5" --authentication_backoff_factor="1secs" --authorizer="local" --cgroups_cpu_enable_pids_and_tids_count="false"
--cgroups_enable_cfs="false" --cgroups_hierarchy="/sys/fs/cgroup" --cgroups_limit_swap="false"
--cgroups_root="mesos" --container_disk_watch_interval="15secs" --containerizers="mesos" --credential="/tmp/Endpoint_SlaveEndpointTest_UnauthorizedRequest_1_exGsis/credential"
--default_role="*" --disk_watch_interval="1mins" --docker="docker" --docker_kill_orphans="true"
--docker_registry="https://registry-1.docker.io" --docker_remove_delay="6hrs" --docker_socket="/var/run/docker.sock"
--docker_stop_timeout="0ns" --docker_store_dir="/tmp/Endpoint_SlaveEndpointTest_UnauthorizedRequest_1_exGsis/store/docker"
--docker_volume_checkpoint_dir="/var/run/mesos/isolators/docker/volume" --enforce_container_disk_quota="false"
--executor_registration_timeout="1mins" --executor_reregistration_timeout="2secs" --executor_secret_key="/tmp/Endpoint_SlaveEndpointTest_UnauthorizedRequest_1_exGsis/executor_secret_key"
--executor_shutdown_grace_period="5secs" --fetcher_cache_dir="/tmp/Endpoint_SlaveEndpointTest_UnauthorizedRequest_1_exGsis/fetch"
--fetcher_cache_size="2GB" --frameworks_home="" --gc_delay="1weeks" --gc_disk_headroom="0.1"
--hadoop_home="" --help="false" --hostname_lookup="true" --http_command_executor="false" --http_credentials="/tmp/Endpoint_SlaveEndpointTest_UnauthorizedRequest_1_exGsis/http_credentials"
--http_heartbeat_interval="30secs" --initialize_driver_logging="true" --isolation="posix/cpu,posix/mem"
--launcher="posix" --launcher_dir="/mesos/mesos-1.4.0/_build/src" --logbufsecs="0" --logging_level="INFO"
--max_completed_executors_per_framework="150" --oversubscribed_resources_interval="15secs"
--perf_duration="10secs" --perf_interval="1mins" --port="5051" --qos_correction_interval_min="0ns"
--quiet="false" --recover="reconnect" --recovery_timeout="15mins" --registration_backoff_factor="10ms"
--resources="cpus:2;gpus:0;mem:1024;disk:1024;ports:[31000-32000]" --revocable_cpu_low_priority="true"
--runtime_dir="/tmp/Endpoint_SlaveEndpointTest_UnauthorizedRequest_1_exGsis" --sandbox_directory="/mnt/mesos/sandbox"
--strict="true" --switch_user="true" --systemd_enable_support="true" --systemd_runtime_directory="/run/systemd/system"
--version="false" --work_dir="/tmp/Endpoint_SlaveEndpointTest_UnauthorizedRequest_1_X0S8R3"
I0801 01:25:42.910750 30169 credentials.hpp:86] Loading credential for authentication from
'/tmp/Endpoint_SlaveEndpointTest_UnauthorizedRequest_1_exGsis/credential'
I0801 01:25:42.910946 30169 slave.cpp:283] Agent using credential for: test-principal
I0801 01:25:42.910972 30169 credentials.hpp:37] Loading credentials for authentication from
'/tmp/Endpoint_SlaveEndpointTest_UnauthorizedRequest_1_exGsis/http_credentials'
I0801 01:25:42.911283 30169 http.cpp:993] Creating default 'basic' HTTP authenticator for
realm 'mesos-agent-executor'
I0801 01:25:42.911418 30169 http.cpp:1014] Creating default 'jwt' HTTP authenticator for realm
'mesos-agent-executor'
I0801 01:25:42.911615 30169 http.cpp:993] Creating default 'basic' HTTP authenticator for
realm 'mesos-agent-readonly'
I0801 01:25:42.911690 30169 http.cpp:1014] Creating default 'jwt' HTTP authenticator for realm
'mesos-agent-readonly'
I0801 01:25:42.911846 30169 http.cpp:993] Creating default 'basic' HTTP authenticator for
realm 'mesos-agent-readwrite'
I0801 01:25:42.911923 30169 http.cpp:1014] Creating default 'jwt' HTTP authenticator for realm
'mesos-agent-readwrite'
I0801 01:25:42.913244 30169 slave.cpp:565] Agent resources: [{"name":"cpus","scalar":{"value":2.0},"type":"SCALAR"},{"name":"mem","scalar":{"value":1024.0},"type":"SCALAR"},{"name":"disk","scalar":{"value":1024.0},"type":"SCALAR"},{"name":"ports","ranges":{"range":[{"begin":31000,"end":32000}]},"type":"RANGES"}]
I0801 01:25:42.913473 30169 slave.cpp:573] Agent attributes: [  ]
I0801 01:25:42.913488 30169 slave.cpp:582] Agent hostname: a292b053491a
I0801 01:25:42.913635 30165 status_update_manager.cpp:177] Pausing sending status updates
I0801 01:25:42.915284 30151 state.cpp:64] Recovering state from '/tmp/Endpoint_SlaveEndpointTest_UnauthorizedRequest_1_X0S8R3/meta'
I0801 01:25:42.915623 30149 status_update_manager.cpp:203] Recovering status update manager
I0801 01:25:42.915963 30159 containerizer.cpp:582] Recovering containerizer
I0801 01:25:42.917500 30154 provisioner.cpp:416] Provisioner recovery complete
I0801 01:25:42.917938 30164 slave.cpp:6207] Finished recovery
I0801 01:25:42.918591 30164 slave.cpp:6389] Querying resource estimator for oversubscribable
resources
I0801 01:25:42.918967 30157 slave.cpp:6403] Received oversubscribable resources {} from the
resource estimator
I0801 01:25:42.921435 30166 process.cpp:3836] Handling HTTP event for process 'slave(800)'
with path: '/slave(800)/monitor/statistics.json'
I0801 01:25:42.923187 30149 http.cpp:1133] HTTP GET for /slave(800)/monitor/statistics.json
from 172.17.0.6:55356
I0801 01:25:42.923266 30149 http.cpp:957] Authorizing principal 'test-principal' to GET the
'/monitor/statistics.json' endpoint
I0801 01:25:42.924983 30164 slave.cpp:843] Agent terminating
[       OK ] Endpoint/SlaveEndpointTest.UnauthorizedRequest/1 (29 ms)
[ RUN      ] Endpoint/SlaveEndpointTest.UnauthorizedRequest/2
I0801 01:25:42.935883  9348 containerizer.cpp:230] Using isolation: posix/cpu,posix/mem,filesystem/posix,network/cni,environment_secret
W0801 01:25:42.936358  9348 backend.cpp:76] Failed to create 'aufs' backend: AufsBackend requires
root privileges
W0801 01:25:42.936451  9348 backend.cpp:76] Failed to create 'bind' backend: BindBackend requires
root privileges
I0801 01:25:42.936484  9348 provisioner.cpp:255] Using default backend 'copy'
I0801 01:25:42.939378 30160 slave.cpp:250] Mesos agent started on (801)@172.17.0.6:45102
I0801 01:25:42.939398 30160 slave.cpp:251] Flags at startup: --acls="" --appc_simple_discovery_uri_prefix="http://"
--appc_store_dir="/tmp/Endpoint_SlaveEndpointTest_UnauthorizedRequest_2_pEGWe2/store/appc"
--authenticate_http_executors="true" --authenticate_http_readonly="true" --authenticate_http_readwrite="true"
--authenticatee="crammd5" --authentication_backoff_factor="1secs" --authorizer="local" --cgroups_cpu_enable_pids_and_tids_count="false"
--cgroups_enable_cfs="false" --cgroups_hierarchy="/sys/fs/cgroup" --cgroups_limit_swap="false"
--cgroups_root="mesos" --container_disk_watch_interval="15secs" --containerizers="mesos" --credential="/tmp/Endpoint_SlaveEndpointTest_UnauthorizedRequest_2_pEGWe2/credential"
--default_role="*" --disk_watch_interval="1mins" --docker="docker" --docker_kill_orphans="true"
--docker_registry="https://registry-1.docker.io" --docker_remove_delay="6hrs" --docker_socket="/var/run/docker.sock"
--docker_stop_timeout="0ns" --docker_store_dir="/tmp/Endpoint_SlaveEndpointTest_UnauthorizedRequest_2_pEGWe2/store/docker"
--docker_volume_checkpoint_dir="/var/run/mesos/isolators/docker/volume" --enforce_container_disk_quota="false"
--executor_registration_timeout="1mins" --executor_reregistration_timeout="2secs" --executor_secret_key="/tmp/Endpoint_SlaveEndpointTest_UnauthorizedRequest_2_pEGWe2/executor_secret_key"
--executor_shutdown_grace_period="5secs" --fetcher_cache_dir="/tmp/Endpoint_SlaveEndpointTest_UnauthorizedRequest_2_pEGWe2/fetch"
--fetcher_cache_size="2GB" --frameworks_home="" --gc_delay="1weeks" --gc_disk_headroom="0.1"
--hadoop_home="" --help="false" --hostname_lookup="true" --http_command_executor="false" --http_credentials="/tmp/Endpoint_SlaveEndpointTest_UnauthorizedRequest_2_pEGWe2/http_credentials"
--http_heartbeat_interval="30secs" --initialize_driver_logging="true" --isolation="posix/cpu,posix/mem"
--launcher="posix" --launcher_dir="/mesos/mesos-1.4.0/_build/src" --logbufsecs="0" --logging_level="INFO"
--max_completed_executors_per_framework="150" --oversubscribed_resources_interval="15secs"
--perf_duration="10secs" --perf_interval="1mins" --port="5051" --qos_correction_interval_min="0ns"
--quiet="false" --recover="reconnect" --recovery_timeout="15mins" --registration_backoff_factor="10ms"
--resources="cpus:2;gpus:0;mem:1024;disk:1024;ports:[31000-32000]" --revocable_cpu_low_priority="true"
--runtime_dir="/tmp/Endpoint_SlaveEndpointTest_UnauthorizedRequest_2_pEGWe2" --sandbox_directory="/mnt/mesos/sandbox"
--strict="true" --switch_user="true" --systemd_enable_support="true" --systemd_runtime_directory="/run/systemd/system"
--version="false" --work_dir="/tmp/Endpoint_SlaveEndpointTest_UnauthorizedRequest_2_i9bbKD"
I0801 01:25:42.939898 30160 credentials.hpp:86] Loading credential for authentication from
'/tmp/Endpoint_SlaveEndpointTest_UnauthorizedRequest_2_pEGWe2/credential'
I0801 01:25:42.940096 30160 slave.cpp:283] Agent using credential for: test-principal
I0801 01:25:42.940127 30160 credentials.hpp:37] Loading credentials for authentication from
'/tmp/Endpoint_SlaveEndpointTest_UnauthorizedRequest_2_pEGWe2/http_credentials'
I0801 01:25:42.940457 30160 http.cpp:993] Creating default 'basic' HTTP authenticator for
realm 'mesos-agent-executor'
I0801 01:25:42.940592 30160 http.cpp:1014] Creating default 'jwt' HTTP authenticator for realm
'mesos-agent-executor'
I0801 01:25:42.940798 30160 http.cpp:993] Creating default 'basic' HTTP authenticator for
realm 'mesos-agent-readonly'
I0801 01:25:42.940886 30160 http.cpp:1014] Creating default 'jwt' HTTP authenticator for realm
'mesos-agent-readonly'
I0801 01:25:42.941058 30160 http.cpp:993] Creating default 'basic' HTTP authenticator for
realm 'mesos-agent-readwrite'
I0801 01:25:42.941151 30160 http.cpp:1014] Creating default 'jwt' HTTP authenticator for realm
'mesos-agent-readwrite'
I0801 01:25:42.942728 30160 slave.cpp:565] Agent resources: [{"name":"cpus","scalar":{"value":2.0},"type":"SCALAR"},{"name":"mem","scalar":{"value":1024.0},"type":"SCALAR"},{"name":"disk","scalar":{"value":1024.0},"type":"SCALAR"},{"name":"ports","ranges":{"range":[{"begin":31000,"end":32000}]},"type":"RANGES"}]
I0801 01:25:42.942956 30160 slave.cpp:573] Agent attributes: [  ]
I0801 01:25:42.942971 30160 slave.cpp:582] Agent hostname: a292b053491a
I0801 01:25:42.943102 30166 status_update_manager.cpp:177] Pausing sending status updates
I0801 01:25:42.944492 30164 state.cpp:64] Recovering state from '/tmp/Endpoint_SlaveEndpointTest_UnauthorizedRequest_2_i9bbKD/meta'
I0801 01:25:42.944759 30157 status_update_manager.cpp:203] Recovering status update manager
I0801 01:25:42.944941 30162 containerizer.cpp:582] Recovering containerizer
I0801 01:25:42.946171 30167 provisioner.cpp:416] Provisioner recovery complete
I0801 01:25:42.946516 30151 slave.cpp:6207] Finished recovery
I0801 01:25:42.947072 30151 slave.cpp:6389] Querying resource estimator for oversubscribable
resources
I0801 01:25:42.947352 30150 slave.cpp:6403] Received oversubscribable resources {} from the
resource estimator
I0801 01:25:42.949781 30155 process.cpp:3836] Handling HTTP event for process 'slave(801)'
with path: '/slave(801)/containers'
I0801 01:25:42.951499 30171 http.cpp:1133] HTTP GET for /slave(801)/containers from 172.17.0.6:55358
I0801 01:25:42.951592 30171 http.cpp:957] Authorizing principal 'test-principal' to GET the
'/containers' endpoint
I0801 01:25:42.953392 30163 slave.cpp:843] Agent terminating
[       OK ] Endpoint/SlaveEndpointTest.UnauthorizedRequest/2 (27 ms)
[ RUN      ] Endpoint/SlaveEndpointTest.NoAuthorizer/0
I0801 01:25:42.966497  9348 containerizer.cpp:230] Using isolation: posix/cpu,posix/mem,filesystem/posix,network/cni,environment_secret
W0801 01:25:42.966998  9348 backend.cpp:76] Failed to create 'aufs' backend: AufsBackend requires
root privileges
W0801 01:25:42.967097  9348 backend.cpp:76] Failed to create 'bind' backend: BindBackend requires
root privileges
I0801 01:25:42.967128  9348 provisioner.cpp:255] Using default backend 'copy'
I0801 01:25:42.968674  9348 cluster.cpp:448] Creating default 'local' authorizer
I0801 01:25:42.970860 30151 slave.cpp:250] Mesos agent started on (802)@172.17.0.6:45102
I0801 01:25:42.970881 30151 slave.cpp:251] Flags at startup: --acls="" --appc_simple_discovery_uri_prefix="http://"
--appc_store_dir="/tmp/Endpoint_SlaveEndpointTest_NoAuthorizer_0_LkczsC/store/appc" --authenticate_http_executors="true"
--authenticate_http_readonly="true" --authenticate_http_readwrite="true" --authenticatee="crammd5"
--authentication_backoff_factor="1secs" --authorizer="local" --cgroups_cpu_enable_pids_and_tids_count="false"
--cgroups_enable_cfs="false" --cgroups_hierarchy="/sys/fs/cgroup" --cgroups_limit_swap="false"
--cgroups_root="mesos" --container_disk_watch_interval="15secs" --containerizers="mesos" --credential="/tmp/Endpoint_SlaveEndpointTest_NoAuthorizer_0_LkczsC/credential"
--default_role="*" --disk_watch_interval="1mins" --docker="docker" --docker_kill_orphans="true"
--docker_registry="https://registry-1.docker.io" --docker_remove_delay="6hrs" --docker_socket="/var/run/docker.sock"
--docker_stop_timeout="0ns" --docker_store_dir="/tmp/Endpoint_SlaveEndpointTest_NoAuthorizer_0_LkczsC/store/docker"
--docker_volume_checkpoint_dir="/var/run/mesos/isolators/docker/volume" --enforce_container_disk_quota="false"
--executor_registration_timeout="1mins" --executor_reregistration_timeout="2secs" --executor_secret_key="/tmp/Endpoint_SlaveEndpointTest_NoAuthorizer_0_LkczsC/executor_secret_key"
--executor_shutdown_grace_period="5secs" --fetcher_cache_dir="/tmp/Endpoint_SlaveEndpointTest_NoAuthorizer_0_LkczsC/fetch"
--fetcher_cache_size="2GB" --frameworks_home="" --gc_delay="1weeks" --gc_disk_headroom="0.1"
--hadoop_home="" --help="false" --hostname_lookup="true" --http_command_executor="false" --http_credentials="/tmp/Endpoint_SlaveEndpointTest_NoAuthorizer_0_LkczsC/http_credentials"
--http_heartbeat_interval="30secs" --initialize_driver_logging="true" --isolation="posix/cpu,posix/mem"
--launcher="posix" --launcher_dir="/mesos/mesos-1.4.0/_build/src" --logbufsecs="0" --logging_level="INFO"
--max_completed_executors_per_framework="150" --oversubscribed_resources_interval="15secs"
--perf_duration="10secs" --perf_interval="1mins" --port="5051" --qos_correction_interval_min="0ns"
--quiet="false" --recover="reconnect" --recovery_timeout="15mins" --registration_backoff_factor="10ms"
--resources="cpus:2;gpus:0;mem:1024;disk:1024;ports:[31000-32000]" --revocable_cpu_low_priority="true"
--runtime_dir="/tmp/Endpoint_SlaveEndpointTest_NoAuthorizer_0_LkczsC" --sandbox_directory="/mnt/mesos/sandbox"
--strict="true" --switch_user="true" --systemd_enable_support="true" --systemd_runtime_directory="/run/systemd/system"
--version="false" --work_dir="/tmp/Endpoint_SlaveEndpointTest_NoAuthorizer_0_tmNtTd"
I0801 01:25:42.971402 30151 credentials.hpp:86] Loading credential for authentication from
'/tmp/Endpoint_SlaveEndpointTest_NoAuthorizer_0_LkczsC/credential'
I0801 01:25:42.971582 30151 slave.cpp:283] Agent using credential for: test-principal
I0801 01:25:42.971603 30151 credentials.hpp:37] Loading credentials for authentication from
'/tmp/Endpoint_SlaveEndpointTest_NoAuthorizer_0_LkczsC/http_credentials'
I0801 01:25:42.971911 30151 http.cpp:993] Creating default 'basic' HTTP authenticator for
realm 'mesos-agent-executor'
I0801 01:25:42.972035 30151 http.cpp:1014] Creating default 'jwt' HTTP authenticator for realm
'mesos-agent-executor'
I0801 01:25:42.972213 30151 http.cpp:993] Creating default 'basic' HTTP authenticator for
realm 'mesos-agent-readonly'
I0801 01:25:42.972290 30151 http.cpp:1014] Creating default 'jwt' HTTP authenticator for realm
'mesos-agent-readonly'
I0801 01:25:42.972425 30151 http.cpp:993] Creating default 'basic' HTTP authenticator for
realm 'mesos-agent-readwrite'
I0801 01:25:42.972501 30151 http.cpp:1014] Creating default 'jwt' HTTP authenticator for realm
'mesos-agent-readwrite'
I0801 01:25:42.973850 30151 slave.cpp:565] Agent resources: [{"name":"cpus","scalar":{"value":2.0},"type":"SCALAR"},{"name":"mem","scalar":{"value":1024.0},"type":"SCALAR"},{"name":"disk","scalar":{"value":1024.0},"type":"SCALAR"},{"name":"ports","ranges":{"range":[{"begin":31000,"end":32000}]},"type":"RANGES"}]
I0801 01:25:42.974086 30151 slave.cpp:573] Agent attributes: [  ]
I0801 01:25:42.974102 30151 slave.cpp:582] Agent hostname: a292b053491a
I0801 01:25:42.974257 30152 status_update_manager.cpp:177] Pausing sending status updates
I0801 01:25:42.975777 30157 state.cpp:64] Recovering state from '/tmp/Endpoint_SlaveEndpointTest_NoAuthorizer_0_tmNtTd/meta'
I0801 01:25:42.976125 30163 status_update_manager.cpp:203] Recovering status update manager
I0801 01:25:42.976305 30158 containerizer.cpp:582] Recovering containerizer
I0801 01:25:42.977649 30159 provisioner.cpp:416] Provisioner recovery complete
I0801 01:25:42.977982 30150 slave.cpp:6207] Finished recovery
I0801 01:25:42.978549 30150 slave.cpp:6389] Querying resource estimator for oversubscribable
resources
I0801 01:25:42.978818 30155 slave.cpp:6403] Received oversubscribable resources {} from the
resource estimator
I0801 01:25:42.981326 30168 process.cpp:3836] Handling HTTP event for process 'slave(802)'
with path: '/slave(802)/monitor/statistics'
I0801 01:25:42.983217 30163 http.cpp:1133] HTTP GET for /slave(802)/monitor/statistics from
172.17.0.6:55360
I0801 01:25:42.983299 30163 http.cpp:957] Authorizing principal 'test-principal' to GET the
'/monitor/statistics' endpoint
I0801 01:25:42.986043 30148 slave.cpp:843] Agent terminating
[       OK ] Endpoint/SlaveEndpointTest.NoAuthorizer/0 (32 ms)
[ RUN      ] Endpoint/SlaveEndpointTest.NoAuthorizer/1
I0801 01:25:42.997340  9348 containerizer.cpp:230] Using isolation: posix/cpu,posix/mem,filesystem/posix,network/cni,environment_secret
W0801 01:25:42.997859  9348 backend.cpp:76] Failed to create 'aufs' backend: AufsBackend requires
root privileges
W0801 01:25:42.997961  9348 backend.cpp:76] Failed to create 'bind' backend: BindBackend requires
root privileges
I0801 01:25:42.997994  9348 provisioner.cpp:255] Using default backend 'copy'
I0801 01:25:42.999585  9348 cluster.cpp:448] Creating default 'local' authorizer
I0801 01:25:43.001222 30160 slave.cpp:250] Mesos agent started on (803)@172.17.0.6:45102
I0801 01:25:43.001242 30160 slave.cpp:251] Flags at startup: --acls="" --appc_simple_discovery_uri_prefix="http://"
--appc_store_dir="/tmp/Endpoint_SlaveEndpointTest_NoAuthorizer_1_gaOgZc/store/appc" --authenticate_http_executors="true"
--authenticate_http_readonly="true" --authenticate_http_readwrite="true" --authenticatee="crammd5"
--authentication_backoff_factor="1secs" --authorizer="local" --cgroups_cpu_enable_pids_and_tids_count="false"
--cgroups_enable_cfs="false" --cgroups_hierarchy="/sys/fs/cgroup" --cgroups_limit_swap="false"
--cgroups_root="mesos" --container_disk_watch_interval="15secs" --containerizers="mesos" --credential="/tmp/Endpoint_SlaveEndpointTest_NoAuthorizer_1_gaOgZc/credential"
--default_role="*" --disk_watch_interval="1mins" --docker="docker" --docker_kill_orphans="true"
--docker_registry="https://registry-1.docker.io" --docker_remove_delay="6hrs" --docker_socket="/var/run/docker.sock"
--docker_stop_timeout="0ns" --docker_store_dir="/tmp/Endpoint_SlaveEndpointTest_NoAuthorizer_1_gaOgZc/store/docker"
--docker_volume_checkpoint_dir="/var/run/mesos/isolators/docker/volume" --enforce_container_disk_quota="false"
--executor_registration_timeout="1mins" --executor_reregistration_timeout="2secs" --executor_secret_key="/tmp/Endpoint_SlaveEndpointTest_NoAuthorizer_1_gaOgZc/executor_secret_key"
--executor_shutdown_grace_period="5secs" --fetcher_cache_dir="/tmp/Endpoint_SlaveEndpointTest_NoAuthorizer_1_gaOgZc/fetch"
--fetcher_cache_size="2GB" --frameworks_home="" --gc_delay="1weeks" --gc_disk_headroom="0.1"
--hadoop_home="" --help="false" --hostname_lookup="true" --http_command_executor="false" --http_credentials="/tmp/Endpoint_SlaveEndpointTest_NoAuthorizer_1_gaOgZc/http_credentials"
--http_heartbeat_interval="30secs" --initialize_driver_logging="true" --isolation="posix/cpu,posix/mem"
--launcher="posix" --launcher_dir="/mesos/mesos-1.4.0/_build/src" --logbufsecs="0" --logging_level="INFO"
--max_completed_executors_per_framework="150" --oversubscribed_resources_interval="15secs"
--perf_duration="10secs" --perf_interval="1mins" --port="5051" --qos_correction_interval_min="0ns"
--quiet="false" --recover="reconnect" --recovery_timeout="15mins" --registration_backoff_factor="10ms"
--resources="cpus:2;gpus:0;mem:1024;disk:1024;ports:[31000-32000]" --revocable_cpu_low_priority="true"
--runtime_dir="/tmp/Endpoint_SlaveEndpointTest_NoAuthorizer_1_gaOgZc" --sandbox_directory="/mnt/mesos/sandbox"
--strict="true" --switch_user="true" --systemd_enable_support="true" --systemd_runtime_directory="/run/systemd/system"
--version="false" --work_dir="/tmp/Endpoint_SlaveEndpointTest_NoAuthorizer_1_1VEplO"
I0801 01:25:43.001610 30160 credentials.hpp:86] Loading credential for authentication from
'/tmp/Endpoint_SlaveEndpointTest_NoAuthorizer_1_gaOgZc/credential'
I0801 01:25:43.001781 30160 slave.cpp:283] Agent using credential for: test-principal
I0801 01:25:43.001802 30160 credentials.hpp:37] Loading credentials for authentication from
'/tmp/Endpoint_SlaveEndpointTest_NoAuthorizer_1_gaOgZc/http_credentials'
I0801 01:25:43.002095 30160 http.cpp:993] Creating default 'basic' HTTP authenticator for
realm 'mesos-agent-executor'
I0801 01:25:43.002246 30160 http.cpp:1014] Creating default 'jwt' HTTP authenticator for realm
'mesos-agent-executor'
I0801 01:25:43.002444 30160 http.cpp:993] Creating default 'basic' HTTP authenticator for
realm 'mesos-agent-readonly'
I0801 01:25:43.002542 30160 http.cpp:1014] Creating default 'jwt' HTTP authenticator for realm
'mesos-agent-readonly'
I0801 01:25:43.002707 30160 http.cpp:993] Creating default 'basic' HTTP authenticator for
realm 'mesos-agent-readwrite'
I0801 01:25:43.002790 30160 http.cpp:1014] Creating default 'jwt' HTTP authenticator for realm
'mesos-agent-readwrite'
I0801 01:25:43.004081 30160 slave.cpp:565] Agent resources: [{"name":"cpus","scalar":{"value":2.0},"type":"SCALAR"},{"name":"mem","scalar":{"value":1024.0},"type":"SCALAR"},{"name":"disk","scalar":{"value":1024.0},"type":"SCALAR"},{"name":"ports","ranges":{"range":[{"begin":31000,"end":32000}]},"type":"RANGES"}]
I0801 01:25:43.004313 30160 slave.cpp:573] Agent attributes: [  ]
I0801 01:25:43.004328 30160 slave.cpp:582] Agent hostname: a292b053491a
I0801 01:25:43.004446 30157 status_update_manager.cpp:177] Pausing sending status updates
I0801 01:25:43.005893 30158 state.cpp:64] Recovering state from '/tmp/Endpoint_SlaveEndpointTest_NoAuthorizer_1_1VEplO/meta'
I0801 01:25:43.006217 30161 status_update_manager.cpp:203] Recovering status update manager
I0801 01:25:43.006469 30170 containerizer.cpp:582] Recovering containerizer
I0801 01:25:43.007891 30167 provisioner.cpp:416] Provisioner recovery complete
I0801 01:25:43.008224 30171 slave.cpp:6207] Finished recovery
I0801 01:25:43.008914 30171 slave.cpp:6389] Querying resource estimator for oversubscribable
resources
I0801 01:25:43.009176 30152 slave.cpp:6403] Received oversubscribable resources {} from the
resource estimator
I0801 01:25:43.011569 30150 process.cpp:3836] Handling HTTP event for process 'slave(803)'
with path: '/slave(803)/monitor/statistics.json'
I0801 01:25:43.013478 30153 http.cpp:1133] HTTP GET for /slave(803)/monitor/statistics.json
from 172.17.0.6:55362
I0801 01:25:43.013578 30153 http.cpp:957] Authorizing principal 'test-principal' to GET the
'/monitor/statistics.json' endpoint
I0801 01:25:43.016486 30171 slave.cpp:843] Agent terminating
[       OK ] Endpoint/SlaveEndpointTest.NoAuthorizer/1 (30 ms)
[ RUN      ] Endpoint/SlaveEndpointTest.NoAuthorizer/2
I0801 01:25:43.027837  9348 containerizer.cpp:230] Using isolation: posix/cpu,posix/mem,filesystem/posix,network/cni,environment_secret
W0801 01:25:43.028365  9348 backend.cpp:76] Failed to create 'aufs' backend: AufsBackend requires
root privileges
W0801 01:25:43.028463  9348 backend.cpp:76] Failed to create 'bind' backend: BindBackend requires
root privileges
I0801 01:25:43.028496  9348 provisioner.cpp:255] Using default backend 'copy'
I0801 01:25:43.030091  9348 cluster.cpp:448] Creating default 'local' authorizer
I0801 01:25:43.031707 30168 slave.cpp:250] Mesos agent started on (804)@172.17.0.6:45102
I0801 01:25:43.031725 30168 slave.cpp:251] Flags at startup: --acls="" --appc_simple_discovery_uri_prefix="http://"
--appc_store_dir="/tmp/Endpoint_SlaveEndpointTest_NoAuthorizer_2_GPb7NN/store/appc" --authenticate_http_executors="true"
--authenticate_http_readonly="true" --authenticate_http_readwrite="true" --authenticatee="crammd5"
--authentication_backoff_factor="1secs" --authorizer="local" --cgroups_cpu_enable_pids_and_tids_count="false"
--cgroups_enable_cfs="false" --cgroups_hierarchy="/sys/fs/cgroup" --cgroups_limit_swap="false"
--cgroups_root="mesos" --container_disk_watch_interval="15secs" --containerizers="mesos" --credential="/tmp/Endpoint_SlaveEndpointTest_NoAuthorizer_2_GPb7NN/credential"
--default_role="*" --disk_watch_interval="1mins" --docker="docker" --docker_kill_orphans="true"
--docker_registry="https://registry-1.docker.io" --docker_remove_delay="6hrs" --docker_socket="/var/run/docker.sock"
--docker_stop_timeout="0ns" --docker_store_dir="/tmp/Endpoint_SlaveEndpointTest_NoAuthorizer_2_GPb7NN/store/docker"
--docker_volume_checkpoint_dir="/var/run/mesos/isolators/docker/volume" --enforce_container_disk_quota="false"
--executor_registration_timeout="1mins" --executor_reregistration_timeout="2secs" --executor_secret_key="/tmp/Endpoint_SlaveEndpointTest_NoAuthorizer_2_GPb7NN/executor_secret_key"
--executor_shutdown_grace_period="5secs" --fetcher_cache_dir="/tmp/Endpoint_SlaveEndpointTest_NoAuthorizer_2_GPb7NN/fetch"
--fetcher_cache_size="2GB" --frameworks_home="" --gc_delay="1weeks" --gc_disk_headroom="0.1"
--hadoop_home="" --help="false" --hostname_lookup="true" --http_command_executor="false" --http_credentials="/tmp/Endpoint_SlaveEndpointTest_NoAuthorizer_2_GPb7NN/http_credentials"
--http_heartbeat_interval="30secs" --initialize_driver_logging="true" --isolation="posix/cpu,posix/mem"
--launcher="posix" --launcher_dir="/mesos/mesos-1.4.0/_build/src" --logbufsecs="0" --logging_level="INFO"
--max_completed_executors_per_framework="150" --oversubscribed_resources_interval="15secs"
--perf_duration="10secs" --perf_interval="1mins" --port="5051" --qos_correction_interval_min="0ns"
--quiet="false" --recover="reconnect" --recovery_timeout="15mins" --registration_backoff_factor="10ms"
--resources="cpus:2;gpus:0;mem:1024;disk:1024;ports:[31000-32000]" --revocable_cpu_low_priority="true"
--runtime_dir="/tmp/Endpoint_SlaveEndpointTest_NoAuthorizer_2_GPb7NN" --sandbox_directory="/mnt/mesos/sandbox"
--strict="true" --switch_user="true" --systemd_enable_support="true" --systemd_runtime_directory="/run/systemd/system"
--version="false" --work_dir="/tmp/Endpoint_SlaveEndpointTest_NoAuthorizer_2_78lI5o"
I0801 01:25:43.032112 30168 credentials.hpp:86] Loading credential for authentication from
'/tmp/Endpoint_SlaveEndpointTest_NoAuthorizer_2_GPb7NN/credential'
I0801 01:25:43.032287 30168 slave.cpp:283] Agent using credential for: test-principal
I0801 01:25:43.032310 30168 credentials.hpp:37] Loading credentials for authentication from
'/tmp/Endpoint_SlaveEndpointTest_NoAuthorizer_2_GPb7NN/http_credentials'
I0801 01:25:43.032593 30168 http.cpp:993] Creating default 'basic' HTTP authenticator for
realm 'mesos-agent-executor'
I0801 01:25:43.032714 30168 http.cpp:1014] Creating default 'jwt' HTTP authenticator for realm
'mesos-agent-executor'
I0801 01:25:43.032897 30168 http.cpp:993] Creating default 'basic' HTTP authenticator for
realm 'mesos-agent-readonly'
I0801 01:25:43.032979 30168 http.cpp:1014] Creating default 'jwt' HTTP authenticator for realm
'mesos-agent-readonly'
I0801 01:25:43.033114 30168 http.cpp:993] Creating default 'basic' HTTP authenticator for
realm 'mesos-agent-readwrite'
I0801 01:25:43.033190 30168 http.cpp:1014] Creating default 'jwt' HTTP authenticator for realm
'mesos-agent-readwrite'
I0801 01:25:43.034567 30168 slave.cpp:565] Agent resources: [{"name":"cpus","scalar":{"value":2.0},"type":"SCALAR"},{"name":"mem","scalar":{"value":1024.0},"type":"SCALAR"},{"name":"disk","scalar":{"value":1024.0},"type":"SCALAR"},{"name":"ports","ranges":{"range":[{"begin":31000,"end":32000}]},"type":"RANGES"}]
I0801 01:25:43.034797 30168 slave.cpp:573] Agent attributes: [  ]
I0801 01:25:43.034813 30168 slave.cpp:582] Agent hostname: a292b053491a
I0801 01:25:43.034957 30152 status_update_manager.cpp:177] Pausing sending status updates
I0801 01:25:43.036526 30166 state.cpp:64] Recovering state from '/tmp/Endpoint_SlaveEndpointTest_NoAuthorizer_2_78lI5o/meta'
I0801 01:25:43.036867 30156 status_update_manager.cpp:203] Recovering status update manager
I0801 01:25:43.037071 30151 containerizer.cpp:582] Recovering containerizer
I0801 01:25:43.038580 30171 provisioner.cpp:416] Provisioner recovery complete
I0801 01:25:43.039065 30155 slave.cpp:6207] Finished recovery
I0801 01:25:43.039659 30155 slave.cpp:6389] Querying resource estimator for oversubscribable
resources
I0801 01:25:43.039899 30157 slave.cpp:6403] Received oversubscribable resources {} from the
resource estimator
I0801 01:25:43.042383 30150 process.cpp:3836] Handling HTTP event for process 'slave(804)'
with path: '/slave(804)/containers'
I0801 01:25:43.044134 30164 http.cpp:1133] HTTP GET for /slave(804)/containers from 172.17.0.6:55366
I0801 01:25:43.044209 30164 http.cpp:957] Authorizing principal 'test-principal' to GET the
'/containers' endpoint
I0801 01:25:43.047516 30148 slave.cpp:843] Agent terminating
[       OK ] Endpoint/SlaveEndpointTest.NoAuthorizer/2 (31 ms)
[----------] 9 tests from Endpoint/SlaveEndpointTest (282 ms total)

[----------] Global test environment tear-down
[==========] 1654 tests from 183 test cases ran. (653884 ms total)
[  PASSED  ] 1649 tests.
[  FAILED  ] 5 tests, listed below:
[  FAILED  ] CommandExecutorCheckTest.CommandCheckDeliveredAndReconciled
[  FAILED  ] DefaultExecutorCheckTest.CommandCheckDeliveredAndReconciled
[  FAILED  ] DefaultExecutorCheckTest.CommandCheckStatusChange
[  FAILED  ] DefaultExecutorCheckTest.CommandCheckSeesParentsEnv
[  FAILED  ] DefaultExecutorCheckTest.CommandCheckSharesWorkDirWithTask

 5 FAILED TESTS
  YOU HAVE 20 DISABLED TESTS

I0801 01:25:43.113409 30172 process.cpp:1006] Failed to accept socket: future discarded
make[4]: *** [check-local] Error 1
make[4]: Leaving directory `/mesos/mesos-1.4.0/_build/src'
make[3]: *** [check-am] Error 2
make[3]: Leaving directory `/mesos/mesos-1.4.0/_build/src'
make[2]: *** [check] Error 2
make[2]: Leaving directory `/mesos/mesos-1.4.0/_build/src'
make[1]: *** [check-recursive] Error 1
make[1]: Leaving directory `/mesos/mesos-1.4.0/_build'
make: *** [distcheck] Error 1
+ docker rmi mesos-1501547944-3454
Untagged: mesos-1501547944-3454:latest
Deleted: sha256:e7df427382f4a393e5fe2ac9985c6e331a95e05ae7140da70d049dda609abdb6
Deleted: sha256:502cfa2604c93a6392dd01395fceb772dd22ef45ac3de9caab9e8628bd729d37
Deleted: sha256:a87d2ab61fb945df5d91b26dbc78719db3731e9d3965344ade4d5a2631fc203e
Deleted: sha256:9e556fe2914e86c18465ff06ae937747484970768742ba6760cdd16feaac8ca1
Deleted: sha256:9fb5727955a9cc5b7c158b124def5ecde6e8a0d18c786e836f4b70a2ed628adb
Deleted: sha256:41e93232c799cb841ede9a48114b5c03a31e921a01c3d69632ff458a4a10c8c7
Deleted: sha256:81b8d6d4a3531f80727d49683878a940a6a586c3dbe49dd43b8d6ed0aca73e76
Deleted: sha256:dafb18734ef64b4aedc55e4723daff9879fad082140923bc376fd7eb116020ce
Deleted: sha256:a5b89dfd4cc3f0fba6c7988569591f9b252dee7b7669d072b7b62d98d5fc84b0
Deleted: sha256:ec604ddc0148dab336870166ad5b617952400b969ed9ad5fd029d3b990d8ffbe
Deleted: sha256:095a65507dbc3210f6418e70ecf2e0d6e53e83b84faafb46578906fbd373ac10
Deleted: sha256:4de1abbd5def99cb9616f3796267fce4f230d9878f2f6199b42eb63586d82fe2
Deleted: sha256:6c592d1ce851cd7c55b73a4f13283375b405815ec991663719867276cdee8614
Deleted: sha256:c2ab533d4ac77c0f9a427ae844f33f968d783555a1b32e355fa58bbc06755e5c
Deleted: sha256:83b364f9c0fd763820002808a638479757148ac019deddd21157f1eb23d55b95
Deleted: sha256:b83fa80f9f9ce9a2afa14a750ae9a2c66e5a0e7e7861fc59b443974f430391d6
Deleted: sha256:5b5252c08e21fdf38d2d88f968f9d03b48c6b1d218f858c215f0faf846a43d4b
Deleted: sha256:d92b1ee26ad7f5768a3cdd4313627ed6c8cc20fedd00efc4ce414eada212d179
Deleted: sha256:c5a66c1ce895c32912087ca386c086d677bde79a69e7e6e35530db184918e373
Deleted: sha256:724a7b5599e62bc5e0c7536d6bfbbe784acb93328b3841a4d35cb30adef97a6e
Deleted: sha256:19a3567c842c1566e851be8d64b1a13e8ea71c35ede5188fce734e33e023a81a
Deleted: sha256:c9ecfb82ed20199dae41e21438b33ddfddc90f03d61a1d821a705cb519784750
Deleted: sha256:2f9959e81c9e436515f7caaf4889f857dbd62f2f64f85cb4ab6a650446056bdb
Deleted: sha256:57d609af9e5a51c6ee75bac81c81a8bae56e282421bda0cf874b8e7e23d93020
Deleted: sha256:f05b7331c9fc9a8be24ff017f0fd10c57a82943b8ebd931d3e63d3cc93639d81
Build step 'Execute shell' marked build as failure
Not sending mail to unregistered user yujie.jay@gmail.com
Not sending mail to unregistered user songzihao1990@gmail.com
Not sending mail to unregistered user xujyan@apple.com

Mime
View raw message