mesos-builds mailing list archives

Site index · List index
Message view « Date » · « Thread »
Top « Date » · « Thread »
From Apache Jenkins Server <jenk...@builds.apache.org>
Subject Build failed in Jenkins: Mesos-Reviewbot #18558
Date Fri, 21 Jul 2017 02:10:25 GMT
See <https://builds.apache.org/job/Mesos-Reviewbot/18558/display/redirect?page=changes>

Changes:

[bmahler] Revert "Removed the optional time window from metrics::Counter."

------------------------------------------
[...truncated 30.15 MB...]
I0721 02:10:18.150365  5024 containerizer.cpp:230] Using isolation: posix/cpu,posix/mem,filesystem/posix,network/cni,environment_secret
W0721 02:10:18.151182  5024 backend.cpp:76] Failed to create 'overlay' backend: OverlayBackend
requires root privileges
W0721 02:10:18.151376  5024 backend.cpp:76] Failed to create 'bind' backend: BindBackend requires
root privileges
I0721 02:10:18.151438  5024 provisioner.cpp:255] Using default backend 'copy'
I0721 02:10:18.156610  5049 slave.cpp:250] Mesos agent started on (792)@172.17.0.2:34569
I0721 02:10:18.156654  5049 slave.cpp:251] Flags at startup: --acls="" --appc_simple_discovery_uri_prefix="http://"
--appc_store_dir="/tmp/Endpoint_SlaveEndpointTest_AuthorizedRequest_2_Ai3vXq/store/appc" --authenticate_http_readonly="true"
--authenticate_http_readwrite="true" --authenticatee="crammd5" --authentication_backoff_factor="1secs"
--authorizer="local" --cgroups_cpu_enable_pids_and_tids_count="false" --cgroups_enable_cfs="false"
--cgroups_hierarchy="/sys/fs/cgroup" --cgroups_limit_swap="false" --cgroups_root="mesos" --container_disk_watch_interval="15secs"
--containerizers="mesos" --credential="/tmp/Endpoint_SlaveEndpointTest_AuthorizedRequest_2_Ai3vXq/credential"
--default_role="*" --disk_watch_interval="1mins" --docker="docker" --docker_kill_orphans="true"
--docker_registry="https://registry-1.docker.io" --docker_remove_delay="6hrs" --docker_socket="/var/run/docker.sock"
--docker_stop_timeout="0ns" --docker_store_dir="/tmp/Endpoint_SlaveEndpointTest_AuthorizedRequest_2_Ai3vXq/store/docker"
--docker_volume_checkpoint_dir="/var/run/mesos/isolators/docker/volume" --enforce_container_disk_quota="false"
--executor_registration_timeout="1mins" --executor_reregistration_timeout="2secs" --executor_shutdown_grace_period="5secs"
--fetcher_cache_dir="/tmp/Endpoint_SlaveEndpointTest_AuthorizedRequest_2_Ai3vXq/fetch" --fetcher_cache_size="2GB"
--frameworks_home="" --gc_delay="1weeks" --gc_disk_headroom="0.1" --hadoop_home="" --help="false"
--hostname_lookup="true" --http_command_executor="false" --http_credentials="/tmp/Endpoint_SlaveEndpointTest_AuthorizedRequest_2_Ai3vXq/http_credentials"
--http_heartbeat_interval="30secs" --initialize_driver_logging="true" --isolation="posix/cpu,posix/mem"
--launcher="posix" --launcher_dir="/mesos/mesos-1.4.0/_build/src" --logbufsecs="0" --logging_level="INFO"
--max_completed_executors_per_framework="150" --oversubscribed_resources_interval="15secs"
--perf_duration="10secs" --perf_interval="1mins" --port="5051" --qos_correction_interval_min="0ns"
--quiet="false" --recover="reconnect" --recovery_timeout="15mins" --registration_backoff_factor="10ms"
--resources="cpus:2;gpus:0;mem:1024;disk:1024;ports:[31000-32000]" --revocable_cpu_low_priority="true"
--runtime_dir="/tmp/Endpoint_SlaveEndpointTest_AuthorizedRequest_2_Ai3vXq" --sandbox_directory="/mnt/mesos/sandbox"
--strict="true" --switch_user="true" --systemd_enable_support="true" --systemd_runtime_directory="/run/systemd/system"
--version="false" --work_dir="/tmp/Endpoint_SlaveEndpointTest_AuthorizedRequest_2_sw4Zo2"
I0721 02:10:18.157472  5049 credentials.hpp:86] Loading credential for authentication from
'/tmp/Endpoint_SlaveEndpointTest_AuthorizedRequest_2_Ai3vXq/credential'
I0721 02:10:18.157886  5049 slave.cpp:283] Agent using credential for: test-principal
I0721 02:10:18.157914  5049 credentials.hpp:37] Loading credentials for authentication from
'/tmp/Endpoint_SlaveEndpointTest_AuthorizedRequest_2_Ai3vXq/http_credentials'
I0721 02:10:18.158401  5049 http.cpp:993] Creating default 'basic' HTTP authenticator for
realm 'mesos-agent-readonly'
I0721 02:10:18.158704  5049 http.cpp:993] Creating default 'basic' HTTP authenticator for
realm 'mesos-agent-readwrite'
I0721 02:10:18.160923  5049 slave.cpp:565] Agent resources: [{"name":"cpus","scalar":{"value":2.0},"type":"SCALAR"},{"name":"mem","scalar":{"value":1024.0},"type":"SCALAR"},{"name":"disk","scalar":{"value":1024.0},"type":"SCALAR"},{"name":"ports","ranges":{"range":[{"begin":31000,"end":32000}]},"type":"RANGES"}]
I0721 02:10:18.161351  5049 slave.cpp:573] Agent attributes: [  ]
I0721 02:10:18.161371  5049 slave.cpp:582] Agent hostname: 85b74d593ae2
I0721 02:10:18.161713  5044 status_update_manager.cpp:177] Pausing sending status updates
I0721 02:10:18.163796  5050 state.cpp:64] Recovering state from '/tmp/Endpoint_SlaveEndpointTest_AuthorizedRequest_2_sw4Zo2/meta'
I0721 02:10:18.164364  5048 status_update_manager.cpp:203] Recovering status update manager
I0721 02:10:18.164625  5045 containerizer.cpp:582] Recovering containerizer
I0721 02:10:18.166623  5043 provisioner.cpp:416] Provisioner recovery complete
I0721 02:10:18.167042  5048 slave.cpp:6207] Finished recovery
I0721 02:10:18.167682  5048 slave.cpp:6389] Querying resource estimator for oversubscribable
resources
I0721 02:10:18.168135  5043 slave.cpp:6403] Received oversubscribable resources {} from the
resource estimator
I0721 02:10:18.172508  5043 process.cpp:3837] Handling HTTP event for process 'slave(792)'
with path: '/slave(792)/containers'
I0721 02:10:18.174588  5045 http.cpp:1133] HTTP GET for /slave(792)/containers from 172.17.0.2:47588
I0721 02:10:18.174726  5045 http.cpp:957] Authorizing principal 'test-principal' to GET the
'/containers' endpoint
I0721 02:10:18.180593  5046 slave.cpp:843] Agent terminating
[       OK ] Endpoint/SlaveEndpointTest.AuthorizedRequest/2 (48 ms)
[ RUN      ] Endpoint/SlaveEndpointTest.UnauthorizedRequest/0
I0721 02:10:18.198576  5024 containerizer.cpp:230] Using isolation: posix/cpu,posix/mem,filesystem/posix,network/cni,environment_secret
W0721 02:10:18.199496  5024 backend.cpp:76] Failed to create 'overlay' backend: OverlayBackend
requires root privileges
W0721 02:10:18.199674  5024 backend.cpp:76] Failed to create 'bind' backend: BindBackend requires
root privileges
I0721 02:10:18.199717  5024 provisioner.cpp:255] Using default backend 'copy'
I0721 02:10:18.205060  5049 slave.cpp:250] Mesos agent started on (793)@172.17.0.2:34569
I0721 02:10:18.205135  5049 slave.cpp:251] Flags at startup: --acls="" --appc_simple_discovery_uri_prefix="http://"
--appc_store_dir="/tmp/Endpoint_SlaveEndpointTest_UnauthorizedRequest_0_m3YQB1/store/appc"
--authenticate_http_readonly="true" --authenticate_http_readwrite="true" --authenticatee="crammd5"
--authentication_backoff_factor="1secs" --authorizer="local" --cgroups_cpu_enable_pids_and_tids_count="false"
--cgroups_enable_cfs="false" --cgroups_hierarchy="/sys/fs/cgroup" --cgroups_limit_swap="false"
--cgroups_root="mesos" --container_disk_watch_interval="15secs" --containerizers="mesos" --credential="/tmp/Endpoint_SlaveEndpointTest_UnauthorizedRequest_0_m3YQB1/credential"
--default_role="*" --disk_watch_interval="1mins" --docker="docker" --docker_kill_orphans="true"
--docker_registry="https://registry-1.docker.io" --docker_remove_delay="6hrs" --docker_socket="/var/run/docker.sock"
--docker_stop_timeout="0ns" --docker_store_dir="/tmp/Endpoint_SlaveEndpointTest_UnauthorizedRequest_0_m3YQB1/store/docker"
--docker_volume_checkpoint_dir="/var/run/mesos/isolators/docker/volume" --enforce_container_disk_quota="false"
--executor_registration_timeout="1mins" --executor_reregistration_timeout="2secs" --executor_shutdown_grace_period="5secs"
--fetcher_cache_dir="/tmp/Endpoint_SlaveEndpointTest_UnauthorizedRequest_0_m3YQB1/fetch" --fetcher_cache_size="2GB"
--frameworks_home="" --gc_delay="1weeks" --gc_disk_headroom="0.1" --hadoop_home="" --help="false"
--hostname_lookup="true" --http_command_executor="false" --http_credentials="/tmp/Endpoint_SlaveEndpointTest_UnauthorizedRequest_0_m3YQB1/http_credentials"
--http_heartbeat_interval="30secs" --initialize_driver_logging="true" --isolation="posix/cpu,posix/mem"
--launcher="posix" --launcher_dir="/mesos/mesos-1.4.0/_build/src" --logbufsecs="0" --logging_level="INFO"
--max_completed_executors_per_framework="150" --oversubscribed_resources_interval="15secs"
--perf_duration="10secs" --perf_interval="1mins" --port="5051" --qos_correction_interval_min="0ns"
--quiet="false" --recover="reconnect" --recovery_timeout="15mins" --registration_backoff_factor="10ms"
--resources="cpus:2;gpus:0;mem:1024;disk:1024;ports:[31000-32000]" --revocable_cpu_low_priority="true"
--runtime_dir="/tmp/Endpoint_SlaveEndpointTest_UnauthorizedRequest_0_m3YQB1" --sandbox_directory="/mnt/mesos/sandbox"
--strict="true" --switch_user="true" --systemd_enable_support="true" --systemd_runtime_directory="/run/systemd/system"
--version="false" --work_dir="/tmp/Endpoint_SlaveEndpointTest_UnauthorizedRequest_0_qpRyVC"
I0721 02:10:18.205885  5049 credentials.hpp:86] Loading credential for authentication from
'/tmp/Endpoint_SlaveEndpointTest_UnauthorizedRequest_0_m3YQB1/credential'
I0721 02:10:18.206176  5049 slave.cpp:283] Agent using credential for: test-principal
I0721 02:10:18.206235  5049 credentials.hpp:37] Loading credentials for authentication from
'/tmp/Endpoint_SlaveEndpointTest_UnauthorizedRequest_0_m3YQB1/http_credentials'
I0721 02:10:18.206642  5049 http.cpp:993] Creating default 'basic' HTTP authenticator for
realm 'mesos-agent-readonly'
I0721 02:10:18.206912  5049 http.cpp:993] Creating default 'basic' HTTP authenticator for
realm 'mesos-agent-readwrite'
I0721 02:10:18.209062  5049 slave.cpp:565] Agent resources: [{"name":"cpus","scalar":{"value":2.0},"type":"SCALAR"},{"name":"mem","scalar":{"value":1024.0},"type":"SCALAR"},{"name":"disk","scalar":{"value":1024.0},"type":"SCALAR"},{"name":"ports","ranges":{"range":[{"begin":31000,"end":32000}]},"type":"RANGES"}]
I0721 02:10:18.209538  5049 slave.cpp:573] Agent attributes: [  ]
I0721 02:10:18.209599  5049 slave.cpp:582] Agent hostname: 85b74d593ae2
I0721 02:10:18.209828  5047 status_update_manager.cpp:177] Pausing sending status updates
I0721 02:10:18.211791  5050 state.cpp:64] Recovering state from '/tmp/Endpoint_SlaveEndpointTest_UnauthorizedRequest_0_qpRyVC/meta'
I0721 02:10:18.212424  5048 status_update_manager.cpp:203] Recovering status update manager
I0721 02:10:18.212785  5048 containerizer.cpp:582] Recovering containerizer
I0721 02:10:18.215301  5043 provisioner.cpp:416] Provisioner recovery complete
I0721 02:10:18.216007  5047 slave.cpp:6207] Finished recovery
I0721 02:10:18.216651  5047 slave.cpp:6389] Querying resource estimator for oversubscribable
resources
I0721 02:10:18.217017  5044 slave.cpp:6403] Received oversubscribable resources {} from the
resource estimator
I0721 02:10:18.221602  5044 process.cpp:3837] Handling HTTP event for process 'slave(793)'
with path: '/slave(793)/monitor/statistics'
I0721 02:10:18.223721  5047 http.cpp:1133] HTTP GET for /slave(793)/monitor/statistics from
172.17.0.2:47590
I0721 02:10:18.223871  5047 http.cpp:957] Authorizing principal 'test-principal' to GET the
'/monitor/statistics' endpoint
I0721 02:10:18.227640  5024 slave.cpp:843] Agent terminating
[       OK ] Endpoint/SlaveEndpointTest.UnauthorizedRequest/0 (44 ms)
[ RUN      ] Endpoint/SlaveEndpointTest.UnauthorizedRequest/1
I0721 02:10:18.243235  5024 containerizer.cpp:230] Using isolation: posix/cpu,posix/mem,filesystem/posix,network/cni,environment_secret
W0721 02:10:18.244009  5024 backend.cpp:76] Failed to create 'overlay' backend: OverlayBackend
requires root privileges
W0721 02:10:18.244173  5024 backend.cpp:76] Failed to create 'bind' backend: BindBackend requires
root privileges
I0721 02:10:18.244213  5024 provisioner.cpp:255] Using default backend 'copy'
I0721 02:10:18.249235  5049 slave.cpp:250] Mesos agent started on (794)@172.17.0.2:34569
I0721 02:10:18.249279  5049 slave.cpp:251] Flags at startup: --acls="" --appc_simple_discovery_uri_prefix="http://"
--appc_store_dir="/tmp/Endpoint_SlaveEndpointTest_UnauthorizedRequest_1_07wVJC/store/appc"
--authenticate_http_readonly="true" --authenticate_http_readwrite="true" --authenticatee="crammd5"
--authentication_backoff_factor="1secs" --authorizer="local" --cgroups_cpu_enable_pids_and_tids_count="false"
--cgroups_enable_cfs="false" --cgroups_hierarchy="/sys/fs/cgroup" --cgroups_limit_swap="false"
--cgroups_root="mesos" --container_disk_watch_interval="15secs" --containerizers="mesos" --credential="/tmp/Endpoint_SlaveEndpointTest_UnauthorizedRequest_1_07wVJC/credential"
--default_role="*" --disk_watch_interval="1mins" --docker="docker" --docker_kill_orphans="true"
--docker_registry="https://registry-1.docker.io" --docker_remove_delay="6hrs" --docker_socket="/var/run/docker.sock"
--docker_stop_timeout="0ns" --docker_store_dir="/tmp/Endpoint_SlaveEndpointTest_UnauthorizedRequest_1_07wVJC/store/docker"
--docker_volume_checkpoint_dir="/var/run/mesos/isolators/docker/volume" --enforce_container_disk_quota="false"
--executor_registration_timeout="1mins" --executor_reregistration_timeout="2secs" --executor_shutdown_grace_period="5secs"
--fetcher_cache_dir="/tmp/Endpoint_SlaveEndpointTest_UnauthorizedRequest_1_07wVJC/fetch" --fetcher_cache_size="2GB"
--frameworks_home="" --gc_delay="1weeks" --gc_disk_headroom="0.1" --hadoop_home="" --help="false"
--hostname_lookup="true" --http_command_executor="false" --http_credentials="/tmp/Endpoint_SlaveEndpointTest_UnauthorizedRequest_1_07wVJC/http_credentials"
--http_heartbeat_interval="30secs" --initialize_driver_logging="true" --isolation="posix/cpu,posix/mem"
--launcher="posix" --launcher_dir="/mesos/mesos-1.4.0/_build/src" --logbufsecs="0" --logging_level="INFO"
--max_completed_executors_per_framework="150" --oversubscribed_resources_interval="15secs"
--perf_duration="10secs" --perf_interval="1mins" --port="5051" --qos_correction_interval_min="0ns"
--quiet="false" --recover="reconnect" --recovery_timeout="15mins" --registration_backoff_factor="10ms"
--resources="cpus:2;gpus:0;mem:1024;disk:1024;ports:[31000-32000]" --revocable_cpu_low_priority="true"
--runtime_dir="/tmp/Endpoint_SlaveEndpointTest_UnauthorizedRequest_1_07wVJC" --sandbox_directory="/mnt/mesos/sandbox"
--strict="true" --switch_user="true" --systemd_enable_support="true" --systemd_runtime_directory="/run/systemd/system"
--version="false" --work_dir="/tmp/Endpoint_SlaveEndpointTest_UnauthorizedRequest_1_OdJmWd"
I0721 02:10:18.250130  5049 credentials.hpp:86] Loading credential for authentication from
'/tmp/Endpoint_SlaveEndpointTest_UnauthorizedRequest_1_07wVJC/credential'
I0721 02:10:18.250393  5049 slave.cpp:283] Agent using credential for: test-principal
I0721 02:10:18.250422  5049 credentials.hpp:37] Loading credentials for authentication from
'/tmp/Endpoint_SlaveEndpointTest_UnauthorizedRequest_1_07wVJC/http_credentials'
I0721 02:10:18.251026  5049 http.cpp:993] Creating default 'basic' HTTP authenticator for
realm 'mesos-agent-readonly'
I0721 02:10:18.251394  5049 http.cpp:993] Creating default 'basic' HTTP authenticator for
realm 'mesos-agent-readwrite'
I0721 02:10:18.253626  5049 slave.cpp:565] Agent resources: [{"name":"cpus","scalar":{"value":2.0},"type":"SCALAR"},{"name":"mem","scalar":{"value":1024.0},"type":"SCALAR"},{"name":"disk","scalar":{"value":1024.0},"type":"SCALAR"},{"name":"ports","ranges":{"range":[{"begin":31000,"end":32000}]},"type":"RANGES"}]
I0721 02:10:18.254087  5049 slave.cpp:573] Agent attributes: [  ]
I0721 02:10:18.254109  5049 slave.cpp:582] Agent hostname: 85b74d593ae2
I0721 02:10:18.254497  5046 status_update_manager.cpp:177] Pausing sending status updates
I0721 02:10:18.256775  5045 state.cpp:64] Recovering state from '/tmp/Endpoint_SlaveEndpointTest_UnauthorizedRequest_1_OdJmWd/meta'
I0721 02:10:18.262605  5049 status_update_manager.cpp:203] Recovering status update manager
I0721 02:10:18.262876  5048 containerizer.cpp:582] Recovering containerizer
I0721 02:10:18.265156  5047 provisioner.cpp:416] Provisioner recovery complete
I0721 02:10:18.265710  5043 slave.cpp:6207] Finished recovery
I0721 02:10:18.266659  5043 slave.cpp:6389] Querying resource estimator for oversubscribable
resources
I0721 02:10:18.267223  5046 slave.cpp:6403] Received oversubscribable resources {} from the
resource estimator
I0721 02:10:18.271677  5046 process.cpp:3837] Handling HTTP event for process 'slave(794)'
with path: '/slave(794)/monitor/statistics.json'
I0721 02:10:18.273609  5050 http.cpp:1133] HTTP GET for /slave(794)/monitor/statistics.json
from 172.17.0.2:47592
I0721 02:10:18.273747  5050 http.cpp:957] Authorizing principal 'test-principal' to GET the
'/monitor/statistics.json' endpoint
I0721 02:10:18.277600  5050 slave.cpp:843] Agent terminating
[       OK ] Endpoint/SlaveEndpointTest.UnauthorizedRequest/1 (50 ms)
[ RUN      ] Endpoint/SlaveEndpointTest.UnauthorizedRequest/2
I0721 02:10:18.293438  5024 containerizer.cpp:230] Using isolation: posix/cpu,posix/mem,filesystem/posix,network/cni,environment_secret
W0721 02:10:18.294217  5024 backend.cpp:76] Failed to create 'overlay' backend: OverlayBackend
requires root privileges
W0721 02:10:18.294378  5024 backend.cpp:76] Failed to create 'bind' backend: BindBackend requires
root privileges
I0721 02:10:18.294420  5024 provisioner.cpp:255] Using default backend 'copy'
I0721 02:10:18.299446  5044 slave.cpp:250] Mesos agent started on (795)@172.17.0.2:34569
I0721 02:10:18.299574  5044 slave.cpp:251] Flags at startup: --acls="" --appc_simple_discovery_uri_prefix="http://"
--appc_store_dir="/tmp/Endpoint_SlaveEndpointTest_UnauthorizedRequest_2_u3avoe/store/appc"
--authenticate_http_readonly="true" --authenticate_http_readwrite="true" --authenticatee="crammd5"
--authentication_backoff_factor="1secs" --authorizer="local" --cgroups_cpu_enable_pids_and_tids_count="false"
--cgroups_enable_cfs="false" --cgroups_hierarchy="/sys/fs/cgroup" --cgroups_limit_swap="false"
--cgroups_root="mesos" --container_disk_watch_interval="15secs" --containerizers="mesos" --credential="/tmp/Endpoint_SlaveEndpointTest_UnauthorizedRequest_2_u3avoe/credential"
--default_role="*" --disk_watch_interval="1mins" --docker="docker" --docker_kill_orphans="true"
--docker_registry="https://registry-1.docker.io" --docker_remove_delay="6hrs" --docker_socket="/var/run/docker.sock"
--docker_stop_timeout="0ns" --docker_store_dir="/tmp/Endpoint_SlaveEndpointTest_UnauthorizedRequest_2_u3avoe/store/docker"
--docker_volume_checkpoint_dir="/var/run/mesos/isolators/docker/volume" --enforce_container_disk_quota="false"
--executor_registration_timeout="1mins" --executor_reregistration_timeout="2secs" --executor_shutdown_grace_period="5secs"
--fetcher_cache_dir="/tmp/Endpoint_SlaveEndpointTest_UnauthorizedRequest_2_u3avoe/fetch" --fetcher_cache_size="2GB"
--frameworks_home="" --gc_delay="1weeks" --gc_disk_headroom="0.1" --hadoop_home="" --help="false"
--hostname_lookup="true" --http_command_executor="false" --http_credentials="/tmp/Endpoint_SlaveEndpointTest_UnauthorizedRequest_2_u3avoe/http_credentials"
--http_heartbeat_interval="30secs" --initialize_driver_logging="true" --isolation="posix/cpu,posix/mem"
--launcher="posix" --launcher_dir="/mesos/mesos-1.4.0/_build/src" --logbufsecs="0" --logging_level="INFO"
--max_completed_executors_per_framework="150" --oversubscribed_resources_interval="15secs"
--perf_duration="10secs" --perf_interval="1mins" --port="5051" --qos_correction_interval_min="0ns"
--quiet="false" --recover="reconnect" --recovery_timeout="15mins" --registration_backoff_factor="10ms"
--resources="cpus:2;gpus:0;mem:1024;disk:1024;ports:[31000-32000]" --revocable_cpu_low_priority="true"
--runtime_dir="/tmp/Endpoint_SlaveEndpointTest_UnauthorizedRequest_2_u3avoe" --sandbox_directory="/mnt/mesos/sandbox"
--strict="true" --switch_user="true" --systemd_enable_support="true" --systemd_runtime_directory="/run/systemd/system"
--version="false" --work_dir="/tmp/Endpoint_SlaveEndpointTest_UnauthorizedRequest_2_CNeOsP"
I0721 02:10:18.300393  5044 credentials.hpp:86] Loading credential for authentication from
'/tmp/Endpoint_SlaveEndpointTest_UnauthorizedRequest_2_u3avoe/credential'
I0721 02:10:18.300694  5044 slave.cpp:283] Agent using credential for: test-principal
I0721 02:10:18.300786  5044 credentials.hpp:37] Loading credentials for authentication from
'/tmp/Endpoint_SlaveEndpointTest_UnauthorizedRequest_2_u3avoe/http_credentials'
I0721 02:10:18.301195  5044 http.cpp:993] Creating default 'basic' HTTP authenticator for
realm 'mesos-agent-readonly'
I0721 02:10:18.301489  5044 http.cpp:993] Creating default 'basic' HTTP authenticator for
realm 'mesos-agent-readwrite'
I0721 02:10:18.303726  5044 slave.cpp:565] Agent resources: [{"name":"cpus","scalar":{"value":2.0},"type":"SCALAR"},{"name":"mem","scalar":{"value":1024.0},"type":"SCALAR"},{"name":"disk","scalar":{"value":1024.0},"type":"SCALAR"},{"name":"ports","ranges":{"range":[{"begin":31000,"end":32000}]},"type":"RANGES"}]
I0721 02:10:18.304308  5044 slave.cpp:573] Agent attributes: [  ]
I0721 02:10:18.304375  5044 slave.cpp:582] Agent hostname: 85b74d593ae2
I0721 02:10:18.304687  5047 status_update_manager.cpp:177] Pausing sending status updates
I0721 02:10:18.306640  5045 state.cpp:64] Recovering state from '/tmp/Endpoint_SlaveEndpointTest_UnauthorizedRequest_2_CNeOsP/meta'
I0721 02:10:18.307205  5048 status_update_manager.cpp:203] Recovering status update manager
I0721 02:10:18.307613  5044 containerizer.cpp:582] Recovering containerizer
I0721 02:10:18.309909  5043 provisioner.cpp:416] Provisioner recovery complete
I0721 02:10:18.310556  5046 slave.cpp:6207] Finished recovery
I0721 02:10:18.311378  5046 slave.cpp:6389] Querying resource estimator for oversubscribable
resources
I0721 02:10:18.311900  5047 slave.cpp:6403] Received oversubscribable resources {} from the
resource estimator
I0721 02:10:18.316308  5044 process.cpp:3837] Handling HTTP event for process 'slave(795)'
with path: '/slave(795)/containers'
I0721 02:10:18.318789  5045 http.cpp:1133] HTTP GET for /slave(795)/containers from 172.17.0.2:47594
I0721 02:10:18.319154  5045 http.cpp:957] Authorizing principal 'test-principal' to GET the
'/containers' endpoint
I0721 02:10:18.322808  5024 slave.cpp:843] Agent terminating
[       OK ] Endpoint/SlaveEndpointTest.UnauthorizedRequest/2 (44 ms)
[ RUN      ] Endpoint/SlaveEndpointTest.NoAuthorizer/0
I0721 02:10:18.338414  5024 containerizer.cpp:230] Using isolation: posix/cpu,posix/mem,filesystem/posix,network/cni,environment_secret
W0721 02:10:18.339162  5024 backend.cpp:76] Failed to create 'overlay' backend: OverlayBackend
requires root privileges
W0721 02:10:18.339320  5024 backend.cpp:76] Failed to create 'bind' backend: BindBackend requires
root privileges
I0721 02:10:18.339361  5024 provisioner.cpp:255] Using default backend 'copy'
I0721 02:10:18.341676  5024 cluster.cpp:448] Creating default 'local' authorizer
I0721 02:10:18.344434  5044 slave.cpp:250] Mesos agent started on (796)@172.17.0.2:34569
I0721 02:10:18.344620  5044 slave.cpp:251] Flags at startup: --acls="" --appc_simple_discovery_uri_prefix="http://"
--appc_store_dir="/tmp/Endpoint_SlaveEndpointTest_NoAuthorizer_0_OhZWvQ/store/appc" --authenticate_http_readonly="true"
--authenticate_http_readwrite="true" --authenticatee="crammd5" --authentication_backoff_factor="1secs"
--authorizer="local" --cgroups_cpu_enable_pids_and_tids_count="false" --cgroups_enable_cfs="false"
--cgroups_hierarchy="/sys/fs/cgroup" --cgroups_limit_swap="false" --cgroups_root="mesos" --container_disk_watch_interval="15secs"
--containerizers="mesos" --credential="/tmp/Endpoint_SlaveEndpointTest_NoAuthorizer_0_OhZWvQ/credential"
--default_role="*" --disk_watch_interval="1mins" --docker="docker" --docker_kill_orphans="true"
--docker_registry="https://registry-1.docker.io" --docker_remove_delay="6hrs" --docker_socket="/var/run/docker.sock"
--docker_stop_timeout="0ns" --docker_store_dir="/tmp/Endpoint_SlaveEndpointTest_NoAuthorizer_0_OhZWvQ/store/docker"
--docker_volume_checkpoint_dir="/var/run/mesos/isolators/docker/volume" --enforce_container_disk_quota="false"
--executor_registration_timeout="1mins" --executor_reregistration_timeout="2secs" --executor_shutdown_grace_period="5secs"
--fetcher_cache_dir="/tmp/Endpoint_SlaveEndpointTest_NoAuthorizer_0_OhZWvQ/fetch" --fetcher_cache_size="2GB"
--frameworks_home="" --gc_delay="1weeks" --gc_disk_headroom="0.1" --hadoop_home="" --help="false"
--hostname_lookup="true" --http_command_executor="false" --http_credentials="/tmp/Endpoint_SlaveEndpointTest_NoAuthorizer_0_OhZWvQ/http_credentials"
--http_heartbeat_interval="30secs" --initialize_driver_logging="true" --isolation="posix/cpu,posix/mem"
--launcher="posix" --launcher_dir="/mesos/mesos-1.4.0/_build/src" --logbufsecs="0" --logging_level="INFO"
--max_completed_executors_per_framework="150" --oversubscribed_resources_interval="15secs"
--perf_duration="10secs" --perf_interval="1mins" --port="5051" --qos_correction_interval_min="0ns"
--quiet="false" --recover="reconnect" --recovery_timeout="15mins" --registration_backoff_factor="10ms"
--resources="cpus:2;gpus:0;mem:1024;disk:1024;ports:[31000-32000]" --revocable_cpu_low_priority="true"
--runtime_dir="/tmp/Endpoint_SlaveEndpointTest_NoAuthorizer_0_OhZWvQ" --sandbox_directory="/mnt/mesos/sandbox"
--strict="true" --switch_user="true" --systemd_enable_support="true" --systemd_runtime_directory="/run/systemd/system"
--version="false" --work_dir="/tmp/Endpoint_SlaveEndpointTest_NoAuthorizer_0_mvT3sr"
I0721 02:10:18.345633  5044 credentials.hpp:86] Loading credential for authentication from
'/tmp/Endpoint_SlaveEndpointTest_NoAuthorizer_0_OhZWvQ/credential'
I0721 02:10:18.345959  5044 slave.cpp:283] Agent using credential for: test-principal
I0721 02:10:18.346052  5044 credentials.hpp:37] Loading credentials for authentication from
'/tmp/Endpoint_SlaveEndpointTest_NoAuthorizer_0_OhZWvQ/http_credentials'
I0721 02:10:18.346465  5044 http.cpp:993] Creating default 'basic' HTTP authenticator for
realm 'mesos-agent-readonly'
I0721 02:10:18.346762  5044 http.cpp:993] Creating default 'basic' HTTP authenticator for
realm 'mesos-agent-readwrite'
I0721 02:10:18.348950  5044 slave.cpp:565] Agent resources: [{"name":"cpus","scalar":{"value":2.0},"type":"SCALAR"},{"name":"mem","scalar":{"value":1024.0},"type":"SCALAR"},{"name":"disk","scalar":{"value":1024.0},"type":"SCALAR"},{"name":"ports","ranges":{"range":[{"begin":31000,"end":32000}]},"type":"RANGES"}]
I0721 02:10:18.349493  5044 slave.cpp:573] Agent attributes: [  ]
I0721 02:10:18.349563  5044 slave.cpp:582] Agent hostname: 85b74d593ae2
I0721 02:10:18.349840  5047 status_update_manager.cpp:177] Pausing sending status updates
I0721 02:10:18.352123  5045 state.cpp:64] Recovering state from '/tmp/Endpoint_SlaveEndpointTest_NoAuthorizer_0_mvT3sr/meta'
I0721 02:10:18.352623  5049 status_update_manager.cpp:203] Recovering status update manager
I0721 02:10:18.352946  5046 containerizer.cpp:582] Recovering containerizer
I0721 02:10:18.355491  5048 provisioner.cpp:416] Provisioner recovery complete
I0721 02:10:18.356112  5043 slave.cpp:6207] Finished recovery
I0721 02:10:18.356721  5043 slave.cpp:6389] Querying resource estimator for oversubscribable
resources
I0721 02:10:18.357379  5048 slave.cpp:6403] Received oversubscribable resources {} from the
resource estimator
I0721 02:10:18.361454  5048 process.cpp:3837] Handling HTTP event for process 'slave(796)'
with path: '/slave(796)/monitor/statistics'
I0721 02:10:18.363431  5043 http.cpp:1133] HTTP GET for /slave(796)/monitor/statistics from
172.17.0.2:47596
I0721 02:10:18.363556  5043 http.cpp:957] Authorizing principal 'test-principal' to GET the
'/monitor/statistics' endpoint
I0721 02:10:18.369035  5048 slave.cpp:843] Agent terminating
[       OK ] Endpoint/SlaveEndpointTest.NoAuthorizer/0 (46 ms)
[ RUN      ] Endpoint/SlaveEndpointTest.NoAuthorizer/1
I0721 02:10:18.384747  5024 containerizer.cpp:230] Using isolation: posix/cpu,posix/mem,filesystem/posix,network/cni,environment_secret
W0721 02:10:18.385512  5024 backend.cpp:76] Failed to create 'overlay' backend: OverlayBackend
requires root privileges
W0721 02:10:18.385681  5024 backend.cpp:76] Failed to create 'bind' backend: BindBackend requires
root privileges
I0721 02:10:18.385726  5024 provisioner.cpp:255] Using default backend 'copy'
I0721 02:10:18.388121  5024 cluster.cpp:448] Creating default 'local' authorizer
I0721 02:10:18.390848  5046 slave.cpp:250] Mesos agent started on (797)@172.17.0.2:34569
I0721 02:10:18.390888  5046 slave.cpp:251] Flags at startup: --acls="" --appc_simple_discovery_uri_prefix="http://"
--appc_store_dir="/tmp/Endpoint_SlaveEndpointTest_NoAuthorizer_1_ihhh7s/store/appc" --authenticate_http_readonly="true"
--authenticate_http_readwrite="true" --authenticatee="crammd5" --authentication_backoff_factor="1secs"
--authorizer="local" --cgroups_cpu_enable_pids_and_tids_count="false" --cgroups_enable_cfs="false"
--cgroups_hierarchy="/sys/fs/cgroup" --cgroups_limit_swap="false" --cgroups_root="mesos" --container_disk_watch_interval="15secs"
--containerizers="mesos" --credential="/tmp/Endpoint_SlaveEndpointTest_NoAuthorizer_1_ihhh7s/credential"
--default_role="*" --disk_watch_interval="1mins" --docker="docker" --docker_kill_orphans="true"
--docker_registry="https://registry-1.docker.io" --docker_remove_delay="6hrs" --docker_socket="/var/run/docker.sock"
--docker_stop_timeout="0ns" --docker_store_dir="/tmp/Endpoint_SlaveEndpointTest_NoAuthorizer_1_ihhh7s/store/docker"
--docker_volume_checkpoint_dir="/var/run/mesos/isolators/docker/volume" --enforce_container_disk_quota="false"
--executor_registration_timeout="1mins" --executor_reregistration_timeout="2secs" --executor_shutdown_grace_period="5secs"
--fetcher_cache_dir="/tmp/Endpoint_SlaveEndpointTest_NoAuthorizer_1_ihhh7s/fetch" --fetcher_cache_size="2GB"
--frameworks_home="" --gc_delay="1weeks" --gc_disk_headroom="0.1" --hadoop_home="" --help="false"
--hostname_lookup="true" --http_command_executor="false" --http_credentials="/tmp/Endpoint_SlaveEndpointTest_NoAuthorizer_1_ihhh7s/http_credentials"
--http_heartbeat_interval="30secs" --initialize_driver_logging="true" --isolation="posix/cpu,posix/mem"
--launcher="posix" --launcher_dir="/mesos/mesos-1.4.0/_build/src" --logbufsecs="0" --logging_level="INFO"
--max_completed_executors_per_framework="150" --oversubscribed_resources_interval="15secs"
--perf_duration="10secs" --perf_interval="1mins" --port="5051" --qos_correction_interval_min="0ns"
--quiet="false" --recover="reconnect" --recovery_timeout="15mins" --registration_backoff_factor="10ms"
--resources="cpus:2;gpus:0;mem:1024;disk:1024;ports:[31000-32000]" --revocable_cpu_low_priority="true"
--runtime_dir="/tmp/Endpoint_SlaveEndpointTest_NoAuthorizer_1_ihhh7s" --sandbox_directory="/mnt/mesos/sandbox"
--strict="true" --switch_user="true" --systemd_enable_support="true" --systemd_runtime_directory="/run/systemd/system"
--version="false" --work_dir="/tmp/Endpoint_SlaveEndpointTest_NoAuthorizer_1_2GmSW3"
I0721 02:10:18.391640  5046 credentials.hpp:86] Loading credential for authentication from
'/tmp/Endpoint_SlaveEndpointTest_NoAuthorizer_1_ihhh7s/credential'
I0721 02:10:18.391914  5046 slave.cpp:283] Agent using credential for: test-principal
I0721 02:10:18.391947  5046 credentials.hpp:37] Loading credentials for authentication from
'/tmp/Endpoint_SlaveEndpointTest_NoAuthorizer_1_ihhh7s/http_credentials'
I0721 02:10:18.392338  5046 http.cpp:993] Creating default 'basic' HTTP authenticator for
realm 'mesos-agent-readonly'
I0721 02:10:18.392576  5046 http.cpp:993] Creating default 'basic' HTTP authenticator for
realm 'mesos-agent-readwrite'
I0721 02:10:18.394783  5046 slave.cpp:565] Agent resources: [{"name":"cpus","scalar":{"value":2.0},"type":"SCALAR"},{"name":"mem","scalar":{"value":1024.0},"type":"SCALAR"},{"name":"disk","scalar":{"value":1024.0},"type":"SCALAR"},{"name":"ports","ranges":{"range":[{"begin":31000,"end":32000}]},"type":"RANGES"}]
I0721 02:10:18.395215  5046 slave.cpp:573] Agent attributes: [  ]
I0721 02:10:18.395236  5046 slave.cpp:582] Agent hostname: 85b74d593ae2
I0721 02:10:18.395534  5045 status_update_manager.cpp:177] Pausing sending status updates
I0721 02:10:18.397347  5049 state.cpp:64] Recovering state from '/tmp/Endpoint_SlaveEndpointTest_NoAuthorizer_1_2GmSW3/meta'
I0721 02:10:18.398042  5047 status_update_manager.cpp:203] Recovering status update manager
I0721 02:10:18.398370  5046 containerizer.cpp:582] Recovering containerizer
I0721 02:10:18.400454  5047 provisioner.cpp:416] Provisioner recovery complete
I0721 02:10:18.400976  5045 slave.cpp:6207] Finished recovery
I0721 02:10:18.401665  5045 slave.cpp:6389] Querying resource estimator for oversubscribable
resources
I0721 02:10:18.402083  5047 slave.cpp:6403] Received oversubscribable resources {} from the
resource estimator
I0721 02:10:18.406327  5049 process.cpp:3837] Handling HTTP event for process 'slave(797)'
with path: '/slave(797)/monitor/statistics.json'
I0721 02:10:18.408459  5047 http.cpp:1133] HTTP GET for /slave(797)/monitor/statistics.json
from 172.17.0.2:47598
I0721 02:10:18.408586  5047 http.cpp:957] Authorizing principal 'test-principal' to GET the
'/monitor/statistics.json' endpoint
I0721 02:10:18.414309  5024 slave.cpp:843] Agent terminating
[       OK ] Endpoint/SlaveEndpointTest.NoAuthorizer/1 (45 ms)
[ RUN      ] Endpoint/SlaveEndpointTest.NoAuthorizer/2
I0721 02:10:18.429951  5024 containerizer.cpp:230] Using isolation: posix/cpu,posix/mem,filesystem/posix,network/cni,environment_secret
W0721 02:10:18.430714  5024 backend.cpp:76] Failed to create 'overlay' backend: OverlayBackend
requires root privileges
W0721 02:10:18.430884  5024 backend.cpp:76] Failed to create 'bind' backend: BindBackend requires
root privileges
I0721 02:10:18.430927  5024 provisioner.cpp:255] Using default backend 'copy'
I0721 02:10:18.433324  5024 cluster.cpp:448] Creating default 'local' authorizer
I0721 02:10:18.436132  5049 slave.cpp:250] Mesos agent started on (798)@172.17.0.2:34569
I0721 02:10:18.436175  5049 slave.cpp:251] Flags at startup: --acls="" --appc_simple_discovery_uri_prefix="http://"
--appc_store_dir="/tmp/Endpoint_SlaveEndpointTest_NoAuthorizer_2_IE8Rb6/store/appc" --authenticate_http_readonly="true"
--authenticate_http_readwrite="true" --authenticatee="crammd5" --authentication_backoff_factor="1secs"
--authorizer="local" --cgroups_cpu_enable_pids_and_tids_count="false" --cgroups_enable_cfs="false"
--cgroups_hierarchy="/sys/fs/cgroup" --cgroups_limit_swap="false" --cgroups_root="mesos" --container_disk_watch_interval="15secs"
--containerizers="mesos" --credential="/tmp/Endpoint_SlaveEndpointTest_NoAuthorizer_2_IE8Rb6/credential"
--default_role="*" --disk_watch_interval="1mins" --docker="docker" --docker_kill_orphans="true"
--docker_registry="https://registry-1.docker.io" --docker_remove_delay="6hrs" --docker_socket="/var/run/docker.sock"
--docker_stop_timeout="0ns" --docker_store_dir="/tmp/Endpoint_SlaveEndpointTest_NoAuthorizer_2_IE8Rb6/store/docker"
--docker_volume_checkpoint_dir="/var/run/mesos/isolators/docker/volume" --enforce_container_disk_quota="false"
--executor_registration_timeout="1mins" --executor_reregistration_timeout="2secs" --executor_shutdown_grace_period="5secs"
--fetcher_cache_dir="/tmp/Endpoint_SlaveEndpointTest_NoAuthorizer_2_IE8Rb6/fetch" --fetcher_cache_size="2GB"
--frameworks_home="" --gc_delay="1weeks" --gc_disk_headroom="0.1" --hadoop_home="" --help="false"
--hostname_lookup="true" --http_command_executor="false" --http_credentials="/tmp/Endpoint_SlaveEndpointTest_NoAuthorizer_2_IE8Rb6/http_credentials"
--http_heartbeat_interval="30secs" --initialize_driver_logging="true" --isolation="posix/cpu,posix/mem"
--launcher="posix" --launcher_dir="/mesos/mesos-1.4.0/_build/src" --logbufsecs="0" --logging_level="INFO"
--max_completed_executors_per_framework="150" --oversubscribed_resources_interval="15secs"
--perf_duration="10secs" --perf_interval="1mins" --port="5051" --qos_correction_interval_min="0ns"
--quiet="false" --recover="reconnect" --recovery_timeout="15mins" --registration_backoff_factor="10ms"
--resources="cpus:2;gpus:0;mem:1024;disk:1024;ports:[31000-32000]" --revocable_cpu_low_priority="true"
--runtime_dir="/tmp/Endpoint_SlaveEndpointTest_NoAuthorizer_2_IE8Rb6" --sandbox_directory="/mnt/mesos/sandbox"
--strict="true" --switch_user="true" --systemd_enable_support="true" --systemd_runtime_directory="/run/systemd/system"
--version="false" --work_dir="/tmp/Endpoint_SlaveEndpointTest_NoAuthorizer_2_mjL8TG"
I0721 02:10:18.437057  5049 credentials.hpp:86] Loading credential for authentication from
'/tmp/Endpoint_SlaveEndpointTest_NoAuthorizer_2_IE8Rb6/credential'
I0721 02:10:18.437520  5049 slave.cpp:283] Agent using credential for: test-principal
I0721 02:10:18.437552  5049 credentials.hpp:37] Loading credentials for authentication from
'/tmp/Endpoint_SlaveEndpointTest_NoAuthorizer_2_IE8Rb6/http_credentials'
I0721 02:10:18.437983  5049 http.cpp:993] Creating default 'basic' HTTP authenticator for
realm 'mesos-agent-readonly'
I0721 02:10:18.438277  5049 http.cpp:993] Creating default 'basic' HTTP authenticator for
realm 'mesos-agent-readwrite'
I0721 02:10:18.440429  5049 slave.cpp:565] Agent resources: [{"name":"cpus","scalar":{"value":2.0},"type":"SCALAR"},{"name":"mem","scalar":{"value":1024.0},"type":"SCALAR"},{"name":"disk","scalar":{"value":1024.0},"type":"SCALAR"},{"name":"ports","ranges":{"range":[{"begin":31000,"end":32000}]},"type":"RANGES"}]
I0721 02:10:18.440856  5049 slave.cpp:573] Agent attributes: [  ]
I0721 02:10:18.440878  5049 slave.cpp:582] Agent hostname: 85b74d593ae2
I0721 02:10:18.441186  5050 status_update_manager.cpp:177] Pausing sending status updates
I0721 02:10:18.443542  5048 state.cpp:64] Recovering state from '/tmp/Endpoint_SlaveEndpointTest_NoAuthorizer_2_mjL8TG/meta'
I0721 02:10:18.444218  5043 status_update_manager.cpp:203] Recovering status update manager
I0721 02:10:18.444488  5044 containerizer.cpp:582] Recovering containerizer
I0721 02:10:18.446779  5043 provisioner.cpp:416] Provisioner recovery complete
I0721 02:10:18.447414  5048 slave.cpp:6207] Finished recovery
I0721 02:10:18.448437  5048 slave.cpp:6389] Querying resource estimator for oversubscribable
resources
I0721 02:10:18.448979  5047 slave.cpp:6403] Received oversubscribable resources {} from the
resource estimator
I0721 02:10:18.453080  5047 process.cpp:3837] Handling HTTP event for process 'slave(798)'
with path: '/slave(798)/containers'
I0721 02:10:18.455309  5044 http.cpp:1133] HTTP GET for /slave(798)/containers from 172.17.0.2:47600
I0721 02:10:18.455442  5044 http.cpp:957] Authorizing principal 'test-principal' to GET the
'/containers' endpoint
I0721 02:10:18.460903  5046 slave.cpp:843] Agent terminating
[       OK ] Endpoint/SlaveEndpointTest.NoAuthorizer/2 (47 ms)
[----------] 9 tests from Endpoint/SlaveEndpointTest (425 ms total)

[----------] Global test environment tear-down
[==========] 1637 tests from 179 test cases ran. (715718 ms total)
[  PASSED  ] 1633 tests.
[  FAILED  ] 4 tests, listed below:
[  FAILED  ] DefaultExecutorCheckTest.CommandCheckDeliveredAndReconciled
[  FAILED  ] DefaultExecutorCheckTest.CommandCheckStatusChange
[  FAILED  ] DefaultExecutorCheckTest.CommandCheckSeesParentsEnv
[  FAILED  ] DefaultExecutorCheckTest.CommandCheckSharesWorkDirWithTask

 4 FAILED TESTS
  YOU HAVE 20 DISABLED TESTS

I0721 02:10:18.601840  5051 process.cpp:1006] Failed to accept socket: future discarded
make[4]: *** [check-local] Error 1
make[4]: Leaving directory `/mesos/mesos-1.4.0/_build/src'
make[3]: *** [check-am] Error 2
make[3]: Leaving directory `/mesos/mesos-1.4.0/_build/src'
make[2]: *** [check] Error 2
make[2]: Leaving directory `/mesos/mesos-1.4.0/_build/src'
make[1]: *** [check-recursive] Error 1
make[1]: Leaving directory `/mesos/mesos-1.4.0/_build'
make: *** [distcheck] Error 1
+ docker rmi mesos-1500597396-30458
Untagged: mesos-1500597396-30458:latest
Deleted: sha256:da1a8049d4725358ac741a541b0bcc65a8cd90e0cbf0d5d4d709d614c95c508a
Deleted: sha256:6d159df91d3a94d7a14f4ef494dd54f2aa8852b0e9afa0e5b76bfd0fef39411f
Deleted: sha256:f17ffd2cadbe9e7bc8ebdf0062faf7fdf0651ef053cf68ff97fc9c3f008ac916
Deleted: sha256:b1a243b4ebf1a8c86d4bf7239d08203ab87dc7832d7f0e27cbedd7e6b60122e6
Deleted: sha256:f81e6dcbb1124e5ed1b763712b7ae545206aa7e9fab16cdd8548c6cb8bb822a0
Deleted: sha256:b91939c6d8440ee3be7460550b89891833434a1992962901cbeeaed7fa03bde2
Deleted: sha256:890a6d8b6ad6899a9373c4c1d5c32582e1ac126b851b8a30e9b3e251335a9cd8
Deleted: sha256:9ca1b47354bb1b9a50c0768e372c782b35a12bb4318acf53d828a3308975d5fb
Deleted: sha256:e1daf5764969834e0d8b884b369e1cb16075060a8c33da846f8285d858d3b0e3
Deleted: sha256:875d442737c3ea8e67b4be0de633d2bfe1367936f710bc749f78ae276bee70e8
Deleted: sha256:97229e7b83648ab2cf32026a8688a20ca9811ca18b4220a42ddceafcc1325468
Deleted: sha256:63c833d78ab9e41c0d0996151671a20e76b886e41f2e4d31d9b48e7f0054b28d
Deleted: sha256:4ac6c910f7772f29891df0d4dd1cf464523760617b4a86e879739d6a3a6fab20
Deleted: sha256:6369bcb909330fe7f597250ddd6eca8132918d7f27d3fcceef071b7bba6d1b84
Deleted: sha256:070b5b8cf2510d24d5b6aa479dd5d135554e4fea7945009f685db46da067ea47
Deleted: sha256:aad5f852279a71b22325acbba82b8c2ef847aeec59856f3ec30f230a46af8c11
Deleted: sha256:04cfd15ade85e7ecf89b6344253f4ed6bac4912215e9ee4efcd26f179250ad94
Deleted: sha256:78a58cf8e670044f3b3bdff9e484c89faeb98e6c082775a60a649a310313ef82
Deleted: sha256:767daf225a9f11b32c2db4eed563c0766abee810808294b4f7b6a94333577a0d
Deleted: sha256:626666131cb397b87d29320778b2b872c22bc6c8d170335c9e714db6c0e17313
Deleted: sha256:d27b88cc3cbadacc662ea6b7450aaf9e2de998e382beb1526ddb1c74cdcddf80
Deleted: sha256:be1530c62b2594969a55f205626315968a85510c81cac9b809138bf997cc44ee
Deleted: sha256:87dba87fb44c0848a88c7e88eb348c935ffc5590eb11db42935ce4d921eec040
Deleted: sha256:dd6ed32fc96dbbd185bd7ac0f6369b0c1c96b0be8cc4982350a0118b4b98fb2a
Build step 'Execute shell' marked build as failure

Mime
View raw message