mesos-builds mailing list archives

Site index · List index
Message view « Date » · « Thread »
Top « Date » · « Thread »
From Apache Jenkins Server <jenk...@builds.apache.org>
Subject Build failed in Jenkins: Mesos-Reviewbot #18487
Date Fri, 14 Jul 2017 00:45:50 GMT
See <https://builds.apache.org/job/Mesos-Reviewbot/18487/display/redirect?page=changes>

Changes:

[bmahler] Updated a stale link to the working groups.

[bmahler] Added the YouTube channel to the working groups documentation.

------------------------------------------
[...truncated 30.05 MB...]
W0714 00:45:43.301882  4980 backend.cpp:76] Failed to create 'overlay' backend: OverlayBackend
requires root privileges
W0714 00:45:43.302145  4980 backend.cpp:76] Failed to create 'bind' backend: BindBackend requires
root privileges
I0714 00:45:43.302337  4980 provisioner.cpp:255] Using default backend 'copy'
I0714 00:45:43.308763  5000 slave.cpp:250] Mesos agent started on (789)@172.17.0.2:35983
I0714 00:45:43.308804  5000 slave.cpp:251] Flags at startup: --acls="" --appc_simple_discovery_uri_prefix="http://"
--appc_store_dir="/tmp/Endpoint_SlaveEndpointTest_AuthorizedRequest_2_kUUKnJ/store/appc" --authenticate_http_readonly="true"
--authenticate_http_readwrite="true" --authenticatee="crammd5" --authentication_backoff_factor="1secs"
--authorizer="local" --cgroups_cpu_enable_pids_and_tids_count="false" --cgroups_enable_cfs="false"
--cgroups_hierarchy="/sys/fs/cgroup" --cgroups_limit_swap="false" --cgroups_root="mesos" --container_disk_watch_interval="15secs"
--containerizers="mesos" --credential="/tmp/Endpoint_SlaveEndpointTest_AuthorizedRequest_2_kUUKnJ/credential"
--default_role="*" --disk_watch_interval="1mins" --docker="docker" --docker_kill_orphans="true"
--docker_registry="https://registry-1.docker.io" --docker_remove_delay="6hrs" --docker_socket="/var/run/docker.sock"
--docker_stop_timeout="0ns" --docker_store_dir="/tmp/Endpoint_SlaveEndpointTest_AuthorizedRequest_2_kUUKnJ/store/docker"
--docker_volume_checkpoint_dir="/var/run/mesos/isolators/docker/volume" --enforce_container_disk_quota="false"
--executor_registration_timeout="1mins" --executor_reregistration_timeout="2secs" --executor_shutdown_grace_period="5secs"
--fetcher_cache_dir="/tmp/Endpoint_SlaveEndpointTest_AuthorizedRequest_2_kUUKnJ/fetch" --fetcher_cache_size="2GB"
--frameworks_home="" --gc_delay="1weeks" --gc_disk_headroom="0.1" --hadoop_home="" --help="false"
--hostname_lookup="true" --http_command_executor="false" --http_credentials="/tmp/Endpoint_SlaveEndpointTest_AuthorizedRequest_2_kUUKnJ/http_credentials"
--http_heartbeat_interval="30secs" --initialize_driver_logging="true" --isolation="posix/cpu,posix/mem"
--launcher="posix" --launcher_dir="/mesos/mesos-1.4.0/_build/src" --logbufsecs="0" --logging_level="INFO"
--max_completed_executors_per_framework="150" --oversubscribed_resources_interval="15secs"
--perf_duration="10secs" --perf_interval="1mins" --port="5051" --qos_correction_interval_min="0ns"
--quiet="false" --recover="reconnect" --recovery_timeout="15mins" --registration_backoff_factor="10ms"
--resources="cpus:2;gpus:0;mem:1024;disk:1024;ports:[31000-32000]" --revocable_cpu_low_priority="true"
--runtime_dir="/tmp/Endpoint_SlaveEndpointTest_AuthorizedRequest_2_kUUKnJ" --sandbox_directory="/mnt/mesos/sandbox"
--strict="true" --switch_user="true" --systemd_enable_support="true" --systemd_runtime_directory="/run/systemd/system"
--version="false" --work_dir="/tmp/Endpoint_SlaveEndpointTest_AuthorizedRequest_2_MuzLvD"
I0714 00:45:43.309767  5000 credentials.hpp:86] Loading credential for authentication from
'/tmp/Endpoint_SlaveEndpointTest_AuthorizedRequest_2_kUUKnJ/credential'
I0714 00:45:43.310295  5000 slave.cpp:283] Agent using credential for: test-principal
I0714 00:45:43.310333  5000 credentials.hpp:37] Loading credentials for authentication from
'/tmp/Endpoint_SlaveEndpointTest_AuthorizedRequest_2_kUUKnJ/http_credentials'
I0714 00:45:43.310842  5000 http.cpp:1009] Creating default 'basic' HTTP authenticator for
realm 'mesos-agent-readonly'
I0714 00:45:43.311216  5000 http.cpp:1009] Creating default 'basic' HTTP authenticator for
realm 'mesos-agent-readwrite'
I0714 00:45:43.313545  5000 slave.cpp:565] Agent resources: [{"name":"cpus","scalar":{"value":2.0},"type":"SCALAR"},{"name":"mem","scalar":{"value":1024.0},"type":"SCALAR"},{"name":"disk","scalar":{"value":1024.0},"type":"SCALAR"},{"name":"ports","ranges":{"range":[{"begin":31000,"end":32000}]},"type":"RANGES"}]
I0714 00:45:43.314010  5000 slave.cpp:573] Agent attributes: [  ]
I0714 00:45:43.314033  5000 slave.cpp:582] Agent hostname: da08c1718c4b
I0714 00:45:43.314991  4999 status_update_manager.cpp:177] Pausing sending status updates
I0714 00:45:43.317066  4999 state.cpp:64] Recovering state from '/tmp/Endpoint_SlaveEndpointTest_AuthorizedRequest_2_MuzLvD/meta'
I0714 00:45:43.317665  5003 status_update_manager.cpp:203] Recovering status update manager
I0714 00:45:43.318027  5002 containerizer.cpp:582] Recovering containerizer
I0714 00:45:43.320722  5006 provisioner.cpp:416] Provisioner recovery complete
I0714 00:45:43.321311  5004 slave.cpp:6229] Finished recovery
I0714 00:45:43.322110  5004 slave.cpp:6411] Querying resource estimator for oversubscribable
resources
I0714 00:45:43.322669  4999 slave.cpp:6425] Received oversubscribable resources {} from the
resource estimator
I0714 00:45:43.326941  5001 process.cpp:3820] Handling HTTP event for process 'slave(789)'
with path: '/slave(789)/containers'
I0714 00:45:43.329056  4999 http.cpp:1149] HTTP GET for /slave(789)/containers from 172.17.0.2:58902
I0714 00:45:43.329288  4999 http.cpp:970] Authorizing principal 'test-principal' to GET the
'/containers' endpoint
I0714 00:45:43.335155  5000 slave.cpp:843] Agent terminating
[       OK ] Endpoint/SlaveEndpointTest.AuthorizedRequest/2 (50 ms)
[ RUN      ] Endpoint/SlaveEndpointTest.UnauthorizedRequest/0
I0714 00:45:43.352250  4980 containerizer.cpp:230] Using isolation: posix/cpu,posix/mem,filesystem/posix,network/cni,environment_secret
W0714 00:45:43.353149  4980 backend.cpp:76] Failed to create 'overlay' backend: OverlayBackend
requires root privileges
W0714 00:45:43.353410  4980 backend.cpp:76] Failed to create 'bind' backend: BindBackend requires
root privileges
I0714 00:45:43.353523  4980 provisioner.cpp:255] Using default backend 'copy'
I0714 00:45:43.359093  5003 slave.cpp:250] Mesos agent started on (790)@172.17.0.2:35983
I0714 00:45:43.359138  5003 slave.cpp:251] Flags at startup: --acls="" --appc_simple_discovery_uri_prefix="http://"
--appc_store_dir="/tmp/Endpoint_SlaveEndpointTest_UnauthorizedRequest_0_ISZpk7/store/appc"
--authenticate_http_readonly="true" --authenticate_http_readwrite="true" --authenticatee="crammd5"
--authentication_backoff_factor="1secs" --authorizer="local" --cgroups_cpu_enable_pids_and_tids_count="false"
--cgroups_enable_cfs="false" --cgroups_hierarchy="/sys/fs/cgroup" --cgroups_limit_swap="false"
--cgroups_root="mesos" --container_disk_watch_interval="15secs" --containerizers="mesos" --credential="/tmp/Endpoint_SlaveEndpointTest_UnauthorizedRequest_0_ISZpk7/credential"
--default_role="*" --disk_watch_interval="1mins" --docker="docker" --docker_kill_orphans="true"
--docker_registry="https://registry-1.docker.io" --docker_remove_delay="6hrs" --docker_socket="/var/run/docker.sock"
--docker_stop_timeout="0ns" --docker_store_dir="/tmp/Endpoint_SlaveEndpointTest_UnauthorizedRequest_0_ISZpk7/store/docker"
--docker_volume_checkpoint_dir="/var/run/mesos/isolators/docker/volume" --enforce_container_disk_quota="false"
--executor_registration_timeout="1mins" --executor_reregistration_timeout="2secs" --executor_shutdown_grace_period="5secs"
--fetcher_cache_dir="/tmp/Endpoint_SlaveEndpointTest_UnauthorizedRequest_0_ISZpk7/fetch" --fetcher_cache_size="2GB"
--frameworks_home="" --gc_delay="1weeks" --gc_disk_headroom="0.1" --hadoop_home="" --help="false"
--hostname_lookup="true" --http_command_executor="false" --http_credentials="/tmp/Endpoint_SlaveEndpointTest_UnauthorizedRequest_0_ISZpk7/http_credentials"
--http_heartbeat_interval="30secs" --initialize_driver_logging="true" --isolation="posix/cpu,posix/mem"
--launcher="posix" --launcher_dir="/mesos/mesos-1.4.0/_build/src" --logbufsecs="0" --logging_level="INFO"
--max_completed_executors_per_framework="150" --oversubscribed_resources_interval="15secs"
--perf_duration="10secs" --perf_interval="1mins" --port="5051" --qos_correction_interval_min="0ns"
--quiet="false" --recover="reconnect" --recovery_timeout="15mins" --registration_backoff_factor="10ms"
--resources="cpus:2;gpus:0;mem:1024;disk:1024;ports:[31000-32000]" --revocable_cpu_low_priority="true"
--runtime_dir="/tmp/Endpoint_SlaveEndpointTest_UnauthorizedRequest_0_ISZpk7" --sandbox_directory="/mnt/mesos/sandbox"
--strict="true" --switch_user="true" --systemd_enable_support="true" --systemd_runtime_directory="/run/systemd/system"
--version="false" --work_dir="/tmp/Endpoint_SlaveEndpointTest_UnauthorizedRequest_0_4Z85j1"
I0714 00:45:43.360257  5003 credentials.hpp:86] Loading credential for authentication from
'/tmp/Endpoint_SlaveEndpointTest_UnauthorizedRequest_0_ISZpk7/credential'
I0714 00:45:43.361682  5003 slave.cpp:283] Agent using credential for: test-principal
I0714 00:45:43.361722  5003 credentials.hpp:37] Loading credentials for authentication from
'/tmp/Endpoint_SlaveEndpointTest_UnauthorizedRequest_0_ISZpk7/http_credentials'
I0714 00:45:43.362277  5003 http.cpp:1009] Creating default 'basic' HTTP authenticator for
realm 'mesos-agent-readonly'
I0714 00:45:43.362524  5003 http.cpp:1009] Creating default 'basic' HTTP authenticator for
realm 'mesos-agent-readwrite'
I0714 00:45:43.364668  5003 slave.cpp:565] Agent resources: [{"name":"cpus","scalar":{"value":2.0},"type":"SCALAR"},{"name":"mem","scalar":{"value":1024.0},"type":"SCALAR"},{"name":"disk","scalar":{"value":1024.0},"type":"SCALAR"},{"name":"ports","ranges":{"range":[{"begin":31000,"end":32000}]},"type":"RANGES"}]
I0714 00:45:43.365100  5003 slave.cpp:573] Agent attributes: [  ]
I0714 00:45:43.365123  5003 slave.cpp:582] Agent hostname: da08c1718c4b
I0714 00:45:43.365456  5005 status_update_manager.cpp:177] Pausing sending status updates
I0714 00:45:43.367987  4999 state.cpp:64] Recovering state from '/tmp/Endpoint_SlaveEndpointTest_UnauthorizedRequest_0_4Z85j1/meta'
I0714 00:45:43.368669  5002 status_update_manager.cpp:203] Recovering status update manager
I0714 00:45:43.369135  5002 containerizer.cpp:582] Recovering containerizer
I0714 00:45:43.372159  5006 provisioner.cpp:416] Provisioner recovery complete
I0714 00:45:43.372864  5006 slave.cpp:6229] Finished recovery
I0714 00:45:43.373778  5006 slave.cpp:6411] Querying resource estimator for oversubscribable
resources
I0714 00:45:43.374506  5003 slave.cpp:6425] Received oversubscribable resources {} from the
resource estimator
I0714 00:45:43.379341  4999 process.cpp:3820] Handling HTTP event for process 'slave(790)'
with path: '/slave(790)/monitor/statistics'
I0714 00:45:43.381409  4999 http.cpp:1149] HTTP GET for /slave(790)/monitor/statistics from
172.17.0.2:58904
I0714 00:45:43.381646  4999 http.cpp:970] Authorizing principal 'test-principal' to GET the
'/monitor/statistics' endpoint
I0714 00:45:43.385313  5001 slave.cpp:843] Agent terminating
[       OK ] Endpoint/SlaveEndpointTest.UnauthorizedRequest/0 (49 ms)
[ RUN      ] Endpoint/SlaveEndpointTest.UnauthorizedRequest/1
I0714 00:45:43.400960  4980 containerizer.cpp:230] Using isolation: posix/cpu,posix/mem,filesystem/posix,network/cni,environment_secret
W0714 00:45:43.401849  4980 backend.cpp:76] Failed to create 'overlay' backend: OverlayBackend
requires root privileges
W0714 00:45:43.402107  4980 backend.cpp:76] Failed to create 'bind' backend: BindBackend requires
root privileges
I0714 00:45:43.402241  4980 provisioner.cpp:255] Using default backend 'copy'
I0714 00:45:43.407938  5003 slave.cpp:250] Mesos agent started on (791)@172.17.0.2:35983
I0714 00:45:43.407979  5003 slave.cpp:251] Flags at startup: --acls="" --appc_simple_discovery_uri_prefix="http://"
--appc_store_dir="/tmp/Endpoint_SlaveEndpointTest_UnauthorizedRequest_1_qjSzNv/store/appc"
--authenticate_http_readonly="true" --authenticate_http_readwrite="true" --authenticatee="crammd5"
--authentication_backoff_factor="1secs" --authorizer="local" --cgroups_cpu_enable_pids_and_tids_count="false"
--cgroups_enable_cfs="false" --cgroups_hierarchy="/sys/fs/cgroup" --cgroups_limit_swap="false"
--cgroups_root="mesos" --container_disk_watch_interval="15secs" --containerizers="mesos" --credential="/tmp/Endpoint_SlaveEndpointTest_UnauthorizedRequest_1_qjSzNv/credential"
--default_role="*" --disk_watch_interval="1mins" --docker="docker" --docker_kill_orphans="true"
--docker_registry="https://registry-1.docker.io" --docker_remove_delay="6hrs" --docker_socket="/var/run/docker.sock"
--docker_stop_timeout="0ns" --docker_store_dir="/tmp/Endpoint_SlaveEndpointTest_UnauthorizedRequest_1_qjSzNv/store/docker"
--docker_volume_checkpoint_dir="/var/run/mesos/isolators/docker/volume" --enforce_container_disk_quota="false"
--executor_registration_timeout="1mins" --executor_reregistration_timeout="2secs" --executor_shutdown_grace_period="5secs"
--fetcher_cache_dir="/tmp/Endpoint_SlaveEndpointTest_UnauthorizedRequest_1_qjSzNv/fetch" --fetcher_cache_size="2GB"
--frameworks_home="" --gc_delay="1weeks" --gc_disk_headroom="0.1" --hadoop_home="" --help="false"
--hostname_lookup="true" --http_command_executor="false" --http_credentials="/tmp/Endpoint_SlaveEndpointTest_UnauthorizedRequest_1_qjSzNv/http_credentials"
--http_heartbeat_interval="30secs" --initialize_driver_logging="true" --isolation="posix/cpu,posix/mem"
--launcher="posix" --launcher_dir="/mesos/mesos-1.4.0/_build/src" --logbufsecs="0" --logging_level="INFO"
--max_completed_executors_per_framework="150" --oversubscribed_resources_interval="15secs"
--perf_duration="10secs" --perf_interval="1mins" --port="5051" --qos_correction_interval_min="0ns"
--quiet="false" --recover="reconnect" --recovery_timeout="15mins" --registration_backoff_factor="10ms"
--resources="cpus:2;gpus:0;mem:1024;disk:1024;ports:[31000-32000]" --revocable_cpu_low_priority="true"
--runtime_dir="/tmp/Endpoint_SlaveEndpointTest_UnauthorizedRequest_1_qjSzNv" --sandbox_directory="/mnt/mesos/sandbox"
--strict="true" --switch_user="true" --systemd_enable_support="true" --systemd_runtime_directory="/run/systemd/system"
--version="false" --work_dir="/tmp/Endpoint_SlaveEndpointTest_UnauthorizedRequest_1_eNtdFp"
I0714 00:45:43.408718  5003 credentials.hpp:86] Loading credential for authentication from
'/tmp/Endpoint_SlaveEndpointTest_UnauthorizedRequest_1_qjSzNv/credential'
I0714 00:45:43.408964  5003 slave.cpp:283] Agent using credential for: test-principal
I0714 00:45:43.408987  5003 credentials.hpp:37] Loading credentials for authentication from
'/tmp/Endpoint_SlaveEndpointTest_UnauthorizedRequest_1_qjSzNv/http_credentials'
I0714 00:45:43.409544  5003 http.cpp:1009] Creating default 'basic' HTTP authenticator for
realm 'mesos-agent-readonly'
I0714 00:45:43.409771  5003 http.cpp:1009] Creating default 'basic' HTTP authenticator for
realm 'mesos-agent-readwrite'
I0714 00:45:43.412130  5003 slave.cpp:565] Agent resources: [{"name":"cpus","scalar":{"value":2.0},"type":"SCALAR"},{"name":"mem","scalar":{"value":1024.0},"type":"SCALAR"},{"name":"disk","scalar":{"value":1024.0},"type":"SCALAR"},{"name":"ports","ranges":{"range":[{"begin":31000,"end":32000}]},"type":"RANGES"}]
I0714 00:45:43.412595  5003 slave.cpp:573] Agent attributes: [  ]
I0714 00:45:43.412614  5003 slave.cpp:582] Agent hostname: da08c1718c4b
I0714 00:45:43.413115  5005 status_update_manager.cpp:177] Pausing sending status updates
I0714 00:45:43.415158  5001 state.cpp:64] Recovering state from '/tmp/Endpoint_SlaveEndpointTest_UnauthorizedRequest_1_eNtdFp/meta'
I0714 00:45:43.415843  5005 status_update_manager.cpp:203] Recovering status update manager
I0714 00:45:43.416221  5000 containerizer.cpp:582] Recovering containerizer
I0714 00:45:43.418517  5005 provisioner.cpp:416] Provisioner recovery complete
I0714 00:45:43.419507  5006 slave.cpp:6229] Finished recovery
I0714 00:45:43.420341  5006 slave.cpp:6411] Querying resource estimator for oversubscribable
resources
I0714 00:45:43.420943  5000 slave.cpp:6425] Received oversubscribable resources {} from the
resource estimator
I0714 00:45:43.425233  5006 process.cpp:3820] Handling HTTP event for process 'slave(791)'
with path: '/slave(791)/monitor/statistics.json'
I0714 00:45:43.427126  5006 http.cpp:1149] HTTP GET for /slave(791)/monitor/statistics.json
from 172.17.0.2:58906
I0714 00:45:43.427245  5006 http.cpp:970] Authorizing principal 'test-principal' to GET the
'/monitor/statistics.json' endpoint
I0714 00:45:43.430435  4999 slave.cpp:843] Agent terminating
[       OK ] Endpoint/SlaveEndpointTest.UnauthorizedRequest/1 (47 ms)
[ RUN      ] Endpoint/SlaveEndpointTest.UnauthorizedRequest/2
I0714 00:45:43.448474  4980 containerizer.cpp:230] Using isolation: posix/cpu,posix/mem,filesystem/posix,network/cni,environment_secret
W0714 00:45:43.449362  4980 backend.cpp:76] Failed to create 'overlay' backend: OverlayBackend
requires root privileges
W0714 00:45:43.449645  4980 backend.cpp:76] Failed to create 'bind' backend: BindBackend requires
root privileges
I0714 00:45:43.449714  4980 provisioner.cpp:255] Using default backend 'copy'
I0714 00:45:43.456400  5004 slave.cpp:250] Mesos agent started on (792)@172.17.0.2:35983
I0714 00:45:43.456444  5004 slave.cpp:251] Flags at startup: --acls="" --appc_simple_discovery_uri_prefix="http://"
--appc_store_dir="/tmp/Endpoint_SlaveEndpointTest_UnauthorizedRequest_2_kQ6iLU/store/appc"
--authenticate_http_readonly="true" --authenticate_http_readwrite="true" --authenticatee="crammd5"
--authentication_backoff_factor="1secs" --authorizer="local" --cgroups_cpu_enable_pids_and_tids_count="false"
--cgroups_enable_cfs="false" --cgroups_hierarchy="/sys/fs/cgroup" --cgroups_limit_swap="false"
--cgroups_root="mesos" --container_disk_watch_interval="15secs" --containerizers="mesos" --credential="/tmp/Endpoint_SlaveEndpointTest_UnauthorizedRequest_2_kQ6iLU/credential"
--default_role="*" --disk_watch_interval="1mins" --docker="docker" --docker_kill_orphans="true"
--docker_registry="https://registry-1.docker.io" --docker_remove_delay="6hrs" --docker_socket="/var/run/docker.sock"
--docker_stop_timeout="0ns" --docker_store_dir="/tmp/Endpoint_SlaveEndpointTest_UnauthorizedRequest_2_kQ6iLU/store/docker"
--docker_volume_checkpoint_dir="/var/run/mesos/isolators/docker/volume" --enforce_container_disk_quota="false"
--executor_registration_timeout="1mins" --executor_reregistration_timeout="2secs" --executor_shutdown_grace_period="5secs"
--fetcher_cache_dir="/tmp/Endpoint_SlaveEndpointTest_UnauthorizedRequest_2_kQ6iLU/fetch" --fetcher_cache_size="2GB"
--frameworks_home="" --gc_delay="1weeks" --gc_disk_headroom="0.1" --hadoop_home="" --help="false"
--hostname_lookup="true" --http_command_executor="false" --http_credentials="/tmp/Endpoint_SlaveEndpointTest_UnauthorizedRequest_2_kQ6iLU/http_credentials"
--http_heartbeat_interval="30secs" --initialize_driver_logging="true" --isolation="posix/cpu,posix/mem"
--launcher="posix" --launcher_dir="/mesos/mesos-1.4.0/_build/src" --logbufsecs="0" --logging_level="INFO"
--max_completed_executors_per_framework="150" --oversubscribed_resources_interval="15secs"
--perf_duration="10secs" --perf_interval="1mins" --port="5051" --qos_correction_interval_min="0ns"
--quiet="false" --recover="reconnect" --recovery_timeout="15mins" --registration_backoff_factor="10ms"
--resources="cpus:2;gpus:0;mem:1024;disk:1024;ports:[31000-32000]" --revocable_cpu_low_priority="true"
--runtime_dir="/tmp/Endpoint_SlaveEndpointTest_UnauthorizedRequest_2_kQ6iLU" --sandbox_directory="/mnt/mesos/sandbox"
--strict="true" --switch_user="true" --systemd_enable_support="true" --systemd_runtime_directory="/run/systemd/system"
--version="false" --work_dir="/tmp/Endpoint_SlaveEndpointTest_UnauthorizedRequest_2_MAWgvO"
I0714 00:45:43.457494  5004 credentials.hpp:86] Loading credential for authentication from
'/tmp/Endpoint_SlaveEndpointTest_UnauthorizedRequest_2_kQ6iLU/credential'
I0714 00:45:43.458000  5004 slave.cpp:283] Agent using credential for: test-principal
I0714 00:45:43.458035  5004 credentials.hpp:37] Loading credentials for authentication from
'/tmp/Endpoint_SlaveEndpointTest_UnauthorizedRequest_2_kQ6iLU/http_credentials'
I0714 00:45:43.458533  5004 http.cpp:1009] Creating default 'basic' HTTP authenticator for
realm 'mesos-agent-readonly'
I0714 00:45:43.458950  5004 http.cpp:1009] Creating default 'basic' HTTP authenticator for
realm 'mesos-agent-readwrite'
I0714 00:45:43.461359  5004 slave.cpp:565] Agent resources: [{"name":"cpus","scalar":{"value":2.0},"type":"SCALAR"},{"name":"mem","scalar":{"value":1024.0},"type":"SCALAR"},{"name":"disk","scalar":{"value":1024.0},"type":"SCALAR"},{"name":"ports","ranges":{"range":[{"begin":31000,"end":32000}]},"type":"RANGES"}]
I0714 00:45:43.461793  5004 slave.cpp:573] Agent attributes: [  ]
I0714 00:45:43.461815  5004 slave.cpp:582] Agent hostname: da08c1718c4b
I0714 00:45:43.462281  4999 status_update_manager.cpp:177] Pausing sending status updates
I0714 00:45:43.464483  4999 state.cpp:64] Recovering state from '/tmp/Endpoint_SlaveEndpointTest_UnauthorizedRequest_2_MAWgvO/meta'
I0714 00:45:43.465131  5006 status_update_manager.cpp:203] Recovering status update manager
I0714 00:45:43.465428  4999 containerizer.cpp:582] Recovering containerizer
I0714 00:45:43.467552  4999 provisioner.cpp:416] Provisioner recovery complete
I0714 00:45:43.468304  5002 slave.cpp:6229] Finished recovery
I0714 00:45:43.469076  5002 slave.cpp:6411] Querying resource estimator for oversubscribable
resources
I0714 00:45:43.469758  5002 slave.cpp:6425] Received oversubscribable resources {} from the
resource estimator
I0714 00:45:43.473867  5001 process.cpp:3820] Handling HTTP event for process 'slave(792)'
with path: '/slave(792)/containers'
I0714 00:45:43.475821  5000 http.cpp:1149] HTTP GET for /slave(792)/containers from 172.17.0.2:58908
I0714 00:45:43.475947  5000 http.cpp:970] Authorizing principal 'test-principal' to GET the
'/containers' endpoint
I0714 00:45:43.480778  5005 slave.cpp:843] Agent terminating
[       OK ] Endpoint/SlaveEndpointTest.UnauthorizedRequest/2 (48 ms)
[ RUN      ] Endpoint/SlaveEndpointTest.NoAuthorizer/0
I0714 00:45:43.497026  4980 containerizer.cpp:230] Using isolation: posix/cpu,posix/mem,filesystem/posix,network/cni,environment_secret
W0714 00:45:43.497923  4980 backend.cpp:76] Failed to create 'overlay' backend: OverlayBackend
requires root privileges
W0714 00:45:43.498183  4980 backend.cpp:76] Failed to create 'bind' backend: BindBackend requires
root privileges
I0714 00:45:43.498314  4980 provisioner.cpp:255] Using default backend 'copy'
I0714 00:45:43.501013  4980 cluster.cpp:448] Creating default 'local' authorizer
I0714 00:45:43.505177  5001 slave.cpp:250] Mesos agent started on (793)@172.17.0.2:35983
I0714 00:45:43.505219  5001 slave.cpp:251] Flags at startup: --acls="" --appc_simple_discovery_uri_prefix="http://"
--appc_store_dir="/tmp/Endpoint_SlaveEndpointTest_NoAuthorizer_0_YkInek/store/appc" --authenticate_http_readonly="true"
--authenticate_http_readwrite="true" --authenticatee="crammd5" --authentication_backoff_factor="1secs"
--authorizer="local" --cgroups_cpu_enable_pids_and_tids_count="false" --cgroups_enable_cfs="false"
--cgroups_hierarchy="/sys/fs/cgroup" --cgroups_limit_swap="false" --cgroups_root="mesos" --container_disk_watch_interval="15secs"
--containerizers="mesos" --credential="/tmp/Endpoint_SlaveEndpointTest_NoAuthorizer_0_YkInek/credential"
--default_role="*" --disk_watch_interval="1mins" --docker="docker" --docker_kill_orphans="true"
--docker_registry="https://registry-1.docker.io" --docker_remove_delay="6hrs" --docker_socket="/var/run/docker.sock"
--docker_stop_timeout="0ns" --docker_store_dir="/tmp/Endpoint_SlaveEndpointTest_NoAuthorizer_0_YkInek/store/docker"
--docker_volume_checkpoint_dir="/var/run/mesos/isolators/docker/volume" --enforce_container_disk_quota="false"
--executor_registration_timeout="1mins" --executor_reregistration_timeout="2secs" --executor_shutdown_grace_period="5secs"
--fetcher_cache_dir="/tmp/Endpoint_SlaveEndpointTest_NoAuthorizer_0_YkInek/fetch" --fetcher_cache_size="2GB"
--frameworks_home="" --gc_delay="1weeks" --gc_disk_headroom="0.1" --hadoop_home="" --help="false"
--hostname_lookup="true" --http_command_executor="false" --http_credentials="/tmp/Endpoint_SlaveEndpointTest_NoAuthorizer_0_YkInek/http_credentials"
--http_heartbeat_interval="30secs" --initialize_driver_logging="true" --isolation="posix/cpu,posix/mem"
--launcher="posix" --launcher_dir="/mesos/mesos-1.4.0/_build/src" --logbufsecs="0" --logging_level="INFO"
--max_completed_executors_per_framework="150" --oversubscribed_resources_interval="15secs"
--perf_duration="10secs" --perf_interval="1mins" --port="5051" --qos_correction_interval_min="0ns"
--quiet="false" --recover="reconnect" --recovery_timeout="15mins" --registration_backoff_factor="10ms"
--resources="cpus:2;gpus:0;mem:1024;disk:1024;ports:[31000-32000]" --revocable_cpu_low_priority="true"
--runtime_dir="/tmp/Endpoint_SlaveEndpointTest_NoAuthorizer_0_YkInek" --sandbox_directory="/mnt/mesos/sandbox"
--strict="true" --switch_user="true" --systemd_enable_support="true" --systemd_runtime_directory="/run/systemd/system"
--version="false" --work_dir="/tmp/Endpoint_SlaveEndpointTest_NoAuthorizer_0_ylgxQd"
I0714 00:45:43.506172  5001 credentials.hpp:86] Loading credential for authentication from
'/tmp/Endpoint_SlaveEndpointTest_NoAuthorizer_0_YkInek/credential'
I0714 00:45:43.506533  5001 slave.cpp:283] Agent using credential for: test-principal
I0714 00:45:43.506567  5001 credentials.hpp:37] Loading credentials for authentication from
'/tmp/Endpoint_SlaveEndpointTest_NoAuthorizer_0_YkInek/http_credentials'
I0714 00:45:43.507024  5001 http.cpp:1009] Creating default 'basic' HTTP authenticator for
realm 'mesos-agent-readonly'
I0714 00:45:43.507342  5001 http.cpp:1009] Creating default 'basic' HTTP authenticator for
realm 'mesos-agent-readwrite'
I0714 00:45:43.509713  5001 slave.cpp:565] Agent resources: [{"name":"cpus","scalar":{"value":2.0},"type":"SCALAR"},{"name":"mem","scalar":{"value":1024.0},"type":"SCALAR"},{"name":"disk","scalar":{"value":1024.0},"type":"SCALAR"},{"name":"ports","ranges":{"range":[{"begin":31000,"end":32000}]},"type":"RANGES"}]
I0714 00:45:43.510149  5001 slave.cpp:573] Agent attributes: [  ]
I0714 00:45:43.510242  5001 slave.cpp:582] Agent hostname: da08c1718c4b
I0714 00:45:43.510586  4999 status_update_manager.cpp:177] Pausing sending status updates
I0714 00:45:43.512625  5004 state.cpp:64] Recovering state from '/tmp/Endpoint_SlaveEndpointTest_NoAuthorizer_0_ylgxQd/meta'
I0714 00:45:43.513394  4999 status_update_manager.cpp:203] Recovering status update manager
I0714 00:45:43.513723  4999 containerizer.cpp:582] Recovering containerizer
I0714 00:45:43.515928  5005 provisioner.cpp:416] Provisioner recovery complete
I0714 00:45:43.516657  5003 slave.cpp:6229] Finished recovery
I0714 00:45:43.517292  5003 slave.cpp:6411] Querying resource estimator for oversubscribable
resources
I0714 00:45:43.517680  5004 slave.cpp:6425] Received oversubscribable resources {} from the
resource estimator
I0714 00:45:43.522215  5002 process.cpp:3820] Handling HTTP event for process 'slave(793)'
with path: '/slave(793)/monitor/statistics'
I0714 00:45:43.524771  5002 http.cpp:1149] HTTP GET for /slave(793)/monitor/statistics from
172.17.0.2:58910
I0714 00:45:43.524984  5002 http.cpp:970] Authorizing principal 'test-principal' to GET the
'/monitor/statistics' endpoint
I0714 00:45:43.530674  5004 slave.cpp:843] Agent terminating
[       OK ] Endpoint/SlaveEndpointTest.NoAuthorizer/0 (50 ms)
[ RUN      ] Endpoint/SlaveEndpointTest.NoAuthorizer/1
I0714 00:45:43.547075  4980 containerizer.cpp:230] Using isolation: posix/cpu,posix/mem,filesystem/posix,network/cni,environment_secret
W0714 00:45:43.547965  4980 backend.cpp:76] Failed to create 'overlay' backend: OverlayBackend
requires root privileges
W0714 00:45:43.548226  4980 backend.cpp:76] Failed to create 'bind' backend: BindBackend requires
root privileges
I0714 00:45:43.548359  4980 provisioner.cpp:255] Using default backend 'copy'
I0714 00:45:43.551033  4980 cluster.cpp:448] Creating default 'local' authorizer
I0714 00:45:43.554009  5004 slave.cpp:250] Mesos agent started on (794)@172.17.0.2:35983
I0714 00:45:43.554051  5004 slave.cpp:251] Flags at startup: --acls="" --appc_simple_discovery_uri_prefix="http://"
--appc_store_dir="/tmp/Endpoint_SlaveEndpointTest_NoAuthorizer_1_45yvdK/store/appc" --authenticate_http_readonly="true"
--authenticate_http_readwrite="true" --authenticatee="crammd5" --authentication_backoff_factor="1secs"
--authorizer="local" --cgroups_cpu_enable_pids_and_tids_count="false" --cgroups_enable_cfs="false"
--cgroups_hierarchy="/sys/fs/cgroup" --cgroups_limit_swap="false" --cgroups_root="mesos" --container_disk_watch_interval="15secs"
--containerizers="mesos" --credential="/tmp/Endpoint_SlaveEndpointTest_NoAuthorizer_1_45yvdK/credential"
--default_role="*" --disk_watch_interval="1mins" --docker="docker" --docker_kill_orphans="true"
--docker_registry="https://registry-1.docker.io" --docker_remove_delay="6hrs" --docker_socket="/var/run/docker.sock"
--docker_stop_timeout="0ns" --docker_store_dir="/tmp/Endpoint_SlaveEndpointTest_NoAuthorizer_1_45yvdK/store/docker"
--docker_volume_checkpoint_dir="/var/run/mesos/isolators/docker/volume" --enforce_container_disk_quota="false"
--executor_registration_timeout="1mins" --executor_reregistration_timeout="2secs" --executor_shutdown_grace_period="5secs"
--fetcher_cache_dir="/tmp/Endpoint_SlaveEndpointTest_NoAuthorizer_1_45yvdK/fetch" --fetcher_cache_size="2GB"
--frameworks_home="" --gc_delay="1weeks" --gc_disk_headroom="0.1" --hadoop_home="" --help="false"
--hostname_lookup="true" --http_command_executor="false" --http_credentials="/tmp/Endpoint_SlaveEndpointTest_NoAuthorizer_1_45yvdK/http_credentials"
--http_heartbeat_interval="30secs" --initialize_driver_logging="true" --isolation="posix/cpu,posix/mem"
--launcher="posix" --launcher_dir="/mesos/mesos-1.4.0/_build/src" --logbufsecs="0" --logging_level="INFO"
--max_completed_executors_per_framework="150" --oversubscribed_resources_interval="15secs"
--perf_duration="10secs" --perf_interval="1mins" --port="5051" --qos_correction_interval_min="0ns"
--quiet="false" --recover="reconnect" --recovery_timeout="15mins" --registration_backoff_factor="10ms"
--resources="cpus:2;gpus:0;mem:1024;disk:1024;ports:[31000-32000]" --revocable_cpu_low_priority="true"
--runtime_dir="/tmp/Endpoint_SlaveEndpointTest_NoAuthorizer_1_45yvdK" --sandbox_directory="/mnt/mesos/sandbox"
--strict="true" --switch_user="true" --systemd_enable_support="true" --systemd_runtime_directory="/run/systemd/system"
--version="false" --work_dir="/tmp/Endpoint_SlaveEndpointTest_NoAuthorizer_1_sCaAHD"
I0714 00:45:43.555095  5004 credentials.hpp:86] Loading credential for authentication from
'/tmp/Endpoint_SlaveEndpointTest_NoAuthorizer_1_45yvdK/credential'
I0714 00:45:43.555495  5004 slave.cpp:283] Agent using credential for: test-principal
I0714 00:45:43.555531  5004 credentials.hpp:37] Loading credentials for authentication from
'/tmp/Endpoint_SlaveEndpointTest_NoAuthorizer_1_45yvdK/http_credentials'
I0714 00:45:43.556051  5004 http.cpp:1009] Creating default 'basic' HTTP authenticator for
realm 'mesos-agent-readonly'
I0714 00:45:43.556458  5004 http.cpp:1009] Creating default 'basic' HTTP authenticator for
realm 'mesos-agent-readwrite'
I0714 00:45:43.558872  5004 slave.cpp:565] Agent resources: [{"name":"cpus","scalar":{"value":2.0},"type":"SCALAR"},{"name":"mem","scalar":{"value":1024.0},"type":"SCALAR"},{"name":"disk","scalar":{"value":1024.0},"type":"SCALAR"},{"name":"ports","ranges":{"range":[{"begin":31000,"end":32000}]},"type":"RANGES"}]
I0714 00:45:43.559307  5004 slave.cpp:573] Agent attributes: [  ]
I0714 00:45:43.559329  5004 slave.cpp:582] Agent hostname: da08c1718c4b
I0714 00:45:43.559593  5002 status_update_manager.cpp:177] Pausing sending status updates
I0714 00:45:43.561704  5006 state.cpp:64] Recovering state from '/tmp/Endpoint_SlaveEndpointTest_NoAuthorizer_1_sCaAHD/meta'
I0714 00:45:43.562254  5001 status_update_manager.cpp:203] Recovering status update manager
I0714 00:45:43.562626  5006 containerizer.cpp:582] Recovering containerizer
I0714 00:45:43.564975  4999 provisioner.cpp:416] Provisioner recovery complete
I0714 00:45:43.565624  5000 slave.cpp:6229] Finished recovery
I0714 00:45:43.566365  5000 slave.cpp:6411] Querying resource estimator for oversubscribable
resources
I0714 00:45:43.566773  5000 slave.cpp:6425] Received oversubscribable resources {} from the
resource estimator
I0714 00:45:43.571410  5000 process.cpp:3820] Handling HTTP event for process 'slave(794)'
with path: '/slave(794)/monitor/statistics.json'
I0714 00:45:43.573988  5000 http.cpp:1149] HTTP GET for /slave(794)/monitor/statistics.json
from 172.17.0.2:58912
I0714 00:45:43.574115  5000 http.cpp:970] Authorizing principal 'test-principal' to GET the
'/monitor/statistics.json' endpoint
I0714 00:45:43.581014  5006 slave.cpp:843] Agent terminating
[       OK ] Endpoint/SlaveEndpointTest.NoAuthorizer/1 (50 ms)
[ RUN      ] Endpoint/SlaveEndpointTest.NoAuthorizer/2
I0714 00:45:43.597461  4980 containerizer.cpp:230] Using isolation: posix/cpu,posix/mem,filesystem/posix,network/cni,environment_secret
W0714 00:45:43.598361  4980 backend.cpp:76] Failed to create 'overlay' backend: OverlayBackend
requires root privileges
W0714 00:45:43.598619  4980 backend.cpp:76] Failed to create 'bind' backend: BindBackend requires
root privileges
I0714 00:45:43.598729  4980 provisioner.cpp:255] Using default backend 'copy'
I0714 00:45:43.601444  4980 cluster.cpp:448] Creating default 'local' authorizer
I0714 00:45:43.604434  5001 slave.cpp:250] Mesos agent started on (795)@172.17.0.2:35983
I0714 00:45:43.604476  5001 slave.cpp:251] Flags at startup: --acls="" --appc_simple_discovery_uri_prefix="http://"
--appc_store_dir="/tmp/Endpoint_SlaveEndpointTest_NoAuthorizer_2_y3H8Ia/store/appc" --authenticate_http_readonly="true"
--authenticate_http_readwrite="true" --authenticatee="crammd5" --authentication_backoff_factor="1secs"
--authorizer="local" --cgroups_cpu_enable_pids_and_tids_count="false" --cgroups_enable_cfs="false"
--cgroups_hierarchy="/sys/fs/cgroup" --cgroups_limit_swap="false" --cgroups_root="mesos" --container_disk_watch_interval="15secs"
--containerizers="mesos" --credential="/tmp/Endpoint_SlaveEndpointTest_NoAuthorizer_2_y3H8Ia/credential"
--default_role="*" --disk_watch_interval="1mins" --docker="docker" --docker_kill_orphans="true"
--docker_registry="https://registry-1.docker.io" --docker_remove_delay="6hrs" --docker_socket="/var/run/docker.sock"
--docker_stop_timeout="0ns" --docker_store_dir="/tmp/Endpoint_SlaveEndpointTest_NoAuthorizer_2_y3H8Ia/store/docker"
--docker_volume_checkpoint_dir="/var/run/mesos/isolators/docker/volume" --enforce_container_disk_quota="false"
--executor_registration_timeout="1mins" --executor_reregistration_timeout="2secs" --executor_shutdown_grace_period="5secs"
--fetcher_cache_dir="/tmp/Endpoint_SlaveEndpointTest_NoAuthorizer_2_y3H8Ia/fetch" --fetcher_cache_size="2GB"
--frameworks_home="" --gc_delay="1weeks" --gc_disk_headroom="0.1" --hadoop_home="" --help="false"
--hostname_lookup="true" --http_command_executor="false" --http_credentials="/tmp/Endpoint_SlaveEndpointTest_NoAuthorizer_2_y3H8Ia/http_credentials"
--http_heartbeat_interval="30secs" --initialize_driver_logging="true" --isolation="posix/cpu,posix/mem"
--launcher="posix" --launcher_dir="/mesos/mesos-1.4.0/_build/src" --logbufsecs="0" --logging_level="INFO"
--max_completed_executors_per_framework="150" --oversubscribed_resources_interval="15secs"
--perf_duration="10secs" --perf_interval="1mins" --port="5051" --qos_correction_interval_min="0ns"
--quiet="false" --recover="reconnect" --recovery_timeout="15mins" --registration_backoff_factor="10ms"
--resources="cpus:2;gpus:0;mem:1024;disk:1024;ports:[31000-32000]" --revocable_cpu_low_priority="true"
--runtime_dir="/tmp/Endpoint_SlaveEndpointTest_NoAuthorizer_2_y3H8Ia" --sandbox_directory="/mnt/mesos/sandbox"
--strict="true" --switch_user="true" --systemd_enable_support="true" --systemd_runtime_directory="/run/systemd/system"
--version="false" --work_dir="/tmp/Endpoint_SlaveEndpointTest_NoAuthorizer_2_CNL143"
I0714 00:45:43.605388  5001 credentials.hpp:86] Loading credential for authentication from
'/tmp/Endpoint_SlaveEndpointTest_NoAuthorizer_2_y3H8Ia/credential'
I0714 00:45:43.606104  5001 slave.cpp:283] Agent using credential for: test-principal
I0714 00:45:43.606226  5001 credentials.hpp:37] Loading credentials for authentication from
'/tmp/Endpoint_SlaveEndpointTest_NoAuthorizer_2_y3H8Ia/http_credentials'
I0714 00:45:43.606760  5001 http.cpp:1009] Creating default 'basic' HTTP authenticator for
realm 'mesos-agent-readonly'
I0714 00:45:43.607187  5001 http.cpp:1009] Creating default 'basic' HTTP authenticator for
realm 'mesos-agent-readwrite'
I0714 00:45:43.609642  5001 slave.cpp:565] Agent resources: [{"name":"cpus","scalar":{"value":2.0},"type":"SCALAR"},{"name":"mem","scalar":{"value":1024.0},"type":"SCALAR"},{"name":"disk","scalar":{"value":1024.0},"type":"SCALAR"},{"name":"ports","ranges":{"range":[{"begin":31000,"end":32000}]},"type":"RANGES"}]
I0714 00:45:43.610080  5001 slave.cpp:573] Agent attributes: [  ]
I0714 00:45:43.610100  5001 slave.cpp:582] Agent hostname: da08c1718c4b
I0714 00:45:43.610522  5003 status_update_manager.cpp:177] Pausing sending status updates
I0714 00:45:43.612648  5005 state.cpp:64] Recovering state from '/tmp/Endpoint_SlaveEndpointTest_NoAuthorizer_2_CNL143/meta'
I0714 00:45:43.613535  5001 status_update_manager.cpp:203] Recovering status update manager
I0714 00:45:43.613932  5001 containerizer.cpp:582] Recovering containerizer
I0714 00:45:43.616791  5003 provisioner.cpp:416] Provisioner recovery complete
I0714 00:45:43.617482  5006 slave.cpp:6229] Finished recovery
I0714 00:45:43.618108  5006 slave.cpp:6411] Querying resource estimator for oversubscribable
resources
I0714 00:45:43.618494  5004 slave.cpp:6425] Received oversubscribable resources {} from the
resource estimator
I0714 00:45:43.622828  5002 process.cpp:3820] Handling HTTP event for process 'slave(795)'
with path: '/slave(795)/containers'
I0714 00:45:43.625428  5002 http.cpp:1149] HTTP GET for /slave(795)/containers from 172.17.0.2:58914
I0714 00:45:43.625627  5002 http.cpp:970] Authorizing principal 'test-principal' to GET the
'/containers' endpoint
I0714 00:45:43.632489  5003 slave.cpp:843] Agent terminating
[       OK ] Endpoint/SlaveEndpointTest.NoAuthorizer/2 (52 ms)
[----------] 9 tests from Endpoint/SlaveEndpointTest (453 ms total)

[----------] Global test environment tear-down
[==========] 1636 tests from 179 test cases ran. (729497 ms total)
[  PASSED  ] 1631 tests.
[  FAILED  ] 5 tests, listed below:
[  FAILED  ] DefaultExecutorCheckTest.CommandCheckDeliveredAndReconciled
[  FAILED  ] DefaultExecutorCheckTest.CommandCheckStatusChange
[  FAILED  ] DefaultExecutorCheckTest.CommandCheckSeesParentsEnv
[  FAILED  ] DefaultExecutorCheckTest.CommandCheckSharesWorkDirWithTask
[  FAILED  ] DiskQuotaTest.SlaveRecovery

 5 FAILED TESTS
  YOU HAVE 20 DISABLED TESTS

I0714 00:45:43.779938  5007 process.cpp:993] Failed to accept socket: future discarded
make[4]: *** [check-local] Error 1
make[4]: Leaving directory `/mesos/mesos-1.4.0/_build/src'
make[3]: *** [check-am] Error 2
make[3]: Leaving directory `/mesos/mesos-1.4.0/_build/src'
make[2]: *** [check] Error 2
make[2]: Leaving directory `/mesos/mesos-1.4.0/_build/src'
make[1]: *** [check-recursive] Error 1
make[1]: Leaving directory `/mesos/mesos-1.4.0/_build'
make: *** [distcheck] Error 1
+ docker rmi mesos-1499987462-19036
Untagged: mesos-1499987462-19036:latest
Deleted: sha256:b8cab3701440ddbe9a36fcb118bc055a37bb490524770c86c4c2d3b50187f299
Deleted: sha256:1814c33b05624e90ad682b0e973f3d46c0d808f4053d0bea041d4c5e7aaf8a85
Deleted: sha256:bb9cf7f869dd5e09d6c7edba865a3f735412157563d0058b8b23dc7c4af0b7fc
Deleted: sha256:48394ef0546cf6546b52dd799de9dc8fc065f2d655a614a056bc991410acf045
Deleted: sha256:8b8316cd61d864b42a5eaee21a4d38f6917ba33ffb0b44cf0e8a9e9ad96bb850
Deleted: sha256:b97318f2ca8990011f8e01888c8c2d4fcdf9b28feba382ec9666d279a5b1edf6
Deleted: sha256:443ca11db2539683930a3caf9ad449c4eb5ad964ee4298a4f106858b9974df42
Deleted: sha256:2a691c4ee81f7e4556eef82c275f6a7dbeb4b197150d56522f0f4287dbde3479
Deleted: sha256:76e3bea5c0c6509e84fa067c73c408d6aee446ce1918338f171deed0c375073f
Deleted: sha256:91e31370bb700e400425d8e4a9d656f2bb3373f0f7089f88a4f0539ba15f0e29
Deleted: sha256:412901c7827e7cc248c05e421842edcafb6152568e63365630c8ef43253656b8
Deleted: sha256:23db99dd0e1935bb8d60b64dfc997207cd2a0112ac52593413d3b102070f6f65
Deleted: sha256:e49f2598cb1efe6a2ab2e28fd0b995da82107d625581a2162b3528c91ddd8f3c
Deleted: sha256:4848ffd933cf27efb9c63cbac17475273a8fe840784a2525fba95eba976c5750
Deleted: sha256:ac37c1794e0d4c05debc4359f3492e9358d95a3a829a0e65d3d601b278aa3bb4
Deleted: sha256:d95316acc506177fa414edce81d5f810235e7204f5c5532be6f1b7ce14119441
Deleted: sha256:6ec266454953233b63620a8e74f4512db0cea37e1cf1a3565ea4333495ae000d
Deleted: sha256:628a090d3f6c482c3621fc68d4e8c9da86dc3dec032bb9c8c6183217cd379cd1
Deleted: sha256:dbc3430b30fa0f0f7aece2f32f53d261380c79e4cfc4753cbf66b42008f08d18
Deleted: sha256:f4e6d047b0981c91ef0d117c16c5b43b95617be7cf2c5a4bb275c94cd8744b1f
Deleted: sha256:86430951cb59d6a7372cc7584567e0533713e7b64d97f0d4064d1501de373ef1
Deleted: sha256:c7331f216617660e60f2310133622fb6b6fc54375a646869f10019325f08149f
Deleted: sha256:2570bbf07343d813c957fa79b6a659690509b9534fe34ea3bb4101f6c160783d
Deleted: sha256:766786b5dd129732d6075e67abad81fc6dd78cd581ee50414223a9017c63377a
Build step 'Execute shell' marked build as failure

Mime
View raw message