mesos-builds mailing list archives

Site index · List index
Message view « Date » · « Thread »
Top « Date » · « Thread »
From Apache Jenkins Server <jenk...@builds.apache.org>
Subject Build failed in Jenkins: Mesos-Buildbot » autotools,gcc,--verbose,GLOG_v=1 MESOS_VERBOSE=1,centos:7,(ubuntu)&&(!ubuntu-us1)&&(!ubuntu-eu2) #3933
Date Wed, 19 Jul 2017 23:37:25 GMT
See <https://builds.apache.org/job/Mesos-Buildbot/BUILDTOOL=autotools,COMPILER=gcc,CONFIGURATION=--verbose,ENVIRONMENT=GLOG_v=1%20MESOS_VERBOSE=1,OS=centos%3A7,label_exp=(ubuntu)&&(!ubuntu-us1)&&(!ubuntu-eu2)/3933/display/redirect?page=changes>

Changes:

[mpark] Used move semantics when returning gzip compressed responses.

[benjamin.hindman] Performance optimizations for message passing.

[benjamin.hindman] Added --enable-lock-free-run-queue configuration to Mesos.

[benjamin.hindman] Replaced std::map with hashmap for ProcessManager::processes.

[benjamin.hindman] Replaced std::map with hashmap for ProcessBase::handlers.

[benjamin.hindman] Removed extra/unnecessary allocations of Message.

[benjamin.hindman] Changes for libprocess Message optimization.

[benjamin.hindman] Added double-checked locking for filter.

[yujie.jay] Set the `LIBPROCESS_IP` env variable before starting the fetcher.

[yujie.jay] Added MESOS-7796 to 1.3.1 CHANGELOG.

[yujie.jay] Added MESOS-7796 to 1.2.2 CHANGELOG.

[yujie.jay] Added MESOS-7796 to 1.1.3 CHANGELOG.

------------------------------------------
[...truncated 30.12 MB...]
I0719 23:36:59.838912  5866 slave.cpp:251] Flags at startup: --acls="" --appc_simple_discovery_uri_prefix="http://"
--appc_store_dir="/tmp/Endpoint_SlaveEndpointTest_AuthorizedRequest_2_KUNOip/store/appc" --authenticate_http_readonly="true"
--authenticate_http_readwrite="true" --authenticatee="crammd5" --authentication_backoff_factor="1secs"
--authorizer="local" --cgroups_cpu_enable_pids_and_tids_count="false" --cgroups_enable_cfs="false"
--cgroups_hierarchy="/sys/fs/cgroup" --cgroups_limit_swap="false" --cgroups_root="mesos" --container_disk_watch_interval="15secs"
--containerizers="mesos" --credential="/tmp/Endpoint_SlaveEndpointTest_AuthorizedRequest_2_KUNOip/credential"
--default_role="*" --disk_watch_interval="1mins" --docker="docker" --docker_kill_orphans="true"
--docker_registry="https://registry-1.docker.io" --docker_remove_delay="6hrs" --docker_socket="/var/run/docker.sock"
--docker_stop_timeout="0ns" --docker_store_dir="/tmp/Endpoint_SlaveEndpointTest_AuthorizedRequest_2_KUNOip/store/docker"
--docker_volume_checkpoint_dir="/var/run/mesos/isolators/docker/volume" --enforce_container_disk_quota="false"
--executor_registration_timeout="1mins" --executor_reregistration_timeout="2secs" --executor_shutdown_grace_period="5secs"
--fetcher_cache_dir="/tmp/Endpoint_SlaveEndpointTest_AuthorizedRequest_2_KUNOip/fetch" --fetcher_cache_size="2GB"
--frameworks_home="" --gc_delay="1weeks" --gc_disk_headroom="0.1" --hadoop_home="" --help="false"
--hostname_lookup="true" --http_command_executor="false" --http_credentials="/tmp/Endpoint_SlaveEndpointTest_AuthorizedRequest_2_KUNOip/http_credentials"
--http_heartbeat_interval="30secs" --initialize_driver_logging="true" --isolation="posix/cpu,posix/mem"
--launcher="posix" --launcher_dir="/mesos/mesos-1.4.0/_build/src" --logbufsecs="0" --logging_level="INFO"
--max_completed_executors_per_framework="150" --oversubscribed_resources_interval="15secs"
--perf_duration="10secs" --perf_interval="1mins" --port="5051" --qos_correction_interval_min="0ns"
--quiet="false" --recover="reconnect" --recovery_timeout="15mins" --registration_backoff_factor="10ms"
--resources="cpus:2;gpus:0;mem:1024;disk:1024;ports:[31000-32000]" --revocable_cpu_low_priority="true"
--runtime_dir="/tmp/Endpoint_SlaveEndpointTest_AuthorizedRequest_2_KUNOip" --sandbox_directory="/mnt/mesos/sandbox"
--strict="true" --switch_user="true" --systemd_enable_support="true" --systemd_runtime_directory="/run/systemd/system"
--version="false" --work_dir="/tmp/Endpoint_SlaveEndpointTest_AuthorizedRequest_2_n7aN5N"
I0719 23:36:59.839687  5866 credentials.hpp:86] Loading credential for authentication from
'/tmp/Endpoint_SlaveEndpointTest_AuthorizedRequest_2_KUNOip/credential'
I0719 23:36:59.839956  5866 slave.cpp:283] Agent using credential for: test-principal
I0719 23:36:59.839979  5866 credentials.hpp:37] Loading credentials for authentication from
'/tmp/Endpoint_SlaveEndpointTest_AuthorizedRequest_2_KUNOip/http_credentials'
I0719 23:36:59.840353  5866 http.cpp:993] Creating default 'basic' HTTP authenticator for
realm 'mesos-agent-readonly'
I0719 23:36:59.840602  5866 http.cpp:993] Creating default 'basic' HTTP authenticator for
realm 'mesos-agent-readwrite'
I0719 23:36:59.842906  5866 slave.cpp:565] Agent resources: [{"name":"cpus","scalar":{"value":2.0},"type":"SCALAR"},{"name":"mem","scalar":{"value":1024.0},"type":"SCALAR"},{"name":"disk","scalar":{"value":1024.0},"type":"SCALAR"},{"name":"ports","ranges":{"range":[{"begin":31000,"end":32000}]},"type":"RANGES"}]
I0719 23:36:59.843379  5866 slave.cpp:573] Agent attributes: [  ]
I0719 23:36:59.843400  5866 slave.cpp:582] Agent hostname: 5625d92fc09d
I0719 23:36:59.843617  5865 status_update_manager.cpp:177] Pausing sending status updates
I0719 23:36:59.847898  5864 state.cpp:64] Recovering state from '/tmp/Endpoint_SlaveEndpointTest_AuthorizedRequest_2_n7aN5N/meta'
I0719 23:36:59.848526  5867 status_update_manager.cpp:203] Recovering status update manager
I0719 23:36:59.849114  5870 containerizer.cpp:582] Recovering containerizer
I0719 23:36:59.851899  5865 provisioner.cpp:416] Provisioner recovery complete
I0719 23:36:59.852728  5868 slave.cpp:6207] Finished recovery
I0719 23:36:59.853440  5868 slave.cpp:6389] Querying resource estimator for oversubscribable
resources
I0719 23:36:59.853896  5864 slave.cpp:6403] Received oversubscribable resources {} from the
resource estimator
I0719 23:36:59.858628  5864 process.cpp:3837] Handling HTTP event for process 'slave(789)'
with path: '/slave(789)/containers'
I0719 23:36:59.861212  5868 http.cpp:1133] HTTP GET for /slave(789)/containers from 172.17.0.2:48668
I0719 23:36:59.861371  5868 http.cpp:957] Authorizing principal 'test-principal' to GET the
'/containers' endpoint
I0719 23:36:59.868767  5866 slave.cpp:843] Agent terminating
[       OK ] Endpoint/SlaveEndpointTest.AuthorizedRequest/2 (60 ms)
[ RUN      ] Endpoint/SlaveEndpointTest.UnauthorizedRequest/0
I0719 23:36:59.892223  5845 containerizer.cpp:230] Using isolation: posix/cpu,posix/mem,filesystem/posix,network/cni,environment_secret
W0719 23:36:59.893095  5845 backend.cpp:76] Failed to create 'overlay' backend: OverlayBackend
requires root privileges
W0719 23:36:59.893296  5845 backend.cpp:76] Failed to create 'bind' backend: BindBackend requires
root privileges
I0719 23:36:59.893344  5845 provisioner.cpp:255] Using default backend 'copy'
I0719 23:36:59.900118  5865 slave.cpp:250] Mesos agent started on (790)@172.17.0.2:39443
I0719 23:36:59.900169  5865 slave.cpp:251] Flags at startup: --acls="" --appc_simple_discovery_uri_prefix="http://"
--appc_store_dir="/tmp/Endpoint_SlaveEndpointTest_UnauthorizedRequest_0_usuSFO/store/appc"
--authenticate_http_readonly="true" --authenticate_http_readwrite="true" --authenticatee="crammd5"
--authentication_backoff_factor="1secs" --authorizer="local" --cgroups_cpu_enable_pids_and_tids_count="false"
--cgroups_enable_cfs="false" --cgroups_hierarchy="/sys/fs/cgroup" --cgroups_limit_swap="false"
--cgroups_root="mesos" --container_disk_watch_interval="15secs" --containerizers="mesos" --credential="/tmp/Endpoint_SlaveEndpointTest_UnauthorizedRequest_0_usuSFO/credential"
--default_role="*" --disk_watch_interval="1mins" --docker="docker" --docker_kill_orphans="true"
--docker_registry="https://registry-1.docker.io" --docker_remove_delay="6hrs" --docker_socket="/var/run/docker.sock"
--docker_stop_timeout="0ns" --docker_store_dir="/tmp/Endpoint_SlaveEndpointTest_UnauthorizedRequest_0_usuSFO/store/docker"
--docker_volume_checkpoint_dir="/var/run/mesos/isolators/docker/volume" --enforce_container_disk_quota="false"
--executor_registration_timeout="1mins" --executor_reregistration_timeout="2secs" --executor_shutdown_grace_period="5secs"
--fetcher_cache_dir="/tmp/Endpoint_SlaveEndpointTest_UnauthorizedRequest_0_usuSFO/fetch" --fetcher_cache_size="2GB"
--frameworks_home="" --gc_delay="1weeks" --gc_disk_headroom="0.1" --hadoop_home="" --help="false"
--hostname_lookup="true" --http_command_executor="false" --http_credentials="/tmp/Endpoint_SlaveEndpointTest_UnauthorizedRequest_0_usuSFO/http_credentials"
--http_heartbeat_interval="30secs" --initialize_driver_logging="true" --isolation="posix/cpu,posix/mem"
--launcher="posix" --launcher_dir="/mesos/mesos-1.4.0/_build/src" --logbufsecs="0" --logging_level="INFO"
--max_completed_executors_per_framework="150" --oversubscribed_resources_interval="15secs"
--perf_duration="10secs" --perf_interval="1mins" --port="5051" --qos_correction_interval_min="0ns"
--quiet="false" --recover="reconnect" --recovery_timeout="15mins" --registration_backoff_factor="10ms"
--resources="cpus:2;gpus:0;mem:1024;disk:1024;ports:[31000-32000]" --revocable_cpu_low_priority="true"
--runtime_dir="/tmp/Endpoint_SlaveEndpointTest_UnauthorizedRequest_0_usuSFO" --sandbox_directory="/mnt/mesos/sandbox"
--strict="true" --switch_user="true" --systemd_enable_support="true" --systemd_runtime_directory="/run/systemd/system"
--version="false" --work_dir="/tmp/Endpoint_SlaveEndpointTest_UnauthorizedRequest_0_fpL5id"
I0719 23:36:59.901015  5865 credentials.hpp:86] Loading credential for authentication from
'/tmp/Endpoint_SlaveEndpointTest_UnauthorizedRequest_0_usuSFO/credential'
I0719 23:36:59.901309  5865 slave.cpp:283] Agent using credential for: test-principal
I0719 23:36:59.901346  5865 credentials.hpp:37] Loading credentials for authentication from
'/tmp/Endpoint_SlaveEndpointTest_UnauthorizedRequest_0_usuSFO/http_credentials'
I0719 23:36:59.901823  5865 http.cpp:993] Creating default 'basic' HTTP authenticator for
realm 'mesos-agent-readonly'
I0719 23:36:59.902129  5865 http.cpp:993] Creating default 'basic' HTTP authenticator for
realm 'mesos-agent-readwrite'
I0719 23:36:59.904723  5865 slave.cpp:565] Agent resources: [{"name":"cpus","scalar":{"value":2.0},"type":"SCALAR"},{"name":"mem","scalar":{"value":1024.0},"type":"SCALAR"},{"name":"disk","scalar":{"value":1024.0},"type":"SCALAR"},{"name":"ports","ranges":{"range":[{"begin":31000,"end":32000}]},"type":"RANGES"}]
I0719 23:36:59.905243  5865 slave.cpp:573] Agent attributes: [  ]
I0719 23:36:59.905277  5865 slave.cpp:582] Agent hostname: 5625d92fc09d
I0719 23:36:59.905671  5866 status_update_manager.cpp:177] Pausing sending status updates
I0719 23:36:59.908135  5871 state.cpp:64] Recovering state from '/tmp/Endpoint_SlaveEndpointTest_UnauthorizedRequest_0_fpL5id/meta'
I0719 23:36:59.908866  5869 status_update_manager.cpp:203] Recovering status update manager
I0719 23:36:59.909343  5865 containerizer.cpp:582] Recovering containerizer
I0719 23:36:59.912186  5868 provisioner.cpp:416] Provisioner recovery complete
I0719 23:36:59.912974  5869 slave.cpp:6207] Finished recovery
I0719 23:36:59.913755  5869 slave.cpp:6389] Querying resource estimator for oversubscribable
resources
I0719 23:36:59.914216  5867 slave.cpp:6403] Received oversubscribable resources {} from the
resource estimator
I0719 23:36:59.919203  5867 process.cpp:3837] Handling HTTP event for process 'slave(790)'
with path: '/slave(790)/monitor/statistics'
I0719 23:36:59.921635  5871 http.cpp:1133] HTTP GET for /slave(790)/monitor/statistics from
172.17.0.2:48680
I0719 23:36:59.921823  5871 http.cpp:957] Authorizing principal 'test-principal' to GET the
'/monitor/statistics' endpoint
I0719 23:36:59.925952  5865 slave.cpp:843] Agent terminating
[       OK ] Endpoint/SlaveEndpointTest.UnauthorizedRequest/0 (54 ms)
[ RUN      ] Endpoint/SlaveEndpointTest.UnauthorizedRequest/1
I0719 23:36:59.947170  5845 containerizer.cpp:230] Using isolation: posix/cpu,posix/mem,filesystem/posix,network/cni,environment_secret
W0719 23:36:59.949452  5845 backend.cpp:76] Failed to create 'overlay' backend: OverlayBackend
requires root privileges
W0719 23:36:59.950124  5845 backend.cpp:76] Failed to create 'bind' backend: BindBackend requires
root privileges
I0719 23:36:59.950570  5845 provisioner.cpp:255] Using default backend 'copy'
I0719 23:36:59.957593  5871 slave.cpp:250] Mesos agent started on (791)@172.17.0.2:39443
I0719 23:36:59.957646  5871 slave.cpp:251] Flags at startup: --acls="" --appc_simple_discovery_uri_prefix="http://"
--appc_store_dir="/tmp/Endpoint_SlaveEndpointTest_UnauthorizedRequest_1_KAtiDe/store/appc"
--authenticate_http_readonly="true" --authenticate_http_readwrite="true" --authenticatee="crammd5"
--authentication_backoff_factor="1secs" --authorizer="local" --cgroups_cpu_enable_pids_and_tids_count="false"
--cgroups_enable_cfs="false" --cgroups_hierarchy="/sys/fs/cgroup" --cgroups_limit_swap="false"
--cgroups_root="mesos" --container_disk_watch_interval="15secs" --containerizers="mesos" --credential="/tmp/Endpoint_SlaveEndpointTest_UnauthorizedRequest_1_KAtiDe/credential"
--default_role="*" --disk_watch_interval="1mins" --docker="docker" --docker_kill_orphans="true"
--docker_registry="https://registry-1.docker.io" --docker_remove_delay="6hrs" --docker_socket="/var/run/docker.sock"
--docker_stop_timeout="0ns" --docker_store_dir="/tmp/Endpoint_SlaveEndpointTest_UnauthorizedRequest_1_KAtiDe/store/docker"
--docker_volume_checkpoint_dir="/var/run/mesos/isolators/docker/volume" --enforce_container_disk_quota="false"
--executor_registration_timeout="1mins" --executor_reregistration_timeout="2secs" --executor_shutdown_grace_period="5secs"
--fetcher_cache_dir="/tmp/Endpoint_SlaveEndpointTest_UnauthorizedRequest_1_KAtiDe/fetch" --fetcher_cache_size="2GB"
--frameworks_home="" --gc_delay="1weeks" --gc_disk_headroom="0.1" --hadoop_home="" --help="false"
--hostname_lookup="true" --http_command_executor="false" --http_credentials="/tmp/Endpoint_SlaveEndpointTest_UnauthorizedRequest_1_KAtiDe/http_credentials"
--http_heartbeat_interval="30secs" --initialize_driver_logging="true" --isolation="posix/cpu,posix/mem"
--launcher="posix" --launcher_dir="/mesos/mesos-1.4.0/_build/src" --logbufsecs="0" --logging_level="INFO"
--max_completed_executors_per_framework="150" --oversubscribed_resources_interval="15secs"
--perf_duration="10secs" --perf_interval="1mins" --port="5051" --qos_correction_interval_min="0ns"
--quiet="false" --recover="reconnect" --recovery_timeout="15mins" --registration_backoff_factor="10ms"
--resources="cpus:2;gpus:0;mem:1024;disk:1024;ports:[31000-32000]" --revocable_cpu_low_priority="true"
--runtime_dir="/tmp/Endpoint_SlaveEndpointTest_UnauthorizedRequest_1_KAtiDe" --sandbox_directory="/mnt/mesos/sandbox"
--strict="true" --switch_user="true" --systemd_enable_support="true" --systemd_runtime_directory="/run/systemd/system"
--version="false" --work_dir="/tmp/Endpoint_SlaveEndpointTest_UnauthorizedRequest_1_t2MD7C"
I0719 23:36:59.958475  5871 credentials.hpp:86] Loading credential for authentication from
'/tmp/Endpoint_SlaveEndpointTest_UnauthorizedRequest_1_KAtiDe/credential'
I0719 23:36:59.958776  5871 slave.cpp:283] Agent using credential for: test-principal
I0719 23:36:59.958811  5871 credentials.hpp:37] Loading credentials for authentication from
'/tmp/Endpoint_SlaveEndpointTest_UnauthorizedRequest_1_KAtiDe/http_credentials'
I0719 23:36:59.959249  5871 http.cpp:993] Creating default 'basic' HTTP authenticator for
realm 'mesos-agent-readonly'
I0719 23:36:59.959561  5871 http.cpp:993] Creating default 'basic' HTTP authenticator for
realm 'mesos-agent-readwrite'
I0719 23:36:59.962101  5871 slave.cpp:565] Agent resources: [{"name":"cpus","scalar":{"value":2.0},"type":"SCALAR"},{"name":"mem","scalar":{"value":1024.0},"type":"SCALAR"},{"name":"disk","scalar":{"value":1024.0},"type":"SCALAR"},{"name":"ports","ranges":{"range":[{"begin":31000,"end":32000}]},"type":"RANGES"}]
I0719 23:36:59.962591  5871 slave.cpp:573] Agent attributes: [  ]
I0719 23:36:59.962620  5871 slave.cpp:582] Agent hostname: 5625d92fc09d
I0719 23:36:59.962940  5870 status_update_manager.cpp:177] Pausing sending status updates
I0719 23:36:59.965275  5869 state.cpp:64] Recovering state from '/tmp/Endpoint_SlaveEndpointTest_UnauthorizedRequest_1_t2MD7C/meta'
I0719 23:36:59.965919  5869 status_update_manager.cpp:203] Recovering status update manager
I0719 23:36:59.966212  5867 containerizer.cpp:582] Recovering containerizer
I0719 23:36:59.969182  5867 provisioner.cpp:416] Provisioner recovery complete
I0719 23:36:59.969818  5869 slave.cpp:6207] Finished recovery
I0719 23:36:59.970485  5869 slave.cpp:6389] Querying resource estimator for oversubscribable
resources
I0719 23:36:59.970893  5871 slave.cpp:6403] Received oversubscribable resources {} from the
resource estimator
I0719 23:36:59.976001  5865 process.cpp:3837] Handling HTTP event for process 'slave(791)'
with path: '/slave(791)/monitor/statistics.json'
I0719 23:36:59.979010  5871 http.cpp:1133] HTTP GET for /slave(791)/monitor/statistics.json
from 172.17.0.2:48686
I0719 23:36:59.979174  5871 http.cpp:957] Authorizing principal 'test-principal' to GET the
'/monitor/statistics.json' endpoint
I0719 23:36:59.983563  5868 slave.cpp:843] Agent terminating
[       OK ] Endpoint/SlaveEndpointTest.UnauthorizedRequest/1 (56 ms)
[ RUN      ] Endpoint/SlaveEndpointTest.UnauthorizedRequest/2
I0719 23:37:00.003900  5845 containerizer.cpp:230] Using isolation: posix/cpu,posix/mem,filesystem/posix,network/cni,environment_secret
W0719 23:37:00.005741  5845 backend.cpp:76] Failed to create 'overlay' backend: OverlayBackend
requires root privileges
W0719 23:37:00.005945  5845 backend.cpp:76] Failed to create 'bind' backend: BindBackend requires
root privileges
I0719 23:37:00.005993  5845 provisioner.cpp:255] Using default backend 'copy'
I0719 23:37:00.011965  5868 slave.cpp:250] Mesos agent started on (792)@172.17.0.2:39443
I0719 23:37:00.012017  5868 slave.cpp:251] Flags at startup: --acls="" --appc_simple_discovery_uri_prefix="http://"
--appc_store_dir="/tmp/Endpoint_SlaveEndpointTest_UnauthorizedRequest_2_ovrGbF/store/appc"
--authenticate_http_readonly="true" --authenticate_http_readwrite="true" --authenticatee="crammd5"
--authentication_backoff_factor="1secs" --authorizer="local" --cgroups_cpu_enable_pids_and_tids_count="false"
--cgroups_enable_cfs="false" --cgroups_hierarchy="/sys/fs/cgroup" --cgroups_limit_swap="false"
--cgroups_root="mesos" --container_disk_watch_interval="15secs" --containerizers="mesos" --credential="/tmp/Endpoint_SlaveEndpointTest_UnauthorizedRequest_2_ovrGbF/credential"
--default_role="*" --disk_watch_interval="1mins" --docker="docker" --docker_kill_orphans="true"
--docker_registry="https://registry-1.docker.io" --docker_remove_delay="6hrs" --docker_socket="/var/run/docker.sock"
--docker_stop_timeout="0ns" --docker_store_dir="/tmp/Endpoint_SlaveEndpointTest_UnauthorizedRequest_2_ovrGbF/store/docker"
--docker_volume_checkpoint_dir="/var/run/mesos/isolators/docker/volume" --enforce_container_disk_quota="false"
--executor_registration_timeout="1mins" --executor_reregistration_timeout="2secs" --executor_shutdown_grace_period="5secs"
--fetcher_cache_dir="/tmp/Endpoint_SlaveEndpointTest_UnauthorizedRequest_2_ovrGbF/fetch" --fetcher_cache_size="2GB"
--frameworks_home="" --gc_delay="1weeks" --gc_disk_headroom="0.1" --hadoop_home="" --help="false"
--hostname_lookup="true" --http_command_executor="false" --http_credentials="/tmp/Endpoint_SlaveEndpointTest_UnauthorizedRequest_2_ovrGbF/http_credentials"
--http_heartbeat_interval="30secs" --initialize_driver_logging="true" --isolation="posix/cpu,posix/mem"
--launcher="posix" --launcher_dir="/mesos/mesos-1.4.0/_build/src" --logbufsecs="0" --logging_level="INFO"
--max_completed_executors_per_framework="150" --oversubscribed_resources_interval="15secs"
--perf_duration="10secs" --perf_interval="1mins" --port="5051" --qos_correction_interval_min="0ns"
--quiet="false" --recover="reconnect" --recovery_timeout="15mins" --registration_backoff_factor="10ms"
--resources="cpus:2;gpus:0;mem:1024;disk:1024;ports:[31000-32000]" --revocable_cpu_low_priority="true"
--runtime_dir="/tmp/Endpoint_SlaveEndpointTest_UnauthorizedRequest_2_ovrGbF" --sandbox_directory="/mnt/mesos/sandbox"
--strict="true" --switch_user="true" --systemd_enable_support="true" --systemd_runtime_directory="/run/systemd/system"
--version="false" --work_dir="/tmp/Endpoint_SlaveEndpointTest_UnauthorizedRequest_2_RwvMw3"
I0719 23:37:00.012783  5868 credentials.hpp:86] Loading credential for authentication from
'/tmp/Endpoint_SlaveEndpointTest_UnauthorizedRequest_2_ovrGbF/credential'
I0719 23:37:00.013052  5868 slave.cpp:283] Agent using credential for: test-principal
I0719 23:37:00.013077  5868 credentials.hpp:37] Loading credentials for authentication from
'/tmp/Endpoint_SlaveEndpointTest_UnauthorizedRequest_2_ovrGbF/http_credentials'
I0719 23:37:00.013443  5868 http.cpp:993] Creating default 'basic' HTTP authenticator for
realm 'mesos-agent-readonly'
I0719 23:37:00.013651  5868 http.cpp:993] Creating default 'basic' HTTP authenticator for
realm 'mesos-agent-readwrite'
I0719 23:37:00.015830  5868 slave.cpp:565] Agent resources: [{"name":"cpus","scalar":{"value":2.0},"type":"SCALAR"},{"name":"mem","scalar":{"value":1024.0},"type":"SCALAR"},{"name":"disk","scalar":{"value":1024.0},"type":"SCALAR"},{"name":"ports","ranges":{"range":[{"begin":31000,"end":32000}]},"type":"RANGES"}]
I0719 23:37:00.016278  5868 slave.cpp:573] Agent attributes: [  ]
I0719 23:37:00.016299  5868 slave.cpp:582] Agent hostname: 5625d92fc09d
I0719 23:37:00.016983  5869 status_update_manager.cpp:177] Pausing sending status updates
I0719 23:37:00.021131  5865 state.cpp:64] Recovering state from '/tmp/Endpoint_SlaveEndpointTest_UnauthorizedRequest_2_RwvMw3/meta'
I0719 23:37:00.021808  5870 status_update_manager.cpp:203] Recovering status update manager
I0719 23:37:00.022284  5864 containerizer.cpp:582] Recovering containerizer
I0719 23:37:00.024744  5866 provisioner.cpp:416] Provisioner recovery complete
I0719 23:37:00.025519  5871 slave.cpp:6207] Finished recovery
I0719 23:37:00.026162  5871 slave.cpp:6389] Querying resource estimator for oversubscribable
resources
I0719 23:37:00.026618  5864 slave.cpp:6403] Received oversubscribable resources {} from the
resource estimator
I0719 23:37:00.031972  5869 process.cpp:3837] Handling HTTP event for process 'slave(792)'
with path: '/slave(792)/containers'
I0719 23:37:00.035979  5864 http.cpp:1133] HTTP GET for /slave(792)/containers from 172.17.0.2:48706
I0719 23:37:00.036149  5864 http.cpp:957] Authorizing principal 'test-principal' to GET the
'/containers' endpoint
I0719 23:37:00.041090  5845 slave.cpp:843] Agent terminating
[       OK ] Endpoint/SlaveEndpointTest.UnauthorizedRequest/2 (56 ms)
[ RUN      ] Endpoint/SlaveEndpointTest.NoAuthorizer/0
I0719 23:37:00.061334  5845 containerizer.cpp:230] Using isolation: posix/cpu,posix/mem,filesystem/posix,network/cni,environment_secret
W0719 23:37:00.062137  5845 backend.cpp:76] Failed to create 'overlay' backend: OverlayBackend
requires root privileges
W0719 23:37:00.062311  5845 backend.cpp:76] Failed to create 'bind' backend: BindBackend requires
root privileges
I0719 23:37:00.062355  5845 provisioner.cpp:255] Using default backend 'copy'
I0719 23:37:00.065068  5845 cluster.cpp:448] Creating default 'local' authorizer
I0719 23:37:00.068186  5869 slave.cpp:250] Mesos agent started on (793)@172.17.0.2:39443
I0719 23:37:00.068233  5869 slave.cpp:251] Flags at startup: --acls="" --appc_simple_discovery_uri_prefix="http://"
--appc_store_dir="/tmp/Endpoint_SlaveEndpointTest_NoAuthorizer_0_ApGPk6/store/appc" --authenticate_http_readonly="true"
--authenticate_http_readwrite="true" --authenticatee="crammd5" --authentication_backoff_factor="1secs"
--authorizer="local" --cgroups_cpu_enable_pids_and_tids_count="false" --cgroups_enable_cfs="false"
--cgroups_hierarchy="/sys/fs/cgroup" --cgroups_limit_swap="false" --cgroups_root="mesos" --container_disk_watch_interval="15secs"
--containerizers="mesos" --credential="/tmp/Endpoint_SlaveEndpointTest_NoAuthorizer_0_ApGPk6/credential"
--default_role="*" --disk_watch_interval="1mins" --docker="docker" --docker_kill_orphans="true"
--docker_registry="https://registry-1.docker.io" --docker_remove_delay="6hrs" --docker_socket="/var/run/docker.sock"
--docker_stop_timeout="0ns" --docker_store_dir="/tmp/Endpoint_SlaveEndpointTest_NoAuthorizer_0_ApGPk6/store/docker"
--docker_volume_checkpoint_dir="/var/run/mesos/isolators/docker/volume" --enforce_container_disk_quota="false"
--executor_registration_timeout="1mins" --executor_reregistration_timeout="2secs" --executor_shutdown_grace_period="5secs"
--fetcher_cache_dir="/tmp/Endpoint_SlaveEndpointTest_NoAuthorizer_0_ApGPk6/fetch" --fetcher_cache_size="2GB"
--frameworks_home="" --gc_delay="1weeks" --gc_disk_headroom="0.1" --hadoop_home="" --help="false"
--hostname_lookup="true" --http_command_executor="false" --http_credentials="/tmp/Endpoint_SlaveEndpointTest_NoAuthorizer_0_ApGPk6/http_credentials"
--http_heartbeat_interval="30secs" --initialize_driver_logging="true" --isolation="posix/cpu,posix/mem"
--launcher="posix" --launcher_dir="/mesos/mesos-1.4.0/_build/src" --logbufsecs="0" --logging_level="INFO"
--max_completed_executors_per_framework="150" --oversubscribed_resources_interval="15secs"
--perf_duration="10secs" --perf_interval="1mins" --port="5051" --qos_correction_interval_min="0ns"
--quiet="false" --recover="reconnect" --recovery_timeout="15mins" --registration_backoff_factor="10ms"
--resources="cpus:2;gpus:0;mem:1024;disk:1024;ports:[31000-32000]" --revocable_cpu_low_priority="true"
--runtime_dir="/tmp/Endpoint_SlaveEndpointTest_NoAuthorizer_0_ApGPk6" --sandbox_directory="/mnt/mesos/sandbox"
--strict="true" --switch_user="true" --systemd_enable_support="true" --systemd_runtime_directory="/run/systemd/system"
--version="false" --work_dir="/tmp/Endpoint_SlaveEndpointTest_NoAuthorizer_0_nVWGwu"
I0719 23:37:00.068998  5869 credentials.hpp:86] Loading credential for authentication from
'/tmp/Endpoint_SlaveEndpointTest_NoAuthorizer_0_ApGPk6/credential'
I0719 23:37:00.069279  5869 slave.cpp:283] Agent using credential for: test-principal
I0719 23:37:00.069314  5869 credentials.hpp:37] Loading credentials for authentication from
'/tmp/Endpoint_SlaveEndpointTest_NoAuthorizer_0_ApGPk6/http_credentials'
I0719 23:37:00.069737  5869 http.cpp:993] Creating default 'basic' HTTP authenticator for
realm 'mesos-agent-readonly'
I0719 23:37:00.070015  5869 http.cpp:993] Creating default 'basic' HTTP authenticator for
realm 'mesos-agent-readwrite'
I0719 23:37:00.072388  5869 slave.cpp:565] Agent resources: [{"name":"cpus","scalar":{"value":2.0},"type":"SCALAR"},{"name":"mem","scalar":{"value":1024.0},"type":"SCALAR"},{"name":"disk","scalar":{"value":1024.0},"type":"SCALAR"},{"name":"ports","ranges":{"range":[{"begin":31000,"end":32000}]},"type":"RANGES"}]
I0719 23:37:00.072849  5869 slave.cpp:573] Agent attributes: [  ]
I0719 23:37:00.072870  5869 slave.cpp:582] Agent hostname: 5625d92fc09d
I0719 23:37:00.073271  5867 status_update_manager.cpp:177] Pausing sending status updates
I0719 23:37:00.075224  5870 state.cpp:64] Recovering state from '/tmp/Endpoint_SlaveEndpointTest_NoAuthorizer_0_nVWGwu/meta'
I0719 23:37:00.075850  5871 status_update_manager.cpp:203] Recovering status update manager
I0719 23:37:00.076102  5871 containerizer.cpp:582] Recovering containerizer
I0719 23:37:00.078313  5871 provisioner.cpp:416] Provisioner recovery complete
I0719 23:37:00.078984  5864 slave.cpp:6207] Finished recovery
I0719 23:37:00.079641  5864 slave.cpp:6389] Querying resource estimator for oversubscribable
resources
I0719 23:37:00.080019  5870 slave.cpp:6403] Received oversubscribable resources {} from the
resource estimator
I0719 23:37:00.084223  5870 process.cpp:3837] Handling HTTP event for process 'slave(793)'
with path: '/slave(793)/monitor/statistics'
I0719 23:37:00.086208  5871 http.cpp:1133] HTTP GET for /slave(793)/monitor/statistics from
172.17.0.2:48712
I0719 23:37:00.086364  5871 http.cpp:957] Authorizing principal 'test-principal' to GET the
'/monitor/statistics' endpoint
I0719 23:37:00.099758  5864 slave.cpp:843] Agent terminating
[       OK ] Endpoint/SlaveEndpointTest.NoAuthorizer/0 (54 ms)
[ RUN      ] Endpoint/SlaveEndpointTest.NoAuthorizer/1
I0719 23:37:00.116883  5845 containerizer.cpp:230] Using isolation: posix/cpu,posix/mem,filesystem/posix,network/cni,environment_secret
W0719 23:37:00.117821  5845 backend.cpp:76] Failed to create 'overlay' backend: OverlayBackend
requires root privileges
W0719 23:37:00.118032  5845 backend.cpp:76] Failed to create 'bind' backend: BindBackend requires
root privileges
I0719 23:37:00.118093  5845 provisioner.cpp:255] Using default backend 'copy'
I0719 23:37:00.121538  5845 cluster.cpp:448] Creating default 'local' authorizer
I0719 23:37:00.124871  5868 slave.cpp:250] Mesos agent started on (794)@172.17.0.2:39443
I0719 23:37:00.124917  5868 slave.cpp:251] Flags at startup: --acls="" --appc_simple_discovery_uri_prefix="http://"
--appc_store_dir="/tmp/Endpoint_SlaveEndpointTest_NoAuthorizer_1_UhUk3x/store/appc" --authenticate_http_readonly="true"
--authenticate_http_readwrite="true" --authenticatee="crammd5" --authentication_backoff_factor="1secs"
--authorizer="local" --cgroups_cpu_enable_pids_and_tids_count="false" --cgroups_enable_cfs="false"
--cgroups_hierarchy="/sys/fs/cgroup" --cgroups_limit_swap="false" --cgroups_root="mesos" --container_disk_watch_interval="15secs"
--containerizers="mesos" --credential="/tmp/Endpoint_SlaveEndpointTest_NoAuthorizer_1_UhUk3x/credential"
--default_role="*" --disk_watch_interval="1mins" --docker="docker" --docker_kill_orphans="true"
--docker_registry="https://registry-1.docker.io" --docker_remove_delay="6hrs" --docker_socket="/var/run/docker.sock"
--docker_stop_timeout="0ns" --docker_store_dir="/tmp/Endpoint_SlaveEndpointTest_NoAuthorizer_1_UhUk3x/store/docker"
--docker_volume_checkpoint_dir="/var/run/mesos/isolators/docker/volume" --enforce_container_disk_quota="false"
--executor_registration_timeout="1mins" --executor_reregistration_timeout="2secs" --executor_shutdown_grace_period="5secs"
--fetcher_cache_dir="/tmp/Endpoint_SlaveEndpointTest_NoAuthorizer_1_UhUk3x/fetch" --fetcher_cache_size="2GB"
--frameworks_home="" --gc_delay="1weeks" --gc_disk_headroom="0.1" --hadoop_home="" --help="false"
--hostname_lookup="true" --http_command_executor="false" --http_credentials="/tmp/Endpoint_SlaveEndpointTest_NoAuthorizer_1_UhUk3x/http_credentials"
--http_heartbeat_interval="30secs" --initialize_driver_logging="true" --isolation="posix/cpu,posix/mem"
--launcher="posix" --launcher_dir="/mesos/mesos-1.4.0/_build/src" --logbufsecs="0" --logging_level="INFO"
--max_completed_executors_per_framework="150" --oversubscribed_resources_interval="15secs"
--perf_duration="10secs" --perf_interval="1mins" --port="5051" --qos_correction_interval_min="0ns"
--quiet="false" --recover="reconnect" --recovery_timeout="15mins" --registration_backoff_factor="10ms"
--resources="cpus:2;gpus:0;mem:1024;disk:1024;ports:[31000-32000]" --revocable_cpu_low_priority="true"
--runtime_dir="/tmp/Endpoint_SlaveEndpointTest_NoAuthorizer_1_UhUk3x" --sandbox_directory="/mnt/mesos/sandbox"
--strict="true" --switch_user="true" --systemd_enable_support="true" --systemd_runtime_directory="/run/systemd/system"
--version="false" --work_dir="/tmp/Endpoint_SlaveEndpointTest_NoAuthorizer_1_VS3i6V"
I0719 23:37:00.125660  5868 credentials.hpp:86] Loading credential for authentication from
'/tmp/Endpoint_SlaveEndpointTest_NoAuthorizer_1_UhUk3x/credential'
I0719 23:37:00.125923  5868 slave.cpp:283] Agent using credential for: test-principal
I0719 23:37:00.125952  5868 credentials.hpp:37] Loading credentials for authentication from
'/tmp/Endpoint_SlaveEndpointTest_NoAuthorizer_1_UhUk3x/http_credentials'
I0719 23:37:00.126349  5868 http.cpp:993] Creating default 'basic' HTTP authenticator for
realm 'mesos-agent-readonly'
I0719 23:37:00.126590  5868 http.cpp:993] Creating default 'basic' HTTP authenticator for
realm 'mesos-agent-readwrite'
I0719 23:37:00.128823  5868 slave.cpp:565] Agent resources: [{"name":"cpus","scalar":{"value":2.0},"type":"SCALAR"},{"name":"mem","scalar":{"value":1024.0},"type":"SCALAR"},{"name":"disk","scalar":{"value":1024.0},"type":"SCALAR"},{"name":"ports","ranges":{"range":[{"begin":31000,"end":32000}]},"type":"RANGES"}]
I0719 23:37:00.129274  5868 slave.cpp:573] Agent attributes: [  ]
I0719 23:37:00.129302  5868 slave.cpp:582] Agent hostname: 5625d92fc09d
I0719 23:37:00.129511  5867 status_update_manager.cpp:177] Pausing sending status updates
I0719 23:37:00.131664  5870 state.cpp:64] Recovering state from '/tmp/Endpoint_SlaveEndpointTest_NoAuthorizer_1_VS3i6V/meta'
I0719 23:37:00.132357  5866 status_update_manager.cpp:203] Recovering status update manager
I0719 23:37:00.132597  5866 containerizer.cpp:582] Recovering containerizer
I0719 23:37:00.134786  5871 provisioner.cpp:416] Provisioner recovery complete
I0719 23:37:00.135531  5870 slave.cpp:6207] Finished recovery
I0719 23:37:00.136170  5870 slave.cpp:6389] Querying resource estimator for oversubscribable
resources
I0719 23:37:00.136538  5866 slave.cpp:6403] Received oversubscribable resources {} from the
resource estimator
I0719 23:37:00.140678  5864 process.cpp:3837] Handling HTTP event for process 'slave(794)'
with path: '/slave(794)/monitor/statistics.json'
I0719 23:37:00.142967  5867 http.cpp:1133] HTTP GET for /slave(794)/monitor/statistics.json
from 172.17.0.2:48714
I0719 23:37:00.143113  5867 http.cpp:957] Authorizing principal 'test-principal' to GET the
'/monitor/statistics.json' endpoint
I0719 23:37:00.149039  5870 slave.cpp:843] Agent terminating
[       OK ] Endpoint/SlaveEndpointTest.NoAuthorizer/1 (55 ms)
[ RUN      ] Endpoint/SlaveEndpointTest.NoAuthorizer/2
I0719 23:37:00.172811  5845 containerizer.cpp:230] Using isolation: posix/cpu,posix/mem,filesystem/posix,network/cni,environment_secret
W0719 23:37:00.173611  5845 backend.cpp:76] Failed to create 'overlay' backend: OverlayBackend
requires root privileges
W0719 23:37:00.173779  5845 backend.cpp:76] Failed to create 'bind' backend: BindBackend requires
root privileges
I0719 23:37:00.173822  5845 provisioner.cpp:255] Using default backend 'copy'
I0719 23:37:00.176793  5845 cluster.cpp:448] Creating default 'local' authorizer
I0719 23:37:00.183966  5866 slave.cpp:250] Mesos agent started on (795)@172.17.0.2:39443
I0719 23:37:00.184016  5866 slave.cpp:251] Flags at startup: --acls="" --appc_simple_discovery_uri_prefix="http://"
--appc_store_dir="/tmp/Endpoint_SlaveEndpointTest_NoAuthorizer_2_iGj5l0/store/appc" --authenticate_http_readonly="true"
--authenticate_http_readwrite="true" --authenticatee="crammd5" --authentication_backoff_factor="1secs"
--authorizer="local" --cgroups_cpu_enable_pids_and_tids_count="false" --cgroups_enable_cfs="false"
--cgroups_hierarchy="/sys/fs/cgroup" --cgroups_limit_swap="false" --cgroups_root="mesos" --container_disk_watch_interval="15secs"
--containerizers="mesos" --credential="/tmp/Endpoint_SlaveEndpointTest_NoAuthorizer_2_iGj5l0/credential"
--default_role="*" --disk_watch_interval="1mins" --docker="docker" --docker_kill_orphans="true"
--docker_registry="https://registry-1.docker.io" --docker_remove_delay="6hrs" --docker_socket="/var/run/docker.sock"
--docker_stop_timeout="0ns" --docker_store_dir="/tmp/Endpoint_SlaveEndpointTest_NoAuthorizer_2_iGj5l0/store/docker"
--docker_volume_checkpoint_dir="/var/run/mesos/isolators/docker/volume" --enforce_container_disk_quota="false"
--executor_registration_timeout="1mins" --executor_reregistration_timeout="2secs" --executor_shutdown_grace_period="5secs"
--fetcher_cache_dir="/tmp/Endpoint_SlaveEndpointTest_NoAuthorizer_2_iGj5l0/fetch" --fetcher_cache_size="2GB"
--frameworks_home="" --gc_delay="1weeks" --gc_disk_headroom="0.1" --hadoop_home="" --help="false"
--hostname_lookup="true" --http_command_executor="false" --http_credentials="/tmp/Endpoint_SlaveEndpointTest_NoAuthorizer_2_iGj5l0/http_credentials"
--http_heartbeat_interval="30secs" --initialize_driver_logging="true" --isolation="posix/cpu,posix/mem"
--launcher="posix" --launcher_dir="/mesos/mesos-1.4.0/_build/src" --logbufsecs="0" --logging_level="INFO"
--max_completed_executors_per_framework="150" --oversubscribed_resources_interval="15secs"
--perf_duration="10secs" --perf_interval="1mins" --port="5051" --qos_correction_interval_min="0ns"
--quiet="false" --recover="reconnect" --recovery_timeout="15mins" --registration_backoff_factor="10ms"
--resources="cpus:2;gpus:0;mem:1024;disk:1024;ports:[31000-32000]" --revocable_cpu_low_priority="true"
--runtime_dir="/tmp/Endpoint_SlaveEndpointTest_NoAuthorizer_2_iGj5l0" --sandbox_directory="/mnt/mesos/sandbox"
--strict="true" --switch_user="true" --systemd_enable_support="true" --systemd_runtime_directory="/run/systemd/system"
--version="false" --work_dir="/tmp/Endpoint_SlaveEndpointTest_NoAuthorizer_2_bBVYfo"
I0719 23:37:00.184872  5866 credentials.hpp:86] Loading credential for authentication from
'/tmp/Endpoint_SlaveEndpointTest_NoAuthorizer_2_iGj5l0/credential'
I0719 23:37:00.185165  5866 slave.cpp:283] Agent using credential for: test-principal
I0719 23:37:00.185195  5866 credentials.hpp:37] Loading credentials for authentication from
'/tmp/Endpoint_SlaveEndpointTest_NoAuthorizer_2_iGj5l0/http_credentials'
I0719 23:37:00.185592  5866 http.cpp:993] Creating default 'basic' HTTP authenticator for
realm 'mesos-agent-readonly'
I0719 23:37:00.185866  5866 http.cpp:993] Creating default 'basic' HTTP authenticator for
realm 'mesos-agent-readwrite'
I0719 23:37:00.188441  5866 slave.cpp:565] Agent resources: [{"name":"cpus","scalar":{"value":2.0},"type":"SCALAR"},{"name":"mem","scalar":{"value":1024.0},"type":"SCALAR"},{"name":"disk","scalar":{"value":1024.0},"type":"SCALAR"},{"name":"ports","ranges":{"range":[{"begin":31000,"end":32000}]},"type":"RANGES"}]
I0719 23:37:00.188949  5866 slave.cpp:573] Agent attributes: [  ]
I0719 23:37:00.188980  5866 slave.cpp:582] Agent hostname: 5625d92fc09d
I0719 23:37:00.189275  5867 status_update_manager.cpp:177] Pausing sending status updates
I0719 23:37:00.192209  5869 state.cpp:64] Recovering state from '/tmp/Endpoint_SlaveEndpointTest_NoAuthorizer_2_bBVYfo/meta'
I0719 23:37:00.192947  5868 status_update_manager.cpp:203] Recovering status update manager
I0719 23:37:00.193294  5866 containerizer.cpp:582] Recovering containerizer
I0719 23:37:00.196169  5864 provisioner.cpp:416] Provisioner recovery complete
I0719 23:37:00.196765  5867 slave.cpp:6207] Finished recovery
I0719 23:37:00.197510  5867 slave.cpp:6389] Querying resource estimator for oversubscribable
resources
I0719 23:37:00.197957  5868 slave.cpp:6403] Received oversubscribable resources {} from the
resource estimator
I0719 23:37:00.204068  5868 process.cpp:3837] Handling HTTP event for process 'slave(795)'
with path: '/slave(795)/containers'
I0719 23:37:00.206866  5864 http.cpp:1133] HTTP GET for /slave(795)/containers from 172.17.0.2:48720
I0719 23:37:00.207020  5864 http.cpp:957] Authorizing principal 'test-principal' to GET the
'/containers' endpoint
I0719 23:37:00.214321  5870 slave.cpp:843] Agent terminating
[       OK ] Endpoint/SlaveEndpointTest.NoAuthorizer/2 (65 ms)
[----------] 9 tests from Endpoint/SlaveEndpointTest (543 ms total)

[----------] Global test environment tear-down
[==========] 1634 tests from 179 test cases ran. (825558 ms total)
[  PASSED  ] 1628 tests.
[  FAILED  ] 6 tests, listed below:
[  FAILED  ] CommandExecutorCheckTest.CommandCheckDeliveredAndReconciled
[  FAILED  ] DefaultExecutorCheckTest.CommandCheckDeliveredAndReconciled
[  FAILED  ] DefaultExecutorCheckTest.CommandCheckStatusChange
[  FAILED  ] DefaultExecutorCheckTest.CommandCheckSeesParentsEnv
[  FAILED  ] DefaultExecutorCheckTest.CommandCheckSharesWorkDirWithTask
[  FAILED  ] MasterTest.IgnoreOldAgentReregistration

 6 FAILED TESTS
  YOU HAVE 20 DISABLED TESTS

I0719 23:37:00.380678  5872 process.cpp:1006] Failed to accept socket: future discarded
make[4]: *** [check-local] Error 1
make[4]: Leaving directory `/mesos/mesos-1.4.0/_build/src'
make[3]: *** [check-am] Error 2
make[3]: Leaving directory `/mesos/mesos-1.4.0/_build/src'
make[2]: *** [check] Error 2
make[2]: Leaving directory `/mesos/mesos-1.4.0/_build/src'
make[1]: *** [check-recursive] Error 1
make[1]: Leaving directory `/mesos/mesos-1.4.0/_build'
make: *** [distcheck] Error 1
+ docker rmi mesos-1500502357-32643
Untagged: mesos-1500502357-32643:latest
Deleted: sha256:da074dc77cbea48c29607c077ae87878767e8104c29e71b7b3b2fb0e242916fd
Deleted: sha256:dd4e4fc70d5b5f42840594aac4fd20f56c97ae0f52a2f835a4617f63a9dc38ad
Deleted: sha256:51dc1689b4d6d19a372037a012d6f6f7031b65971bae6bb3c3fccb6735b3769e
Deleted: sha256:b15c6889a3a6c8ca9c65bacb79b2ef7f598623645764e7715f7f1c4b5a89bba1
Deleted: sha256:2f27aa2dc4a4b23dd4c05587fe40e26dad552bbe79e46e411a6270d61e51f5a7
Deleted: sha256:99291816d08a4ce15d056729632efe18845539e8d9d8429ac0f7aebcdef14392
Deleted: sha256:d9b7528ffb12cd70eb17c2119eefeab84fc3912b912a0f5aa3b782aef53c701d
Deleted: sha256:c9bfb1920fc25b912913ec641833d361ef1a4d3674d0187031a4f07d3e402f39
Deleted: sha256:4e2ce7a83103415a7755d4b96ecb57eea2463ffdfa580189642614ac7a794959
Deleted: sha256:9033d6e6b8c1784231f07f68f8a9a75fdbaca89e01db00b115cd16b6aafdee9a
Deleted: sha256:85c6fa423d9e0b4921c528cd5d40442489775fe74b74c2d624add38eb49c1aa3
Deleted: sha256:677133682d2ddb43b2333632ee69ffa49148bc3cbe9569852a61c986f6764459
Deleted: sha256:a572cd76bcbbdba7eeda519a3f8f55ef2bfeb6cdaa71565a7913e3ec618dd438
Deleted: sha256:de27b996367e1f659a8ebd185817231a450688443ddc621d2f260dd9bc18b445
Deleted: sha256:11fffaee1035ce9aa241dadf3ff8e95590752e05a4394e5ec58d844d1950e2d6
Deleted: sha256:968d4e7bb313e0b43befa1e7e6813e4d9eb65deab219668f7bc82f3175a5fc98
Deleted: sha256:6db3dba9c44442a4bc31979399cb9584012d30aa5040c74a4c717692887a45e2
Deleted: sha256:1d373f2c057e652dfdfa25b3c8c7bccb07def6e7bcb6fb428c32cfc2580f9466
Deleted: sha256:ea68d76cb36dd13f3529dc8dd2dfb78d2d85dc42507d5eb8e8961ed2a4d2df53
Deleted: sha256:f4f46b1ba66066f8508b388ca83b3fa6c017530b1d334f0fdaa6e1a2aefeae00
Deleted: sha256:fc70bb032f075bf7e1f31d613fe8c5595d4af554a629ff54cdc4f785aa55d849
Deleted: sha256:dcbf9e1dd2cce1f36a371b7be3a44893622016f5d2a117fc5bddcf1891fc9eae
Deleted: sha256:9011a9638bb36b2609ef2d6462fcf35bbdb108c27b41c437107835b4f268af72
Deleted: sha256:3193c9232a1b7b76bb31248a270de63471c54be89c15713f81e2a54e1244ce6b
Deleted: sha256:1b2532368d1b01c21ca8eb01bcebad2462467274f2520fa66cee4127f8b52a59
Build step 'Execute shell' marked build as failure
Not sending mail to unregistered user yujie.jay@gmail.com
Not sending mail to unregistered user benjamin.hindman@gmail.com

Mime
View raw message