mesos-builds mailing list archives

Site index · List index
Message view « Date » · « Thread »
Top « Date » · « Thread »
From Apache Jenkins Server <jenk...@builds.apache.org>
Subject Build failed in Jenkins: Mesos-Buildbot » cmake,gcc,--verbose --enable-libevent --enable-ssl,GLOG_v=1 MESOS_VERBOSE=1,ubuntu:14.04,(ubuntu)&&(!ubuntu-us1)&&(!ubuntu-eu2) #3869
Date Thu, 06 Jul 2017 14:00:27 GMT
See <https://builds.apache.org/job/Mesos-Buildbot/BUILDTOOL=cmake,COMPILER=gcc,CONFIGURATION=--verbose%20--enable-libevent%20--enable-ssl,ENVIRONMENT=GLOG_v=1%20MESOS_VERBOSE=1,OS=ubuntu%3A14.04,label_exp=(ubuntu)&&(!ubuntu-us1)&&(!ubuntu-eu2)/3869/display/redirect?page=changes>

Changes:

[alexander] Adding Alexander Rojas in the committer list.

------------------------------------------
[...truncated 29.31 MB...]
I0706 14:00:14.216192 10497 slave.cpp:578] Agent hostname: localhost
I0706 14:00:14.216379 10492 status_update_manager.cpp:177] Pausing sending status updates
I0706 14:00:14.217610 10485 state.cpp:64] Recovering state from '/tmp/Endpoint_SlaveEndpointTest_UnauthorizedRequest_0_LYrakc/meta'
I0706 14:00:14.217912 10504 status_update_manager.cpp:203] Recovering status update manager
I0706 14:00:14.218132 10498 containerizer.cpp:582] Recovering containerizer
I0706 14:00:14.219689 10487 provisioner.cpp:416] Provisioner recovery complete
I0706 14:00:14.220101 10490 slave.cpp:6189] Finished recovery
I0706 14:00:14.220628 10490 slave.cpp:6371] Querying resource estimator for oversubscribable
resources
I0706 14:00:14.220994 10498 slave.cpp:6385] Received oversubscribable resources {} from the
resource estimator
I0706 14:00:14.223037 10498 process.cpp:3779] Handling HTTP event for process 'slave(782)'
with path: '/slave(782)/monitor/statistics'
I0706 14:00:14.224457 10490 http.cpp:1116] HTTP GET for /slave(782)/monitor/statistics from
127.0.0.1:50426
I0706 14:00:14.224519 10490 http.cpp:937] Authorizing principal 'test-principal' to GET the
'/monitor/statistics' endpoint
I0706 14:00:14.226689 10486 slave.cpp:839] Agent terminating
[       OK ] Endpoint/SlaveEndpointTest.UnauthorizedRequest/0 (29 ms)
[ RUN      ] Endpoint/SlaveEndpointTest.UnauthorizedRequest/1
I0706 14:00:14.236711  2608 containerizer.cpp:230] Using isolation: posix/cpu,posix/mem,filesystem/posix,network/cni,environment_secret
W0706 14:00:14.237210  2608 backend.cpp:76] Failed to create 'aufs' backend: AufsBackend requires
root privileges
W0706 14:00:14.237304  2608 backend.cpp:76] Failed to create 'bind' backend: BindBackend requires
root privileges
I0706 14:00:14.237334  2608 provisioner.cpp:255] Using default backend 'copy'
I0706 14:00:14.240128 10482 slave.cpp:250] Mesos agent started on (783)@127.0.0.1:36533
I0706 14:00:14.240144 10482 slave.cpp:251] Flags at startup: --acls="" --appc_simple_discovery_uri_prefix="http://"
--appc_store_dir="/tmp/Endpoint_SlaveEndpointTest_UnauthorizedRequest_1_nhmP0n/store/appc"
--authenticate_http_executors="true" --authenticate_http_readonly="true" --authenticate_http_readwrite="true"
--authenticatee="crammd5" --authentication_backoff_factor="1secs" --authorizer="local" --cgroups_cpu_enable_pids_and_tids_count="false"
--cgroups_enable_cfs="false" --cgroups_hierarchy="/sys/fs/cgroup" --cgroups_limit_swap="false"
--cgroups_root="mesos" --container_disk_watch_interval="15secs" --containerizers="mesos" --credential="/tmp/Endpoint_SlaveEndpointTest_UnauthorizedRequest_1_nhmP0n/credential"
--default_role="*" --disk_watch_interval="1mins" --docker="docker" --docker_kill_orphans="true"
--docker_registry="https://registry-1.docker.io" --docker_remove_delay="6hrs" --docker_socket="/var/run/docker.sock"
--docker_stop_timeout="0ns" --docker_store_dir="/tmp/Endpoint_SlaveEndpointTest_UnauthorizedRequest_1_nhmP0n/store/docker"
--docker_volume_checkpoint_dir="/var/run/mesos/isolators/docker/volume" --enforce_container_disk_quota="false"
--executor_registration_timeout="1mins" --executor_reregistration_timeout="2secs" --executor_secret_key="/tmp/Endpoint_SlaveEndpointTest_UnauthorizedRequest_1_nhmP0n/executor_secret_key"
--executor_shutdown_grace_period="5secs" --fetcher_cache_dir="/tmp/Endpoint_SlaveEndpointTest_UnauthorizedRequest_1_nhmP0n/fetch"
--fetcher_cache_size="2GB" --frameworks_home="" --gc_delay="1weeks" --gc_disk_headroom="0.1"
--hadoop_home="" --help="false" --hostname_lookup="true" --http_command_executor="false" --http_credentials="/tmp/Endpoint_SlaveEndpointTest_UnauthorizedRequest_1_nhmP0n/http_credentials"
--http_heartbeat_interval="30secs" --initialize_driver_logging="true" --isolation="posix/cpu,posix/mem"
--launcher="posix" --launcher_dir="/mesos/build/src" --logbufsecs="0" --logging_level="INFO"
--max_completed_executors_per_framework="150" --oversubscribed_resources_interval="15secs"
--perf_duration="10secs" --perf_interval="1mins" --port="5051" --qos_correction_interval_min="0ns"
--quiet="false" --recover="reconnect" --recovery_timeout="15mins" --registration_backoff_factor="10ms"
--resources="cpus:2;gpus:0;mem:1024;disk:1024;ports:[31000-32000]" --revocable_cpu_low_priority="true"
--runtime_dir="/tmp/Endpoint_SlaveEndpointTest_UnauthorizedRequest_1_nhmP0n" --sandbox_directory="/mnt/mesos/sandbox"
--strict="true" --switch_user="true" --systemd_enable_support="true" --systemd_runtime_directory="/run/systemd/system"
--version="false" --work_dir="/tmp/Endpoint_SlaveEndpointTest_UnauthorizedRequest_1_aliKf9"
W0706 14:00:14.240496 10482 slave.cpp:254] 
**************************************************
Agent bound to loopback interface! Cannot communicate with remote master(s). You might want
to set '--ip' flag to a routable IP address.
**************************************************
I0706 14:00:14.240507 10482 credentials.hpp:86] Loading credential for authentication from
'/tmp/Endpoint_SlaveEndpointTest_UnauthorizedRequest_1_nhmP0n/credential'
I0706 14:00:14.240623 10482 slave.cpp:283] Agent using credential for: test-principal
I0706 14:00:14.240635 10482 credentials.hpp:37] Loading credentials for authentication from
'/tmp/Endpoint_SlaveEndpointTest_UnauthorizedRequest_1_nhmP0n/http_credentials'
I0706 14:00:14.240839 10482 http.cpp:976] Creating default 'basic' HTTP authenticator for
realm 'mesos-agent-executor'
I0706 14:00:14.240921 10482 http.cpp:997] Creating default 'jwt' HTTP authenticator for realm
'mesos-agent-executor'
I0706 14:00:14.241086 10482 http.cpp:976] Creating default 'basic' HTTP authenticator for
realm 'mesos-agent-readonly'
I0706 14:00:14.241168 10482 http.cpp:997] Creating default 'jwt' HTTP authenticator for realm
'mesos-agent-readonly'
I0706 14:00:14.241319 10482 http.cpp:976] Creating default 'basic' HTTP authenticator for
realm 'mesos-agent-readwrite'
I0706 14:00:14.241399 10482 http.cpp:997] Creating default 'jwt' HTTP authenticator for realm
'mesos-agent-readwrite'
I0706 14:00:14.242714 10482 slave.cpp:565] Agent resources: [{"name":"cpus","scalar":{"value":2.0},"type":"SCALAR"},{"name":"mem","scalar":{"value":1024.0},"type":"SCALAR"},{"name":"disk","scalar":{"value":1024.0},"type":"SCALAR"},{"name":"ports","ranges":{"range":[{"begin":31000,"end":32000}]},"type":"RANGES"}]
I0706 14:00:14.242919 10482 slave.cpp:573] Agent attributes: [  ]
I0706 14:00:14.242933 10482 slave.cpp:578] Agent hostname: localhost
I0706 14:00:14.243115 10502 status_update_manager.cpp:177] Pausing sending status updates
I0706 14:00:14.244284 10495 state.cpp:64] Recovering state from '/tmp/Endpoint_SlaveEndpointTest_UnauthorizedRequest_1_aliKf9/meta'
I0706 14:00:14.244568 10503 status_update_manager.cpp:203] Recovering status update manager
I0706 14:00:14.244837 10494 containerizer.cpp:582] Recovering containerizer
I0706 14:00:14.246454 10486 provisioner.cpp:416] Provisioner recovery complete
I0706 14:00:14.246947 10495 slave.cpp:6189] Finished recovery
I0706 14:00:14.247608 10495 slave.cpp:6371] Querying resource estimator for oversubscribable
resources
I0706 14:00:14.247956 10484 slave.cpp:6385] Received oversubscribable resources {} from the
resource estimator
I0706 14:00:14.250366 10481 process.cpp:3779] Handling HTTP event for process 'slave(783)'
with path: '/slave(783)/monitor/statistics.json'
I0706 14:00:14.252068 10490 http.cpp:1116] HTTP GET for /slave(783)/monitor/statistics.json
from 127.0.0.1:50430
I0706 14:00:14.252131 10490 http.cpp:937] Authorizing principal 'test-principal' to GET the
'/monitor/statistics.json' endpoint
I0706 14:00:14.254108 10482 slave.cpp:839] Agent terminating
[       OK ] Endpoint/SlaveEndpointTest.UnauthorizedRequest/1 (27 ms)
[ RUN      ] Endpoint/SlaveEndpointTest.UnauthorizedRequest/2
I0706 14:00:14.264523  2608 containerizer.cpp:230] Using isolation: posix/cpu,posix/mem,filesystem/posix,network/cni,environment_secret
W0706 14:00:14.265036  2608 backend.cpp:76] Failed to create 'aufs' backend: AufsBackend requires
root privileges
W0706 14:00:14.265126  2608 backend.cpp:76] Failed to create 'bind' backend: BindBackend requires
root privileges
I0706 14:00:14.265153  2608 provisioner.cpp:255] Using default backend 'copy'
I0706 14:00:14.270020 10493 slave.cpp:250] Mesos agent started on (784)@127.0.0.1:36533
I0706 14:00:14.270054 10493 slave.cpp:251] Flags at startup: --acls="" --appc_simple_discovery_uri_prefix="http://"
--appc_store_dir="/tmp/Endpoint_SlaveEndpointTest_UnauthorizedRequest_2_NzR9gl/store/appc"
--authenticate_http_executors="true" --authenticate_http_readonly="true" --authenticate_http_readwrite="true"
--authenticatee="crammd5" --authentication_backoff_factor="1secs" --authorizer="local" --cgroups_cpu_enable_pids_and_tids_count="false"
--cgroups_enable_cfs="false" --cgroups_hierarchy="/sys/fs/cgroup" --cgroups_limit_swap="false"
--cgroups_root="mesos" --container_disk_watch_interval="15secs" --containerizers="mesos" --credential="/tmp/Endpoint_SlaveEndpointTest_UnauthorizedRequest_2_NzR9gl/credential"
--default_role="*" --disk_watch_interval="1mins" --docker="docker" --docker_kill_orphans="true"
--docker_registry="https://registry-1.docker.io" --docker_remove_delay="6hrs" --docker_socket="/var/run/docker.sock"
--docker_stop_timeout="0ns" --docker_store_dir="/tmp/Endpoint_SlaveEndpointTest_UnauthorizedRequest_2_NzR9gl/store/docker"
--docker_volume_checkpoint_dir="/var/run/mesos/isolators/docker/volume" --enforce_container_disk_quota="false"
--executor_registration_timeout="1mins" --executor_reregistration_timeout="2secs" --executor_secret_key="/tmp/Endpoint_SlaveEndpointTest_UnauthorizedRequest_2_NzR9gl/executor_secret_key"
--executor_shutdown_grace_period="5secs" --fetcher_cache_dir="/tmp/Endpoint_SlaveEndpointTest_UnauthorizedRequest_2_NzR9gl/fetch"
--fetcher_cache_size="2GB" --frameworks_home="" --gc_delay="1weeks" --gc_disk_headroom="0.1"
--hadoop_home="" --help="false" --hostname_lookup="true" --http_command_executor="false" --http_credentials="/tmp/Endpoint_SlaveEndpointTest_UnauthorizedRequest_2_NzR9gl/http_credentials"
--http_heartbeat_interval="30secs" --initialize_driver_logging="true" --isolation="posix/cpu,posix/mem"
--launcher="posix" --launcher_dir="/mesos/build/src" --logbufsecs="0" --logging_level="INFO"
--max_completed_executors_per_framework="150" --oversubscribed_resources_interval="15secs"
--perf_duration="10secs" --perf_interval="1mins" --port="5051" --qos_correction_interval_min="0ns"
--quiet="false" --recover="reconnect" --recovery_timeout="15mins" --registration_backoff_factor="10ms"
--resources="cpus:2;gpus:0;mem:1024;disk:1024;ports:[31000-32000]" --revocable_cpu_low_priority="true"
--runtime_dir="/tmp/Endpoint_SlaveEndpointTest_UnauthorizedRequest_2_NzR9gl" --sandbox_directory="/mnt/mesos/sandbox"
--strict="true" --switch_user="true" --systemd_enable_support="true" --systemd_runtime_directory="/run/systemd/system"
--version="false" --work_dir="/tmp/Endpoint_SlaveEndpointTest_UnauthorizedRequest_2_n35Xr6"
W0706 14:00:14.270511 10493 slave.cpp:254] 
**************************************************
Agent bound to loopback interface! Cannot communicate with remote master(s). You might want
to set '--ip' flag to a routable IP address.
**************************************************
I0706 14:00:14.270520 10493 credentials.hpp:86] Loading credential for authentication from
'/tmp/Endpoint_SlaveEndpointTest_UnauthorizedRequest_2_NzR9gl/credential'
I0706 14:00:14.270741 10493 slave.cpp:283] Agent using credential for: test-principal
I0706 14:00:14.270753 10493 credentials.hpp:37] Loading credentials for authentication from
'/tmp/Endpoint_SlaveEndpointTest_UnauthorizedRequest_2_NzR9gl/http_credentials'
I0706 14:00:14.271014 10493 http.cpp:976] Creating default 'basic' HTTP authenticator for
realm 'mesos-agent-executor'
I0706 14:00:14.271165 10493 http.cpp:997] Creating default 'jwt' HTTP authenticator for realm
'mesos-agent-executor'
I0706 14:00:14.271399 10493 http.cpp:976] Creating default 'basic' HTTP authenticator for
realm 'mesos-agent-readonly'
I0706 14:00:14.271493 10493 http.cpp:997] Creating default 'jwt' HTTP authenticator for realm
'mesos-agent-readonly'
I0706 14:00:14.271796 10493 http.cpp:976] Creating default 'basic' HTTP authenticator for
realm 'mesos-agent-readwrite'
I0706 14:00:14.271885 10493 http.cpp:997] Creating default 'jwt' HTTP authenticator for realm
'mesos-agent-readwrite'
I0706 14:00:14.273680 10493 slave.cpp:565] Agent resources: [{"name":"cpus","scalar":{"value":2.0},"type":"SCALAR"},{"name":"mem","scalar":{"value":1024.0},"type":"SCALAR"},{"name":"disk","scalar":{"value":1024.0},"type":"SCALAR"},{"name":"ports","ranges":{"range":[{"begin":31000,"end":32000}]},"type":"RANGES"}]
I0706 14:00:14.273886 10493 slave.cpp:573] Agent attributes: [  ]
I0706 14:00:14.273897 10493 slave.cpp:578] Agent hostname: localhost
I0706 14:00:14.274089 10489 status_update_manager.cpp:177] Pausing sending status updates
I0706 14:00:14.275887 10496 state.cpp:64] Recovering state from '/tmp/Endpoint_SlaveEndpointTest_UnauthorizedRequest_2_n35Xr6/meta'
I0706 14:00:14.276518 10497 status_update_manager.cpp:203] Recovering status update manager
I0706 14:00:14.276680 10497 containerizer.cpp:582] Recovering containerizer
I0706 14:00:14.278331 10481 provisioner.cpp:416] Provisioner recovery complete
I0706 14:00:14.278738 10502 slave.cpp:6189] Finished recovery
I0706 14:00:14.279325 10502 slave.cpp:6371] Querying resource estimator for oversubscribable
resources
I0706 14:00:14.279548 10485 slave.cpp:6385] Received oversubscribable resources {} from the
resource estimator
I0706 14:00:14.282268 10482 process.cpp:3779] Handling HTTP event for process 'slave(784)'
with path: '/slave(784)/containers'
I0706 14:00:14.284446 10482 http.cpp:1116] HTTP GET for /slave(784)/containers from 127.0.0.1:50448
I0706 14:00:14.284538 10482 http.cpp:937] Authorizing principal 'test-principal' to GET the
'/containers' endpoint
I0706 14:00:14.286931 10493 slave.cpp:839] Agent terminating
[       OK ] Endpoint/SlaveEndpointTest.UnauthorizedRequest/2 (35 ms)
[ RUN      ] Endpoint/SlaveEndpointTest.NoAuthorizer/0
I0706 14:00:14.299860  2608 containerizer.cpp:230] Using isolation: posix/cpu,posix/mem,filesystem/posix,network/cni,environment_secret
W0706 14:00:14.300396  2608 backend.cpp:76] Failed to create 'aufs' backend: AufsBackend requires
root privileges
W0706 14:00:14.300490  2608 backend.cpp:76] Failed to create 'bind' backend: BindBackend requires
root privileges
I0706 14:00:14.300524  2608 provisioner.cpp:255] Using default backend 'copy'
I0706 14:00:14.302387  2608 cluster.cpp:448] Creating default 'local' authorizer
I0706 14:00:14.304023 10481 slave.cpp:250] Mesos agent started on (785)@127.0.0.1:36533
I0706 14:00:14.304039 10481 slave.cpp:251] Flags at startup: --acls="" --appc_simple_discovery_uri_prefix="http://"
--appc_store_dir="/tmp/Endpoint_SlaveEndpointTest_NoAuthorizer_0_wCLTRi/store/appc" --authenticate_http_executors="true"
--authenticate_http_readonly="true" --authenticate_http_readwrite="true" --authenticatee="crammd5"
--authentication_backoff_factor="1secs" --authorizer="local" --cgroups_cpu_enable_pids_and_tids_count="false"
--cgroups_enable_cfs="false" --cgroups_hierarchy="/sys/fs/cgroup" --cgroups_limit_swap="false"
--cgroups_root="mesos" --container_disk_watch_interval="15secs" --containerizers="mesos" --credential="/tmp/Endpoint_SlaveEndpointTest_NoAuthorizer_0_wCLTRi/credential"
--default_role="*" --disk_watch_interval="1mins" --docker="docker" --docker_kill_orphans="true"
--docker_registry="https://registry-1.docker.io" --docker_remove_delay="6hrs" --docker_socket="/var/run/docker.sock"
--docker_stop_timeout="0ns" --docker_store_dir="/tmp/Endpoint_SlaveEndpointTest_NoAuthorizer_0_wCLTRi/store/docker"
--docker_volume_checkpoint_dir="/var/run/mesos/isolators/docker/volume" --enforce_container_disk_quota="false"
--executor_registration_timeout="1mins" --executor_reregistration_timeout="2secs" --executor_secret_key="/tmp/Endpoint_SlaveEndpointTest_NoAuthorizer_0_wCLTRi/executor_secret_key"
--executor_shutdown_grace_period="5secs" --fetcher_cache_dir="/tmp/Endpoint_SlaveEndpointTest_NoAuthorizer_0_wCLTRi/fetch"
--fetcher_cache_size="2GB" --frameworks_home="" --gc_delay="1weeks" --gc_disk_headroom="0.1"
--hadoop_home="" --help="false" --hostname_lookup="true" --http_command_executor="false" --http_credentials="/tmp/Endpoint_SlaveEndpointTest_NoAuthorizer_0_wCLTRi/http_credentials"
--http_heartbeat_interval="30secs" --initialize_driver_logging="true" --isolation="posix/cpu,posix/mem"
--launcher="posix" --launcher_dir="/mesos/build/src" --logbufsecs="0" --logging_level="INFO"
--max_completed_executors_per_framework="150" --oversubscribed_resources_interval="15secs"
--perf_duration="10secs" --perf_interval="1mins" --port="5051" --qos_correction_interval_min="0ns"
--quiet="false" --recover="reconnect" --recovery_timeout="15mins" --registration_backoff_factor="10ms"
--resources="cpus:2;gpus:0;mem:1024;disk:1024;ports:[31000-32000]" --revocable_cpu_low_priority="true"
--runtime_dir="/tmp/Endpoint_SlaveEndpointTest_NoAuthorizer_0_wCLTRi" --sandbox_directory="/mnt/mesos/sandbox"
--strict="true" --switch_user="true" --systemd_enable_support="true" --systemd_runtime_directory="/run/systemd/system"
--version="false" --work_dir="/tmp/Endpoint_SlaveEndpointTest_NoAuthorizer_0_49etX3"
W0706 14:00:14.304543 10481 slave.cpp:254] 
**************************************************
Agent bound to loopback interface! Cannot communicate with remote master(s). You might want
to set '--ip' flag to a routable IP address.
**************************************************
I0706 14:00:14.304555 10481 credentials.hpp:86] Loading credential for authentication from
'/tmp/Endpoint_SlaveEndpointTest_NoAuthorizer_0_wCLTRi/credential'
I0706 14:00:14.304698 10481 slave.cpp:283] Agent using credential for: test-principal
I0706 14:00:14.304710 10481 credentials.hpp:37] Loading credentials for authentication from
'/tmp/Endpoint_SlaveEndpointTest_NoAuthorizer_0_wCLTRi/http_credentials'
I0706 14:00:14.304936 10481 http.cpp:976] Creating default 'basic' HTTP authenticator for
realm 'mesos-agent-executor'
I0706 14:00:14.305047 10481 http.cpp:997] Creating default 'jwt' HTTP authenticator for realm
'mesos-agent-executor'
I0706 14:00:14.305223 10481 http.cpp:976] Creating default 'basic' HTTP authenticator for
realm 'mesos-agent-readonly'
I0706 14:00:14.305294 10481 http.cpp:997] Creating default 'jwt' HTTP authenticator for realm
'mesos-agent-readonly'
I0706 14:00:14.305536 10481 http.cpp:976] Creating default 'basic' HTTP authenticator for
realm 'mesos-agent-readwrite'
I0706 14:00:14.305613 10481 http.cpp:997] Creating default 'jwt' HTTP authenticator for realm
'mesos-agent-readwrite'
I0706 14:00:14.306933 10481 slave.cpp:565] Agent resources: [{"name":"cpus","scalar":{"value":2.0},"type":"SCALAR"},{"name":"mem","scalar":{"value":1024.0},"type":"SCALAR"},{"name":"disk","scalar":{"value":1024.0},"type":"SCALAR"},{"name":"ports","ranges":{"range":[{"begin":31000,"end":32000}]},"type":"RANGES"}]
I0706 14:00:14.307124 10481 slave.cpp:573] Agent attributes: [  ]
I0706 14:00:14.307134 10481 slave.cpp:578] Agent hostname: localhost
I0706 14:00:14.307268 10493 status_update_manager.cpp:177] Pausing sending status updates
I0706 14:00:14.308641 10498 state.cpp:64] Recovering state from '/tmp/Endpoint_SlaveEndpointTest_NoAuthorizer_0_49etX3/meta'
I0706 14:00:14.308960 10490 status_update_manager.cpp:203] Recovering status update manager
I0706 14:00:14.309211 10483 containerizer.cpp:582] Recovering containerizer
I0706 14:00:14.310662 10495 provisioner.cpp:416] Provisioner recovery complete
I0706 14:00:14.311059 10483 slave.cpp:6189] Finished recovery
I0706 14:00:14.311792 10483 slave.cpp:6371] Querying resource estimator for oversubscribable
resources
I0706 14:00:14.312032 10484 slave.cpp:6385] Received oversubscribable resources {} from the
resource estimator
I0706 14:00:14.314883 10489 process.cpp:3779] Handling HTTP event for process 'slave(785)'
with path: '/slave(785)/monitor/statistics'
I0706 14:00:14.317360 10481 http.cpp:1116] HTTP GET for /slave(785)/monitor/statistics from
127.0.0.1:50456
I0706 14:00:14.317462 10481 http.cpp:937] Authorizing principal 'test-principal' to GET the
'/monitor/statistics' endpoint
I0706 14:00:14.324147 10483 slave.cpp:839] Agent terminating
[       OK ] Endpoint/SlaveEndpointTest.NoAuthorizer/0 (44 ms)
[ RUN      ] Endpoint/SlaveEndpointTest.NoAuthorizer/1
I0706 14:00:14.345266  2608 containerizer.cpp:230] Using isolation: posix/cpu,posix/mem,filesystem/posix,network/cni,environment_secret
W0706 14:00:14.345873  2608 backend.cpp:76] Failed to create 'aufs' backend: AufsBackend requires
root privileges
W0706 14:00:14.345976  2608 backend.cpp:76] Failed to create 'bind' backend: BindBackend requires
root privileges
I0706 14:00:14.346040  2608 provisioner.cpp:255] Using default backend 'copy'
I0706 14:00:14.348011  2608 cluster.cpp:448] Creating default 'local' authorizer
I0706 14:00:14.350023 10501 slave.cpp:250] Mesos agent started on (786)@127.0.0.1:36533
I0706 14:00:14.350050 10501 slave.cpp:251] Flags at startup: --acls="" --appc_simple_discovery_uri_prefix="http://"
--appc_store_dir="/tmp/Endpoint_SlaveEndpointTest_NoAuthorizer_1_MfRBRg/store/appc" --authenticate_http_executors="true"
--authenticate_http_readonly="true" --authenticate_http_readwrite="true" --authenticatee="crammd5"
--authentication_backoff_factor="1secs" --authorizer="local" --cgroups_cpu_enable_pids_and_tids_count="false"
--cgroups_enable_cfs="false" --cgroups_hierarchy="/sys/fs/cgroup" --cgroups_limit_swap="false"
--cgroups_root="mesos" --container_disk_watch_interval="15secs" --containerizers="mesos" --credential="/tmp/Endpoint_SlaveEndpointTest_NoAuthorizer_1_MfRBRg/credential"
--default_role="*" --disk_watch_interval="1mins" --docker="docker" --docker_kill_orphans="true"
--docker_registry="https://registry-1.docker.io" --docker_remove_delay="6hrs" --docker_socket="/var/run/docker.sock"
--docker_stop_timeout="0ns" --docker_store_dir="/tmp/Endpoint_SlaveEndpointTest_NoAuthorizer_1_MfRBRg/store/docker"
--docker_volume_checkpoint_dir="/var/run/mesos/isolators/docker/volume" --enforce_container_disk_quota="false"
--executor_registration_timeout="1mins" --executor_reregistration_timeout="2secs" --executor_secret_key="/tmp/Endpoint_SlaveEndpointTest_NoAuthorizer_1_MfRBRg/executor_secret_key"
--executor_shutdown_grace_period="5secs" --fetcher_cache_dir="/tmp/Endpoint_SlaveEndpointTest_NoAuthorizer_1_MfRBRg/fetch"
--fetcher_cache_size="2GB" --frameworks_home="" --gc_delay="1weeks" --gc_disk_headroom="0.1"
--hadoop_home="" --help="false" --hostname_lookup="true" --http_command_executor="false" --http_credentials="/tmp/Endpoint_SlaveEndpointTest_NoAuthorizer_1_MfRBRg/http_credentials"
--http_heartbeat_interval="30secs" --initialize_driver_logging="true" --isolation="posix/cpu,posix/mem"
--launcher="posix" --launcher_dir="/mesos/build/src" --logbufsecs="0" --logging_level="INFO"
--max_completed_executors_per_framework="150" --oversubscribed_resources_interval="15secs"
--perf_duration="10secs" --perf_interval="1mins" --port="5051" --qos_correction_interval_min="0ns"
--quiet="false" --recover="reconnect" --recovery_timeout="15mins" --registration_backoff_factor="10ms"
--resources="cpus:2;gpus:0;mem:1024;disk:1024;ports:[31000-32000]" --revocable_cpu_low_priority="true"
--runtime_dir="/tmp/Endpoint_SlaveEndpointTest_NoAuthorizer_1_MfRBRg" --sandbox_directory="/mnt/mesos/sandbox"
--strict="true" --switch_user="true" --systemd_enable_support="true" --systemd_runtime_directory="/run/systemd/system"
--version="false" --work_dir="/tmp/Endpoint_SlaveEndpointTest_NoAuthorizer_1_LAirQ1"
W0706 14:00:14.350481 10501 slave.cpp:254] 
**************************************************
Agent bound to loopback interface! Cannot communicate with remote master(s). You might want
to set '--ip' flag to a routable IP address.
**************************************************
I0706 14:00:14.350491 10501 credentials.hpp:86] Loading credential for authentication from
'/tmp/Endpoint_SlaveEndpointTest_NoAuthorizer_1_MfRBRg/credential'
I0706 14:00:14.350708 10501 slave.cpp:283] Agent using credential for: test-principal
I0706 14:00:14.350720 10501 credentials.hpp:37] Loading credentials for authentication from
'/tmp/Endpoint_SlaveEndpointTest_NoAuthorizer_1_MfRBRg/http_credentials'
I0706 14:00:14.350961 10501 http.cpp:976] Creating default 'basic' HTTP authenticator for
realm 'mesos-agent-executor'
I0706 14:00:14.351086 10501 http.cpp:997] Creating default 'jwt' HTTP authenticator for realm
'mesos-agent-executor'
I0706 14:00:14.351258 10501 http.cpp:976] Creating default 'basic' HTTP authenticator for
realm 'mesos-agent-readonly'
I0706 14:00:14.351327 10501 http.cpp:997] Creating default 'jwt' HTTP authenticator for realm
'mesos-agent-readonly'
I0706 14:00:14.351582 10501 http.cpp:976] Creating default 'basic' HTTP authenticator for
realm 'mesos-agent-readwrite'
I0706 14:00:14.351662 10501 http.cpp:997] Creating default 'jwt' HTTP authenticator for realm
'mesos-agent-readwrite'
I0706 14:00:14.352977 10501 slave.cpp:565] Agent resources: [{"name":"cpus","scalar":{"value":2.0},"type":"SCALAR"},{"name":"mem","scalar":{"value":1024.0},"type":"SCALAR"},{"name":"disk","scalar":{"value":1024.0},"type":"SCALAR"},{"name":"ports","ranges":{"range":[{"begin":31000,"end":32000}]},"type":"RANGES"}]
I0706 14:00:14.353159 10501 slave.cpp:573] Agent attributes: [  ]
I0706 14:00:14.353168 10501 slave.cpp:578] Agent hostname: localhost
I0706 14:00:14.353289 10503 status_update_manager.cpp:177] Pausing sending status updates
I0706 14:00:14.354627 10492 state.cpp:64] Recovering state from '/tmp/Endpoint_SlaveEndpointTest_NoAuthorizer_1_LAirQ1/meta'
I0706 14:00:14.354898 10501 status_update_manager.cpp:203] Recovering status update manager
I0706 14:00:14.355078 10500 containerizer.cpp:582] Recovering containerizer
I0706 14:00:14.356504 10497 provisioner.cpp:416] Provisioner recovery complete
I0706 14:00:14.356899 10485 slave.cpp:6189] Finished recovery
I0706 14:00:14.357574 10485 slave.cpp:6371] Querying resource estimator for oversubscribable
resources
I0706 14:00:14.357908 10481 slave.cpp:6385] Received oversubscribable resources {} from the
resource estimator
I0706 14:00:14.360064 10492 process.cpp:3779] Handling HTTP event for process 'slave(786)'
with path: '/slave(786)/monitor/statistics.json'
I0706 14:00:14.361985 10504 http.cpp:1116] HTTP GET for /slave(786)/monitor/statistics.json
from 127.0.0.1:50470
I0706 14:00:14.362076 10504 http.cpp:937] Authorizing principal 'test-principal' to GET the
'/monitor/statistics.json' endpoint
I0706 14:00:14.365370 10488 slave.cpp:839] Agent terminating
[       OK ] Endpoint/SlaveEndpointTest.NoAuthorizer/1 (32 ms)
[ RUN      ] Endpoint/SlaveEndpointTest.NoAuthorizer/2
I0706 14:00:14.377138  2608 containerizer.cpp:230] Using isolation: posix/cpu,posix/mem,filesystem/posix,network/cni,environment_secret
W0706 14:00:14.377650  2608 backend.cpp:76] Failed to create 'aufs' backend: AufsBackend requires
root privileges
W0706 14:00:14.377740  2608 backend.cpp:76] Failed to create 'bind' backend: BindBackend requires
root privileges
I0706 14:00:14.377768  2608 provisioner.cpp:255] Using default backend 'copy'
I0706 14:00:14.379833  2608 cluster.cpp:448] Creating default 'local' authorizer
I0706 14:00:14.381359 10497 slave.cpp:250] Mesos agent started on (787)@127.0.0.1:36533
I0706 14:00:14.381386 10497 slave.cpp:251] Flags at startup: --acls="" --appc_simple_discovery_uri_prefix="http://"
--appc_store_dir="/tmp/Endpoint_SlaveEndpointTest_NoAuthorizer_2_kFOucf/store/appc" --authenticate_http_executors="true"
--authenticate_http_readonly="true" --authenticate_http_readwrite="true" --authenticatee="crammd5"
--authentication_backoff_factor="1secs" --authorizer="local" --cgroups_cpu_enable_pids_and_tids_count="false"
--cgroups_enable_cfs="false" --cgroups_hierarchy="/sys/fs/cgroup" --cgroups_limit_swap="false"
--cgroups_root="mesos" --container_disk_watch_interval="15secs" --containerizers="mesos" --credential="/tmp/Endpoint_SlaveEndpointTest_NoAuthorizer_2_kFOucf/credential"
--default_role="*" --disk_watch_interval="1mins" --docker="docker" --docker_kill_orphans="true"
--docker_registry="https://registry-1.docker.io" --docker_remove_delay="6hrs" --docker_socket="/var/run/docker.sock"
--docker_stop_timeout="0ns" --docker_store_dir="/tmp/Endpoint_SlaveEndpointTest_NoAuthorizer_2_kFOucf/store/docker"
--docker_volume_checkpoint_dir="/var/run/mesos/isolators/docker/volume" --enforce_container_disk_quota="false"
--executor_registration_timeout="1mins" --executor_reregistration_timeout="2secs" --executor_secret_key="/tmp/Endpoint_SlaveEndpointTest_NoAuthorizer_2_kFOucf/executor_secret_key"
--executor_shutdown_grace_period="5secs" --fetcher_cache_dir="/tmp/Endpoint_SlaveEndpointTest_NoAuthorizer_2_kFOucf/fetch"
--fetcher_cache_size="2GB" --frameworks_home="" --gc_delay="1weeks" --gc_disk_headroom="0.1"
--hadoop_home="" --help="false" --hostname_lookup="true" --http_command_executor="false" --http_credentials="/tmp/Endpoint_SlaveEndpointTest_NoAuthorizer_2_kFOucf/http_credentials"
--http_heartbeat_interval="30secs" --initialize_driver_logging="true" --isolation="posix/cpu,posix/mem"
--launcher="posix" --launcher_dir="/mesos/build/src" --logbufsecs="0" --logging_level="INFO"
--max_completed_executors_per_framework="150" --oversubscribed_resources_interval="15secs"
--perf_duration="10secs" --perf_interval="1mins" --port="5051" --qos_correction_interval_min="0ns"
--quiet="false" --recover="reconnect" --recovery_timeout="15mins" --registration_backoff_factor="10ms"
--resources="cpus:2;gpus:0;mem:1024;disk:1024;ports:[31000-32000]" --revocable_cpu_low_priority="true"
--runtime_dir="/tmp/Endpoint_SlaveEndpointTest_NoAuthorizer_2_kFOucf" --sandbox_directory="/mnt/mesos/sandbox"
--strict="true" --switch_user="true" --systemd_enable_support="true" --systemd_runtime_directory="/run/systemd/system"
--version="false" --work_dir="/tmp/Endpoint_SlaveEndpointTest_NoAuthorizer_2_8U6y6Z"
W0706 14:00:14.381858 10497 slave.cpp:254] 
**************************************************
Agent bound to loopback interface! Cannot communicate with remote master(s). You might want
to set '--ip' flag to a routable IP address.
**************************************************
I0706 14:00:14.381868 10497 credentials.hpp:86] Loading credential for authentication from
'/tmp/Endpoint_SlaveEndpointTest_NoAuthorizer_2_kFOucf/credential'
I0706 14:00:14.382103 10497 slave.cpp:283] Agent using credential for: test-principal
I0706 14:00:14.382118 10497 credentials.hpp:37] Loading credentials for authentication from
'/tmp/Endpoint_SlaveEndpointTest_NoAuthorizer_2_kFOucf/http_credentials'
I0706 14:00:14.382361 10497 http.cpp:976] Creating default 'basic' HTTP authenticator for
realm 'mesos-agent-executor'
I0706 14:00:14.382503 10497 http.cpp:997] Creating default 'jwt' HTTP authenticator for realm
'mesos-agent-executor'
I0706 14:00:14.382824 10497 http.cpp:976] Creating default 'basic' HTTP authenticator for
realm 'mesos-agent-readonly'
I0706 14:00:14.383055 10497 http.cpp:997] Creating default 'jwt' HTTP authenticator for realm
'mesos-agent-readonly'
I0706 14:00:14.383247 10497 http.cpp:976] Creating default 'basic' HTTP authenticator for
realm 'mesos-agent-readwrite'
I0706 14:00:14.383348 10497 http.cpp:997] Creating default 'jwt' HTTP authenticator for realm
'mesos-agent-readwrite'
I0706 14:00:14.384867 10497 slave.cpp:565] Agent resources: [{"name":"cpus","scalar":{"value":2.0},"type":"SCALAR"},{"name":"mem","scalar":{"value":1024.0},"type":"SCALAR"},{"name":"disk","scalar":{"value":1024.0},"type":"SCALAR"},{"name":"ports","ranges":{"range":[{"begin":31000,"end":32000}]},"type":"RANGES"}]
I0706 14:00:14.385058 10497 slave.cpp:573] Agent attributes: [  ]
I0706 14:00:14.385073 10497 slave.cpp:578] Agent hostname: localhost
I0706 14:00:14.385273 10503 status_update_manager.cpp:177] Pausing sending status updates
I0706 14:00:14.386957 10482 state.cpp:64] Recovering state from '/tmp/Endpoint_SlaveEndpointTest_NoAuthorizer_2_8U6y6Z/meta'
I0706 14:00:14.387292 10488 status_update_manager.cpp:203] Recovering status update manager
I0706 14:00:14.387631 10500 containerizer.cpp:582] Recovering containerizer
I0706 14:00:14.389462 10498 provisioner.cpp:416] Provisioner recovery complete
I0706 14:00:14.389869 10489 slave.cpp:6189] Finished recovery
I0706 14:00:14.390480 10489 slave.cpp:6371] Querying resource estimator for oversubscribable
resources
I0706 14:00:14.390846 10483 slave.cpp:6385] Received oversubscribable resources {} from the
resource estimator
I0706 14:00:14.392953 10496 process.cpp:3779] Handling HTTP event for process 'slave(787)'
with path: '/slave(787)/containers'
I0706 14:00:14.394891 10499 http.cpp:1116] HTTP GET for /slave(787)/containers from 127.0.0.1:50500
I0706 14:00:14.394984 10499 http.cpp:937] Authorizing principal 'test-principal' to GET the
'/containers' endpoint
I0706 14:00:14.398718 10488 slave.cpp:839] Agent terminating
[       OK ] Endpoint/SlaveEndpointTest.NoAuthorizer/2 (33 ms)
[----------] 9 tests from Endpoint/SlaveEndpointTest (321 ms total)

[----------] Global test environment tear-down
[==========] 1587 tests from 174 test cases ran. (343056 ms total)
[  PASSED  ] 1584 tests.
[  FAILED  ] 3 tests, listed below:
[  FAILED  ] SlaveTest.HTTPScheduler
[  FAILED  ] SlaveTest.HTTPSchedulerLiveUpgrade
[  FAILED  ] SlaveTest.HTTPSchedulerSlaveRestart

 3 FAILED TESTS
  YOU HAVE 20 DISABLED TESTS

I0706 14:00:14.475903 10505 process.cpp:968] Failed to accept socket: future discarded
make[3]: Leaving directory `/mesos/build'
make[3]: *** [CMakeFiles/check] Error 1
make[2]: *** [CMakeFiles/check.dir/all] Error 2
make[2]: Leaving directory `/mesos/build'
make[1]: *** [CMakeFiles/check.dir/rule] Error 2
make[1]: Leaving directory `/mesos/build'
make: *** [check] Error 2
+ docker rmi mesos-1499346627-24552
Untagged: mesos-1499346627-24552:latest
Deleted: sha256:5a03370564f21038aae66656cd68cebe1be955244622e7b313e60b7859888c12
Deleted: sha256:61ef309aa060bd4eb004570165586b2677deb0a5e658e9c3dd4e9161d542b51c
Deleted: sha256:70f82b28b8e54ae8995dc32d9c50ac8c855a53de52f4894053167c340ad58b4f
Deleted: sha256:f95d724c6959ed7a23f658bef40d87e56ee57d95bf5c9365307b5836bf8b23c2
Deleted: sha256:286e6f22c865ec95e2a860385066f183187661a8736fa951377092199a1271f5
Deleted: sha256:beee279b1ff4ae4a12edd866021a08f70bf6a91dd0348e47917e3b9a30b4b225
Deleted: sha256:d33c15ad3fbb5adae8131165aee826cce0dbc5ae9d3acc4374fcc12711222fa1
Deleted: sha256:2279885fb83ae87c0718a6453145e31ff09e8ec154ae1728d195caeb0791e30b
Deleted: sha256:e5aae178e19c622b6844dff06709400406836b2c6ced8e97da519a391cf47510
Deleted: sha256:f87b149a1922a88b7f90254a978c1612f19ededfd39584e11c5370f24434d577
Deleted: sha256:229381b5a59ca28753dc63e899916bff11fa6c11bfaafca2f7bbcd487dabd9c2
Deleted: sha256:91a0bf627d5660e6875ec6db4cb26fdff703a740743bb9a72c23b4bf0af09c66
Deleted: sha256:1725799d92abb5aa3105b978000583599153079001f1304d306f20a1274042b3
Deleted: sha256:d5bbb82cba8828551f6a96ad55d8465ac782074b19b7ca1f9a861f167438bf41
Deleted: sha256:667b1a5724137c272409143e1fc341ee404e5d34530b047d5daed56a4886a9af
Deleted: sha256:24bd396fb4cfefd753457ddc8134d2e25b82ec53a777340a06c08e8ee3c719d2
Deleted: sha256:e706608e0f6e59b721421f926b4d005c8efd479121d7cd971db0be056cc52e4b
Deleted: sha256:9dec771d6317b92a1a0990dbddc8e88470084fb46ca83b2ce47106587159151a
Deleted: sha256:2f85c2dfa034b2592dfa83b725518e23650c02f64bdab375465d4f7360d8998f
Deleted: sha256:0eea5c0c4a9650bd727e3f4beaf1f7f5f101eb18f45ab8fc8ad1020d34115f7a
Deleted: sha256:0ee43e7f8704a0edb822c65d0ba0bd33deba2ffd4302727d72662f64902028c2
Deleted: sha256:2b3706eafab2f20004cac7feb2da6cec4b767a30b2e27b7ec42704ae2e19adad
Deleted: sha256:cec32c21f5c017e631365008c47e74a91ee9e875cd929c8c9dffb318bb5bb668
Deleted: sha256:449a0ebd421ec474072c06e9432370969e78296684521e79fcceaa4604e4ce49
Build step 'Execute shell' marked build as failure
Not sending mail to unregistered user neil.conway@gmail.com
Not sending mail to unregistered user benjamin.hindman@gmail.com
Not sending mail to unregistered user yujie.jay@gmail.com
Not sending mail to unregistered user alexander@mesosphere.io

Mime
View raw message