mesos-builds mailing list archives

Site index · List index
Message view « Date » · « Thread »
Top « Date » · « Thread »
From Apache Jenkins Server <jenk...@builds.apache.org>
Subject Build failed in Jenkins: Mesos-Buildbot » cmake,clang,--verbose,GLOG_v=1 MESOS_VERBOSE=1,ubuntu:14.04,(ubuntu)&&(!ubuntu-us1)&&(!ubuntu-eu2) #3962
Date Thu, 27 Jul 2017 08:08:15 GMT
See <https://builds.apache.org/job/Mesos-Buildbot/BUILDTOOL=cmake,COMPILER=clang,CONFIGURATION=--verbose,ENVIRONMENT=GLOG_v=1%20MESOS_VERBOSE=1,OS=ubuntu%3A14.04,label_exp=(ubuntu)&&(!ubuntu-us1)&&(!ubuntu-eu2)/3962/display/redirect?page=changes>

Changes:

[zhq527725] Generated protobuf_tests.pb.* files during the build.

------------------------------------------
[...truncated 28.23 MB...]
I0727 08:08:08.090306 30791 http.cpp:957] Authorizing principal 'test-principal' to GET the
'/monitor/statistics.json' endpoint
I0727 08:08:08.108194 30790 slave.cpp:843] Agent terminating
[       OK ] Endpoint/SlaveEndpointTest.AuthorizedRequest/1 (58 ms)
[ RUN      ] Endpoint/SlaveEndpointTest.AuthorizedRequest/2
I0727 08:08:08.125342 30789 containerizer.cpp:230] Using isolation: posix/cpu,posix/mem,filesystem/posix,network/cni,environment_secret
W0727 08:08:08.126090 30789 backend.cpp:76] Failed to create 'overlay' backend: OverlayBackend
requires root privileges
W0727 08:08:08.126262 30789 backend.cpp:76] Failed to create 'bind' backend: BindBackend requires
root privileges
I0727 08:08:08.126304 30789 provisioner.cpp:255] Using default backend 'copy'
I0727 08:08:08.131276 30792 slave.cpp:250] Mesos agent started on (793)@172.17.0.4:38057
I0727 08:08:08.131345 30792 slave.cpp:251] Flags at startup: --acls="" --appc_simple_discovery_uri_prefix="http://"
--appc_store_dir="/tmp/Endpoint_SlaveEndpointTest_AuthorizedRequest_2_RG7sJd/store/appc" --authenticate_http_readonly="true"
--authenticate_http_readwrite="true" --authenticatee="crammd5" --authentication_backoff_factor="1secs"
--authorizer="local" --cgroups_cpu_enable_pids_and_tids_count="false" --cgroups_enable_cfs="false"
--cgroups_hierarchy="/sys/fs/cgroup" --cgroups_limit_swap="false" --cgroups_root="mesos" --container_disk_watch_interval="15secs"
--containerizers="mesos" --credential="/tmp/Endpoint_SlaveEndpointTest_AuthorizedRequest_2_RG7sJd/credential"
--default_role="*" --disk_watch_interval="1mins" --docker="docker" --docker_kill_orphans="true"
--docker_registry="https://registry-1.docker.io" --docker_remove_delay="6hrs" --docker_socket="/var/run/docker.sock"
--docker_stop_timeout="0ns" --docker_store_dir="/tmp/Endpoint_SlaveEndpointTest_AuthorizedRequest_2_RG7sJd/store/docker"
--docker_volume_checkpoint_dir="/var/run/mesos/isolators/docker/volume" --enforce_container_disk_quota="false"
--executor_registration_timeout="1mins" --executor_reregistration_timeout="2secs" --executor_shutdown_grace_period="5secs"
--fetcher_cache_dir="/tmp/Endpoint_SlaveEndpointTest_AuthorizedRequest_2_RG7sJd/fetch" --fetcher_cache_size="2GB"
--frameworks_home="" --gc_delay="1weeks" --gc_disk_headroom="0.1" --hadoop_home="" --help="false"
--hostname_lookup="true" --http_command_executor="false" --http_credentials="/tmp/Endpoint_SlaveEndpointTest_AuthorizedRequest_2_RG7sJd/http_credentials"
--http_heartbeat_interval="30secs" --initialize_driver_logging="true" --isolation="posix/cpu,posix/mem"
--launcher="posix" --launcher_dir="/mesos/build/src" --logbufsecs="0" --logging_level="INFO"
--max_completed_executors_per_framework="150" --oversubscribed_resources_interval="15secs"
--perf_duration="10secs" --perf_interval="1mins" --port="5051" --qos_correction_interval_min="0ns"
--quiet="false" --recover="reconnect" --recovery_timeout="15mins" --registration_backoff_factor="10ms"
--resources="cpus:2;gpus:0;mem:1024;disk:1024;ports:[31000-32000]" --revocable_cpu_low_priority="true"
--runtime_dir="/tmp/Endpoint_SlaveEndpointTest_AuthorizedRequest_2_RG7sJd" --sandbox_directory="/mnt/mesos/sandbox"
--strict="true" --switch_user="true" --systemd_enable_support="true" --systemd_runtime_directory="/run/systemd/system"
--version="false" --work_dir="/tmp/Endpoint_SlaveEndpointTest_AuthorizedRequest_2_scfOa0"
I0727 08:08:08.132112 30792 credentials.hpp:86] Loading credential for authentication from
'/tmp/Endpoint_SlaveEndpointTest_AuthorizedRequest_2_RG7sJd/credential'
I0727 08:08:08.132354 30792 slave.cpp:283] Agent using credential for: test-principal
I0727 08:08:08.132382 30792 credentials.hpp:37] Loading credentials for authentication from
'/tmp/Endpoint_SlaveEndpointTest_AuthorizedRequest_2_RG7sJd/http_credentials'
I0727 08:08:08.132725 30792 http.cpp:993] Creating default 'basic' HTTP authenticator for
realm 'mesos-agent-readonly'
I0727 08:08:08.132982 30792 http.cpp:993] Creating default 'basic' HTTP authenticator for
realm 'mesos-agent-readwrite'
I0727 08:08:08.135359 30792 slave.cpp:565] Agent resources: [{"name":"cpus","scalar":{"value":2.0},"type":"SCALAR"},{"name":"mem","scalar":{"value":1024.0},"type":"SCALAR"},{"name":"disk","scalar":{"value":1024.0},"type":"SCALAR"},{"name":"ports","ranges":{"range":[{"begin":31000,"end":32000}]},"type":"RANGES"}]
I0727 08:08:08.135705 30792 slave.cpp:573] Agent attributes: [  ]
I0727 08:08:08.135725 30792 slave.cpp:582] Agent hostname: 3a0894a21cce
I0727 08:08:08.136279 30795 status_update_manager.cpp:177] Pausing sending status updates
I0727 08:08:08.137912 30790 state.cpp:64] Recovering state from '/tmp/Endpoint_SlaveEndpointTest_AuthorizedRequest_2_scfOa0/meta'
I0727 08:08:08.138623 30791 status_update_manager.cpp:203] Recovering status update manager
I0727 08:08:08.139248 30797 containerizer.cpp:582] Recovering containerizer
I0727 08:08:08.141479 30795 provisioner.cpp:416] Provisioner recovery complete
I0727 08:08:08.142381 30796 slave.cpp:6207] Finished recovery
I0727 08:08:08.143064 30796 slave.cpp:6389] Querying resource estimator for oversubscribable
resources
I0727 08:08:08.143342 30794 slave.cpp:6403] Received oversubscribable resources {} from the
resource estimator
I0727 08:08:08.147202 30794 process.cpp:3837] Handling HTTP event for process 'slave(793)'
with path: '/slave(793)/containers'
I0727 08:08:08.148975 30795 http.cpp:1133] HTTP GET for /slave(793)/containers from 172.17.0.4:48628
I0727 08:08:08.149446 30795 http.cpp:957] Authorizing principal 'test-principal' to GET the
'/containers' endpoint
I0727 08:08:08.155998 30789 slave.cpp:843] Agent terminating
[       OK ] Endpoint/SlaveEndpointTest.AuthorizedRequest/2 (47 ms)
[ RUN      ] Endpoint/SlaveEndpointTest.UnauthorizedRequest/0
I0727 08:08:08.173188 30789 containerizer.cpp:230] Using isolation: posix/cpu,posix/mem,filesystem/posix,network/cni,environment_secret
W0727 08:08:08.173964 30789 backend.cpp:76] Failed to create 'overlay' backend: OverlayBackend
requires root privileges
W0727 08:08:08.174139 30789 backend.cpp:76] Failed to create 'bind' backend: BindBackend requires
root privileges
I0727 08:08:08.174181 30789 provisioner.cpp:255] Using default backend 'copy'
I0727 08:08:08.179556 30796 slave.cpp:250] Mesos agent started on (794)@172.17.0.4:38057
I0727 08:08:08.179613 30796 slave.cpp:251] Flags at startup: --acls="" --appc_simple_discovery_uri_prefix="http://"
--appc_store_dir="/tmp/Endpoint_SlaveEndpointTest_UnauthorizedRequest_0_5tIso6/store/appc"
--authenticate_http_readonly="true" --authenticate_http_readwrite="true" --authenticatee="crammd5"
--authentication_backoff_factor="1secs" --authorizer="local" --cgroups_cpu_enable_pids_and_tids_count="false"
--cgroups_enable_cfs="false" --cgroups_hierarchy="/sys/fs/cgroup" --cgroups_limit_swap="false"
--cgroups_root="mesos" --container_disk_watch_interval="15secs" --containerizers="mesos" --credential="/tmp/Endpoint_SlaveEndpointTest_UnauthorizedRequest_0_5tIso6/credential"
--default_role="*" --disk_watch_interval="1mins" --docker="docker" --docker_kill_orphans="true"
--docker_registry="https://registry-1.docker.io" --docker_remove_delay="6hrs" --docker_socket="/var/run/docker.sock"
--docker_stop_timeout="0ns" --docker_store_dir="/tmp/Endpoint_SlaveEndpointTest_UnauthorizedRequest_0_5tIso6/store/docker"
--docker_volume_checkpoint_dir="/var/run/mesos/isolators/docker/volume" --enforce_container_disk_quota="false"
--executor_registration_timeout="1mins" --executor_reregistration_timeout="2secs" --executor_shutdown_grace_period="5secs"
--fetcher_cache_dir="/tmp/Endpoint_SlaveEndpointTest_UnauthorizedRequest_0_5tIso6/fetch" --fetcher_cache_size="2GB"
--frameworks_home="" --gc_delay="1weeks" --gc_disk_headroom="0.1" --hadoop_home="" --help="false"
--hostname_lookup="true" --http_command_executor="false" --http_credentials="/tmp/Endpoint_SlaveEndpointTest_UnauthorizedRequest_0_5tIso6/http_credentials"
--http_heartbeat_interval="30secs" --initialize_driver_logging="true" --isolation="posix/cpu,posix/mem"
--launcher="posix" --launcher_dir="/mesos/build/src" --logbufsecs="0" --logging_level="INFO"
--max_completed_executors_per_framework="150" --oversubscribed_resources_interval="15secs"
--perf_duration="10secs" --perf_interval="1mins" --port="5051" --qos_correction_interval_min="0ns"
--quiet="false" --recover="reconnect" --recovery_timeout="15mins" --registration_backoff_factor="10ms"
--resources="cpus:2;gpus:0;mem:1024;disk:1024;ports:[31000-32000]" --revocable_cpu_low_priority="true"
--runtime_dir="/tmp/Endpoint_SlaveEndpointTest_UnauthorizedRequest_0_5tIso6" --sandbox_directory="/mnt/mesos/sandbox"
--strict="true" --switch_user="true" --systemd_enable_support="true" --systemd_runtime_directory="/run/systemd/system"
--version="false" --work_dir="/tmp/Endpoint_SlaveEndpointTest_UnauthorizedRequest_0_47F2HS"
I0727 08:08:08.180331 30796 credentials.hpp:86] Loading credential for authentication from
'/tmp/Endpoint_SlaveEndpointTest_UnauthorizedRequest_0_5tIso6/credential'
I0727 08:08:08.180615 30796 slave.cpp:283] Agent using credential for: test-principal
I0727 08:08:08.180637 30796 credentials.hpp:37] Loading credentials for authentication from
'/tmp/Endpoint_SlaveEndpointTest_UnauthorizedRequest_0_5tIso6/http_credentials'
I0727 08:08:08.181008 30796 http.cpp:993] Creating default 'basic' HTTP authenticator for
realm 'mesos-agent-readonly'
I0727 08:08:08.181287 30796 http.cpp:993] Creating default 'basic' HTTP authenticator for
realm 'mesos-agent-readwrite'
I0727 08:08:08.183392 30796 slave.cpp:565] Agent resources: [{"name":"cpus","scalar":{"value":2.0},"type":"SCALAR"},{"name":"mem","scalar":{"value":1024.0},"type":"SCALAR"},{"name":"disk","scalar":{"value":1024.0},"type":"SCALAR"},{"name":"ports","ranges":{"range":[{"begin":31000,"end":32000}]},"type":"RANGES"}]
I0727 08:08:08.183715 30796 slave.cpp:573] Agent attributes: [  ]
I0727 08:08:08.183732 30796 slave.cpp:582] Agent hostname: 3a0894a21cce
I0727 08:08:08.183945 30797 status_update_manager.cpp:177] Pausing sending status updates
I0727 08:08:08.186101 30791 state.cpp:64] Recovering state from '/tmp/Endpoint_SlaveEndpointTest_UnauthorizedRequest_0_47F2HS/meta'
I0727 08:08:08.186787 30792 status_update_manager.cpp:203] Recovering status update manager
I0727 08:08:08.187049 30792 containerizer.cpp:582] Recovering containerizer
I0727 08:08:08.189433 30792 provisioner.cpp:416] Provisioner recovery complete
I0727 08:08:08.190179 30792 slave.cpp:6207] Finished recovery
I0727 08:08:08.190954 30792 slave.cpp:6389] Querying resource estimator for oversubscribable
resources
I0727 08:08:08.191345 30793 slave.cpp:6403] Received oversubscribable resources {} from the
resource estimator
I0727 08:08:08.195215 30795 process.cpp:3837] Handling HTTP event for process 'slave(794)'
with path: '/slave(794)/monitor/statistics'
I0727 08:08:08.197331 30791 http.cpp:1133] HTTP GET for /slave(794)/monitor/statistics from
172.17.0.4:48630
I0727 08:08:08.197827 30791 http.cpp:957] Authorizing principal 'test-principal' to GET the
'/monitor/statistics' endpoint
I0727 08:08:08.202111 30790 slave.cpp:843] Agent terminating
[       OK ] Endpoint/SlaveEndpointTest.UnauthorizedRequest/0 (62 ms)
[ RUN      ] Endpoint/SlaveEndpointTest.UnauthorizedRequest/1
I0727 08:08:08.237213 30789 containerizer.cpp:230] Using isolation: posix/cpu,posix/mem,filesystem/posix,network/cni,environment_secret
W0727 08:08:08.238098 30789 backend.cpp:76] Failed to create 'overlay' backend: OverlayBackend
requires root privileges
W0727 08:08:08.238397 30789 backend.cpp:76] Failed to create 'bind' backend: BindBackend requires
root privileges
I0727 08:08:08.238450 30789 provisioner.cpp:255] Using default backend 'copy'
I0727 08:08:08.243582 30797 slave.cpp:250] Mesos agent started on (795)@172.17.0.4:38057
I0727 08:08:08.243638 30797 slave.cpp:251] Flags at startup: --acls="" --appc_simple_discovery_uri_prefix="http://"
--appc_store_dir="/tmp/Endpoint_SlaveEndpointTest_UnauthorizedRequest_1_Rex7FZ/store/appc"
--authenticate_http_readonly="true" --authenticate_http_readwrite="true" --authenticatee="crammd5"
--authentication_backoff_factor="1secs" --authorizer="local" --cgroups_cpu_enable_pids_and_tids_count="false"
--cgroups_enable_cfs="false" --cgroups_hierarchy="/sys/fs/cgroup" --cgroups_limit_swap="false"
--cgroups_root="mesos" --container_disk_watch_interval="15secs" --containerizers="mesos" --credential="/tmp/Endpoint_SlaveEndpointTest_UnauthorizedRequest_1_Rex7FZ/credential"
--default_role="*" --disk_watch_interval="1mins" --docker="docker" --docker_kill_orphans="true"
--docker_registry="https://registry-1.docker.io" --docker_remove_delay="6hrs" --docker_socket="/var/run/docker.sock"
--docker_stop_timeout="0ns" --docker_store_dir="/tmp/Endpoint_SlaveEndpointTest_UnauthorizedRequest_1_Rex7FZ/store/docker"
--docker_volume_checkpoint_dir="/var/run/mesos/isolators/docker/volume" --enforce_container_disk_quota="false"
--executor_registration_timeout="1mins" --executor_reregistration_timeout="2secs" --executor_shutdown_grace_period="5secs"
--fetcher_cache_dir="/tmp/Endpoint_SlaveEndpointTest_UnauthorizedRequest_1_Rex7FZ/fetch" --fetcher_cache_size="2GB"
--frameworks_home="" --gc_delay="1weeks" --gc_disk_headroom="0.1" --hadoop_home="" --help="false"
--hostname_lookup="true" --http_command_executor="false" --http_credentials="/tmp/Endpoint_SlaveEndpointTest_UnauthorizedRequest_1_Rex7FZ/http_credentials"
--http_heartbeat_interval="30secs" --initialize_driver_logging="true" --isolation="posix/cpu,posix/mem"
--launcher="posix" --launcher_dir="/mesos/build/src" --logbufsecs="0" --logging_level="INFO"
--max_completed_executors_per_framework="150" --oversubscribed_resources_interval="15secs"
--perf_duration="10secs" --perf_interval="1mins" --port="5051" --qos_correction_interval_min="0ns"
--quiet="false" --recover="reconnect" --recovery_timeout="15mins" --registration_backoff_factor="10ms"
--resources="cpus:2;gpus:0;mem:1024;disk:1024;ports:[31000-32000]" --revocable_cpu_low_priority="true"
--runtime_dir="/tmp/Endpoint_SlaveEndpointTest_UnauthorizedRequest_1_Rex7FZ" --sandbox_directory="/mnt/mesos/sandbox"
--strict="true" --switch_user="true" --systemd_enable_support="true" --systemd_runtime_directory="/run/systemd/system"
--version="false" --work_dir="/tmp/Endpoint_SlaveEndpointTest_UnauthorizedRequest_1_4NulPL"
I0727 08:08:08.244325 30797 credentials.hpp:86] Loading credential for authentication from
'/tmp/Endpoint_SlaveEndpointTest_UnauthorizedRequest_1_Rex7FZ/credential'
I0727 08:08:08.244541 30797 slave.cpp:283] Agent using credential for: test-principal
I0727 08:08:08.244561 30797 credentials.hpp:37] Loading credentials for authentication from
'/tmp/Endpoint_SlaveEndpointTest_UnauthorizedRequest_1_Rex7FZ/http_credentials'
I0727 08:08:08.244843 30797 http.cpp:993] Creating default 'basic' HTTP authenticator for
realm 'mesos-agent-readonly'
I0727 08:08:08.245055 30797 http.cpp:993] Creating default 'basic' HTTP authenticator for
realm 'mesos-agent-readwrite'
I0727 08:08:08.247073 30797 slave.cpp:565] Agent resources: [{"name":"cpus","scalar":{"value":2.0},"type":"SCALAR"},{"name":"mem","scalar":{"value":1024.0},"type":"SCALAR"},{"name":"disk","scalar":{"value":1024.0},"type":"SCALAR"},{"name":"ports","ranges":{"range":[{"begin":31000,"end":32000}]},"type":"RANGES"}]
I0727 08:08:08.247395 30797 slave.cpp:573] Agent attributes: [  ]
I0727 08:08:08.247412 30797 slave.cpp:582] Agent hostname: 3a0894a21cce
I0727 08:08:08.247820 30791 status_update_manager.cpp:177] Pausing sending status updates
I0727 08:08:08.249490 30795 state.cpp:64] Recovering state from '/tmp/Endpoint_SlaveEndpointTest_UnauthorizedRequest_1_4NulPL/meta'
I0727 08:08:08.250186 30793 status_update_manager.cpp:203] Recovering status update manager
I0727 08:08:08.250418 30793 containerizer.cpp:582] Recovering containerizer
I0727 08:08:08.252331 30796 provisioner.cpp:416] Provisioner recovery complete
I0727 08:08:08.253213 30791 slave.cpp:6207] Finished recovery
I0727 08:08:08.254127 30791 slave.cpp:6389] Querying resource estimator for oversubscribable
resources
I0727 08:08:08.254693 30793 slave.cpp:6403] Received oversubscribable resources {} from the
resource estimator
I0727 08:08:08.258190 30796 process.cpp:3837] Handling HTTP event for process 'slave(795)'
with path: '/slave(795)/monitor/statistics.json'
I0727 08:08:08.262677 30793 http.cpp:1133] HTTP GET for /slave(795)/monitor/statistics.json
from 172.17.0.4:48632
I0727 08:08:08.262804 30793 http.cpp:957] Authorizing principal 'test-principal' to GET the
'/monitor/statistics.json' endpoint
I0727 08:08:08.266247 30792 slave.cpp:843] Agent terminating
[       OK ] Endpoint/SlaveEndpointTest.UnauthorizedRequest/1 (46 ms)
[ RUN      ] Endpoint/SlaveEndpointTest.UnauthorizedRequest/2
I0727 08:08:08.283421 30789 containerizer.cpp:230] Using isolation: posix/cpu,posix/mem,filesystem/posix,network/cni,environment_secret
W0727 08:08:08.284329 30789 backend.cpp:76] Failed to create 'overlay' backend: OverlayBackend
requires root privileges
W0727 08:08:08.284601 30789 backend.cpp:76] Failed to create 'bind' backend: BindBackend requires
root privileges
I0727 08:08:08.284651 30789 provisioner.cpp:255] Using default backend 'copy'
I0727 08:08:08.289700 30795 slave.cpp:250] Mesos agent started on (796)@172.17.0.4:38057
I0727 08:08:08.289752 30795 slave.cpp:251] Flags at startup: --acls="" --appc_simple_discovery_uri_prefix="http://"
--appc_store_dir="/tmp/Endpoint_SlaveEndpointTest_UnauthorizedRequest_2_lqKFuT/store/appc"
--authenticate_http_readonly="true" --authenticate_http_readwrite="true" --authenticatee="crammd5"
--authentication_backoff_factor="1secs" --authorizer="local" --cgroups_cpu_enable_pids_and_tids_count="false"
--cgroups_enable_cfs="false" --cgroups_hierarchy="/sys/fs/cgroup" --cgroups_limit_swap="false"
--cgroups_root="mesos" --container_disk_watch_interval="15secs" --containerizers="mesos" --credential="/tmp/Endpoint_SlaveEndpointTest_UnauthorizedRequest_2_lqKFuT/credential"
--default_role="*" --disk_watch_interval="1mins" --docker="docker" --docker_kill_orphans="true"
--docker_registry="https://registry-1.docker.io" --docker_remove_delay="6hrs" --docker_socket="/var/run/docker.sock"
--docker_stop_timeout="0ns" --docker_store_dir="/tmp/Endpoint_SlaveEndpointTest_UnauthorizedRequest_2_lqKFuT/store/docker"
--docker_volume_checkpoint_dir="/var/run/mesos/isolators/docker/volume" --enforce_container_disk_quota="false"
--executor_registration_timeout="1mins" --executor_reregistration_timeout="2secs" --executor_shutdown_grace_period="5secs"
--fetcher_cache_dir="/tmp/Endpoint_SlaveEndpointTest_UnauthorizedRequest_2_lqKFuT/fetch" --fetcher_cache_size="2GB"
--frameworks_home="" --gc_delay="1weeks" --gc_disk_headroom="0.1" --hadoop_home="" --help="false"
--hostname_lookup="true" --http_command_executor="false" --http_credentials="/tmp/Endpoint_SlaveEndpointTest_UnauthorizedRequest_2_lqKFuT/http_credentials"
--http_heartbeat_interval="30secs" --initialize_driver_logging="true" --isolation="posix/cpu,posix/mem"
--launcher="posix" --launcher_dir="/mesos/build/src" --logbufsecs="0" --logging_level="INFO"
--max_completed_executors_per_framework="150" --oversubscribed_resources_interval="15secs"
--perf_duration="10secs" --perf_interval="1mins" --port="5051" --qos_correction_interval_min="0ns"
--quiet="false" --recover="reconnect" --recovery_timeout="15mins" --registration_backoff_factor="10ms"
--resources="cpus:2;gpus:0;mem:1024;disk:1024;ports:[31000-32000]" --revocable_cpu_low_priority="true"
--runtime_dir="/tmp/Endpoint_SlaveEndpointTest_UnauthorizedRequest_2_lqKFuT" --sandbox_directory="/mnt/mesos/sandbox"
--strict="true" --switch_user="true" --systemd_enable_support="true" --systemd_runtime_directory="/run/systemd/system"
--version="false" --work_dir="/tmp/Endpoint_SlaveEndpointTest_UnauthorizedRequest_2_wegowF"
I0727 08:08:08.290802 30795 credentials.hpp:86] Loading credential for authentication from
'/tmp/Endpoint_SlaveEndpointTest_UnauthorizedRequest_2_lqKFuT/credential'
I0727 08:08:08.291378 30795 slave.cpp:283] Agent using credential for: test-principal
I0727 08:08:08.291406 30795 credentials.hpp:37] Loading credentials for authentication from
'/tmp/Endpoint_SlaveEndpointTest_UnauthorizedRequest_2_lqKFuT/http_credentials'
I0727 08:08:08.291961 30795 http.cpp:993] Creating default 'basic' HTTP authenticator for
realm 'mesos-agent-readonly'
I0727 08:08:08.292418 30795 http.cpp:993] Creating default 'basic' HTTP authenticator for
realm 'mesos-agent-readwrite'
I0727 08:08:08.294787 30795 slave.cpp:565] Agent resources: [{"name":"cpus","scalar":{"value":2.0},"type":"SCALAR"},{"name":"mem","scalar":{"value":1024.0},"type":"SCALAR"},{"name":"disk","scalar":{"value":1024.0},"type":"SCALAR"},{"name":"ports","ranges":{"range":[{"begin":31000,"end":32000}]},"type":"RANGES"}]
I0727 08:08:08.295115 30795 slave.cpp:573] Agent attributes: [  ]
I0727 08:08:08.295130 30795 slave.cpp:582] Agent hostname: 3a0894a21cce
I0727 08:08:08.295651 30793 status_update_manager.cpp:177] Pausing sending status updates
I0727 08:08:08.297751 30797 state.cpp:64] Recovering state from '/tmp/Endpoint_SlaveEndpointTest_UnauthorizedRequest_2_wegowF/meta'
I0727 08:08:08.298419 30790 status_update_manager.cpp:203] Recovering status update manager
I0727 08:08:08.299053 30795 containerizer.cpp:582] Recovering containerizer
I0727 08:08:08.301774 30791 provisioner.cpp:416] Provisioner recovery complete
I0727 08:08:08.302816 30795 slave.cpp:6207] Finished recovery
I0727 08:08:08.303823 30795 slave.cpp:6389] Querying resource estimator for oversubscribable
resources
I0727 08:08:08.304543 30795 slave.cpp:6403] Received oversubscribable resources {} from the
resource estimator
I0727 08:08:08.308810 30791 process.cpp:3837] Handling HTTP event for process 'slave(796)'
with path: '/slave(796)/containers'
I0727 08:08:08.311167 30792 http.cpp:1133] HTTP GET for /slave(796)/containers from 172.17.0.4:48634
I0727 08:08:08.311314 30792 http.cpp:957] Authorizing principal 'test-principal' to GET the
'/containers' endpoint
I0727 08:08:08.315187 30789 slave.cpp:843] Agent terminating
[       OK ] Endpoint/SlaveEndpointTest.UnauthorizedRequest/2 (48 ms)
[ RUN      ] Endpoint/SlaveEndpointTest.NoAuthorizer/0
I0727 08:08:08.332388 30789 containerizer.cpp:230] Using isolation: posix/cpu,posix/mem,filesystem/posix,network/cni,environment_secret
W0727 08:08:08.333262 30789 backend.cpp:76] Failed to create 'overlay' backend: OverlayBackend
requires root privileges
W0727 08:08:08.333528 30789 backend.cpp:76] Failed to create 'bind' backend: BindBackend requires
root privileges
I0727 08:08:08.333580 30789 provisioner.cpp:255] Using default backend 'copy'
I0727 08:08:08.336127 30789 cluster.cpp:448] Creating default 'local' authorizer
I0727 08:08:08.338784 30796 slave.cpp:250] Mesos agent started on (797)@172.17.0.4:38057
I0727 08:08:08.338840 30796 slave.cpp:251] Flags at startup: --acls="" --appc_simple_discovery_uri_prefix="http://"
--appc_store_dir="/tmp/Endpoint_SlaveEndpointTest_NoAuthorizer_0_ZkmSON/store/appc" --authenticate_http_readonly="true"
--authenticate_http_readwrite="true" --authenticatee="crammd5" --authentication_backoff_factor="1secs"
--authorizer="local" --cgroups_cpu_enable_pids_and_tids_count="false" --cgroups_enable_cfs="false"
--cgroups_hierarchy="/sys/fs/cgroup" --cgroups_limit_swap="false" --cgroups_root="mesos" --container_disk_watch_interval="15secs"
--containerizers="mesos" --credential="/tmp/Endpoint_SlaveEndpointTest_NoAuthorizer_0_ZkmSON/credential"
--default_role="*" --disk_watch_interval="1mins" --docker="docker" --docker_kill_orphans="true"
--docker_registry="https://registry-1.docker.io" --docker_remove_delay="6hrs" --docker_socket="/var/run/docker.sock"
--docker_stop_timeout="0ns" --docker_store_dir="/tmp/Endpoint_SlaveEndpointTest_NoAuthorizer_0_ZkmSON/store/docker"
--docker_volume_checkpoint_dir="/var/run/mesos/isolators/docker/volume" --enforce_container_disk_quota="false"
--executor_registration_timeout="1mins" --executor_reregistration_timeout="2secs" --executor_shutdown_grace_period="5secs"
--fetcher_cache_dir="/tmp/Endpoint_SlaveEndpointTest_NoAuthorizer_0_ZkmSON/fetch" --fetcher_cache_size="2GB"
--frameworks_home="" --gc_delay="1weeks" --gc_disk_headroom="0.1" --hadoop_home="" --help="false"
--hostname_lookup="true" --http_command_executor="false" --http_credentials="/tmp/Endpoint_SlaveEndpointTest_NoAuthorizer_0_ZkmSON/http_credentials"
--http_heartbeat_interval="30secs" --initialize_driver_logging="true" --isolation="posix/cpu,posix/mem"
--launcher="posix" --launcher_dir="/mesos/build/src" --logbufsecs="0" --logging_level="INFO"
--max_completed_executors_per_framework="150" --oversubscribed_resources_interval="15secs"
--perf_duration="10secs" --perf_interval="1mins" --port="5051" --qos_correction_interval_min="0ns"
--quiet="false" --recover="reconnect" --recovery_timeout="15mins" --registration_backoff_factor="10ms"
--resources="cpus:2;gpus:0;mem:1024;disk:1024;ports:[31000-32000]" --revocable_cpu_low_priority="true"
--runtime_dir="/tmp/Endpoint_SlaveEndpointTest_NoAuthorizer_0_ZkmSON" --sandbox_directory="/mnt/mesos/sandbox"
--strict="true" --switch_user="true" --systemd_enable_support="true" --systemd_runtime_directory="/run/systemd/system"
--version="false" --work_dir="/tmp/Endpoint_SlaveEndpointTest_NoAuthorizer_0_o8fJIz"
I0727 08:08:08.339571 30796 credentials.hpp:86] Loading credential for authentication from
'/tmp/Endpoint_SlaveEndpointTest_NoAuthorizer_0_ZkmSON/credential'
I0727 08:08:08.339860 30796 slave.cpp:283] Agent using credential for: test-principal
I0727 08:08:08.339885 30796 credentials.hpp:37] Loading credentials for authentication from
'/tmp/Endpoint_SlaveEndpointTest_NoAuthorizer_0_ZkmSON/http_credentials'
I0727 08:08:08.340263 30796 http.cpp:993] Creating default 'basic' HTTP authenticator for
realm 'mesos-agent-readonly'
I0727 08:08:08.340540 30796 http.cpp:993] Creating default 'basic' HTTP authenticator for
realm 'mesos-agent-readwrite'
I0727 08:08:08.342715 30796 slave.cpp:565] Agent resources: [{"name":"cpus","scalar":{"value":2.0},"type":"SCALAR"},{"name":"mem","scalar":{"value":1024.0},"type":"SCALAR"},{"name":"disk","scalar":{"value":1024.0},"type":"SCALAR"},{"name":"ports","ranges":{"range":[{"begin":31000,"end":32000}]},"type":"RANGES"}]
I0727 08:08:08.343035 30796 slave.cpp:573] Agent attributes: [  ]
I0727 08:08:08.343051 30796 slave.cpp:582] Agent hostname: 3a0894a21cce
I0727 08:08:08.343456 30791 status_update_manager.cpp:177] Pausing sending status updates
I0727 08:08:08.345295 30797 state.cpp:64] Recovering state from '/tmp/Endpoint_SlaveEndpointTest_NoAuthorizer_0_o8fJIz/meta'
I0727 08:08:08.345873 30797 status_update_manager.cpp:203] Recovering status update manager
I0727 08:08:08.346343 30796 containerizer.cpp:582] Recovering containerizer
I0727 08:08:08.348640 30790 provisioner.cpp:416] Provisioner recovery complete
I0727 08:08:08.349506 30794 slave.cpp:6207] Finished recovery
I0727 08:08:08.350072 30794 slave.cpp:6389] Querying resource estimator for oversubscribable
resources
I0727 08:08:08.350729 30797 slave.cpp:6403] Received oversubscribable resources {} from the
resource estimator
I0727 08:08:08.355103 30790 process.cpp:3837] Handling HTTP event for process 'slave(797)'
with path: '/slave(797)/monitor/statistics'
I0727 08:08:08.357321 30793 http.cpp:1133] HTTP GET for /slave(797)/monitor/statistics from
172.17.0.4:48636
I0727 08:08:08.357437 30793 http.cpp:957] Authorizing principal 'test-principal' to GET the
'/monitor/statistics' endpoint
I0727 08:08:08.362431 30793 slave.cpp:843] Agent terminating
[       OK ] Endpoint/SlaveEndpointTest.NoAuthorizer/0 (47 ms)
[ RUN      ] Endpoint/SlaveEndpointTest.NoAuthorizer/1
I0727 08:08:08.380175 30789 containerizer.cpp:230] Using isolation: posix/cpu,posix/mem,filesystem/posix,network/cni,environment_secret
W0727 08:08:08.380910 30789 backend.cpp:76] Failed to create 'overlay' backend: OverlayBackend
requires root privileges
W0727 08:08:08.381084 30789 backend.cpp:76] Failed to create 'bind' backend: BindBackend requires
root privileges
I0727 08:08:08.381126 30789 provisioner.cpp:255] Using default backend 'copy'
I0727 08:08:08.383708 30789 cluster.cpp:448] Creating default 'local' authorizer
I0727 08:08:08.386415 30791 slave.cpp:250] Mesos agent started on (798)@172.17.0.4:38057
I0727 08:08:08.386464 30791 slave.cpp:251] Flags at startup: --acls="" --appc_simple_discovery_uri_prefix="http://"
--appc_store_dir="/tmp/Endpoint_SlaveEndpointTest_NoAuthorizer_1_FKPODI/store/appc" --authenticate_http_readonly="true"
--authenticate_http_readwrite="true" --authenticatee="crammd5" --authentication_backoff_factor="1secs"
--authorizer="local" --cgroups_cpu_enable_pids_and_tids_count="false" --cgroups_enable_cfs="false"
--cgroups_hierarchy="/sys/fs/cgroup" --cgroups_limit_swap="false" --cgroups_root="mesos" --container_disk_watch_interval="15secs"
--containerizers="mesos" --credential="/tmp/Endpoint_SlaveEndpointTest_NoAuthorizer_1_FKPODI/credential"
--default_role="*" --disk_watch_interval="1mins" --docker="docker" --docker_kill_orphans="true"
--docker_registry="https://registry-1.docker.io" --docker_remove_delay="6hrs" --docker_socket="/var/run/docker.sock"
--docker_stop_timeout="0ns" --docker_store_dir="/tmp/Endpoint_SlaveEndpointTest_NoAuthorizer_1_FKPODI/store/docker"
--docker_volume_checkpoint_dir="/var/run/mesos/isolators/docker/volume" --enforce_container_disk_quota="false"
--executor_registration_timeout="1mins" --executor_reregistration_timeout="2secs" --executor_shutdown_grace_period="5secs"
--fetcher_cache_dir="/tmp/Endpoint_SlaveEndpointTest_NoAuthorizer_1_FKPODI/fetch" --fetcher_cache_size="2GB"
--frameworks_home="" --gc_delay="1weeks" --gc_disk_headroom="0.1" --hadoop_home="" --help="false"
--hostname_lookup="true" --http_command_executor="false" --http_credentials="/tmp/Endpoint_SlaveEndpointTest_NoAuthorizer_1_FKPODI/http_credentials"
--http_heartbeat_interval="30secs" --initialize_driver_logging="true" --isolation="posix/cpu,posix/mem"
--launcher="posix" --launcher_dir="/mesos/build/src" --logbufsecs="0" --logging_level="INFO"
--max_completed_executors_per_framework="150" --oversubscribed_resources_interval="15secs"
--perf_duration="10secs" --perf_interval="1mins" --port="5051" --qos_correction_interval_min="0ns"
--quiet="false" --recover="reconnect" --recovery_timeout="15mins" --registration_backoff_factor="10ms"
--resources="cpus:2;gpus:0;mem:1024;disk:1024;ports:[31000-32000]" --revocable_cpu_low_priority="true"
--runtime_dir="/tmp/Endpoint_SlaveEndpointTest_NoAuthorizer_1_FKPODI" --sandbox_directory="/mnt/mesos/sandbox"
--strict="true" --switch_user="true" --systemd_enable_support="true" --systemd_runtime_directory="/run/systemd/system"
--version="false" --work_dir="/tmp/Endpoint_SlaveEndpointTest_NoAuthorizer_1_WvQVpu"
I0727 08:08:08.387478 30791 credentials.hpp:86] Loading credential for authentication from
'/tmp/Endpoint_SlaveEndpointTest_NoAuthorizer_1_FKPODI/credential'
I0727 08:08:08.388064 30791 slave.cpp:283] Agent using credential for: test-principal
I0727 08:08:08.388092 30791 credentials.hpp:37] Loading credentials for authentication from
'/tmp/Endpoint_SlaveEndpointTest_NoAuthorizer_1_FKPODI/http_credentials'
I0727 08:08:08.388650 30791 http.cpp:993] Creating default 'basic' HTTP authenticator for
realm 'mesos-agent-readonly'
I0727 08:08:08.389112 30791 http.cpp:993] Creating default 'basic' HTTP authenticator for
realm 'mesos-agent-readwrite'
I0727 08:08:08.391438 30791 slave.cpp:565] Agent resources: [{"name":"cpus","scalar":{"value":2.0},"type":"SCALAR"},{"name":"mem","scalar":{"value":1024.0},"type":"SCALAR"},{"name":"disk","scalar":{"value":1024.0},"type":"SCALAR"},{"name":"ports","ranges":{"range":[{"begin":31000,"end":32000}]},"type":"RANGES"}]
I0727 08:08:08.391764 30791 slave.cpp:573] Agent attributes: [  ]
I0727 08:08:08.391782 30791 slave.cpp:582] Agent hostname: 3a0894a21cce
I0727 08:08:08.392304 30793 status_update_manager.cpp:177] Pausing sending status updates
I0727 08:08:08.394407 30794 state.cpp:64] Recovering state from '/tmp/Endpoint_SlaveEndpointTest_NoAuthorizer_1_WvQVpu/meta'
I0727 08:08:08.395126 30795 status_update_manager.cpp:203] Recovering status update manager
I0727 08:08:08.395452 30797 containerizer.cpp:582] Recovering containerizer
I0727 08:08:08.397704 30794 provisioner.cpp:416] Provisioner recovery complete
I0727 08:08:08.398430 30790 slave.cpp:6207] Finished recovery
I0727 08:08:08.399418 30790 slave.cpp:6389] Querying resource estimator for oversubscribable
resources
I0727 08:08:08.399960 30790 slave.cpp:6403] Received oversubscribable resources {} from the
resource estimator
I0727 08:08:08.404058 30791 process.cpp:3837] Handling HTTP event for process 'slave(798)'
with path: '/slave(798)/monitor/statistics.json'
I0727 08:08:08.406257 30792 http.cpp:1133] HTTP GET for /slave(798)/monitor/statistics.json
from 172.17.0.4:48638
I0727 08:08:08.406406 30792 http.cpp:957] Authorizing principal 'test-principal' to GET the
'/monitor/statistics.json' endpoint
I0727 08:08:08.412092 30792 slave.cpp:843] Agent terminating
[       OK ] Endpoint/SlaveEndpointTest.NoAuthorizer/1 (49 ms)
[ RUN      ] Endpoint/SlaveEndpointTest.NoAuthorizer/2
I0727 08:08:08.429255 30789 containerizer.cpp:230] Using isolation: posix/cpu,posix/mem,filesystem/posix,network/cni,environment_secret
W0727 08:08:08.429994 30789 backend.cpp:76] Failed to create 'overlay' backend: OverlayBackend
requires root privileges
W0727 08:08:08.430167 30789 backend.cpp:76] Failed to create 'bind' backend: BindBackend requires
root privileges
I0727 08:08:08.430210 30789 provisioner.cpp:255] Using default backend 'copy'
I0727 08:08:08.432718 30789 cluster.cpp:448] Creating default 'local' authorizer
I0727 08:08:08.435449 30790 slave.cpp:250] Mesos agent started on (799)@172.17.0.4:38057
I0727 08:08:08.435499 30790 slave.cpp:251] Flags at startup: --acls="" --appc_simple_discovery_uri_prefix="http://"
--appc_store_dir="/tmp/Endpoint_SlaveEndpointTest_NoAuthorizer_2_BW3kSC/store/appc" --authenticate_http_readonly="true"
--authenticate_http_readwrite="true" --authenticatee="crammd5" --authentication_backoff_factor="1secs"
--authorizer="local" --cgroups_cpu_enable_pids_and_tids_count="false" --cgroups_enable_cfs="false"
--cgroups_hierarchy="/sys/fs/cgroup" --cgroups_limit_swap="false" --cgroups_root="mesos" --container_disk_watch_interval="15secs"
--containerizers="mesos" --credential="/tmp/Endpoint_SlaveEndpointTest_NoAuthorizer_2_BW3kSC/credential"
--default_role="*" --disk_watch_interval="1mins" --docker="docker" --docker_kill_orphans="true"
--docker_registry="https://registry-1.docker.io" --docker_remove_delay="6hrs" --docker_socket="/var/run/docker.sock"
--docker_stop_timeout="0ns" --docker_store_dir="/tmp/Endpoint_SlaveEndpointTest_NoAuthorizer_2_BW3kSC/store/docker"
--docker_volume_checkpoint_dir="/var/run/mesos/isolators/docker/volume" --enforce_container_disk_quota="false"
--executor_registration_timeout="1mins" --executor_reregistration_timeout="2secs" --executor_shutdown_grace_period="5secs"
--fetcher_cache_dir="/tmp/Endpoint_SlaveEndpointTest_NoAuthorizer_2_BW3kSC/fetch" --fetcher_cache_size="2GB"
--frameworks_home="" --gc_delay="1weeks" --gc_disk_headroom="0.1" --hadoop_home="" --help="false"
--hostname_lookup="true" --http_command_executor="false" --http_credentials="/tmp/Endpoint_SlaveEndpointTest_NoAuthorizer_2_BW3kSC/http_credentials"
--http_heartbeat_interval="30secs" --initialize_driver_logging="true" --isolation="posix/cpu,posix/mem"
--launcher="posix" --launcher_dir="/mesos/build/src" --logbufsecs="0" --logging_level="INFO"
--max_completed_executors_per_framework="150" --oversubscribed_resources_interval="15secs"
--perf_duration="10secs" --perf_interval="1mins" --port="5051" --qos_correction_interval_min="0ns"
--quiet="false" --recover="reconnect" --recovery_timeout="15mins" --registration_backoff_factor="10ms"
--resources="cpus:2;gpus:0;mem:1024;disk:1024;ports:[31000-32000]" --revocable_cpu_low_priority="true"
--runtime_dir="/tmp/Endpoint_SlaveEndpointTest_NoAuthorizer_2_BW3kSC" --sandbox_directory="/mnt/mesos/sandbox"
--strict="true" --switch_user="true" --systemd_enable_support="true" --systemd_runtime_directory="/run/systemd/system"
--version="false" --work_dir="/tmp/Endpoint_SlaveEndpointTest_NoAuthorizer_2_oqjxwo"
I0727 08:08:08.436530 30790 credentials.hpp:86] Loading credential for authentication from
'/tmp/Endpoint_SlaveEndpointTest_NoAuthorizer_2_BW3kSC/credential'
I0727 08:08:08.437151 30790 slave.cpp:283] Agent using credential for: test-principal
I0727 08:08:08.437181 30790 credentials.hpp:37] Loading credentials for authentication from
'/tmp/Endpoint_SlaveEndpointTest_NoAuthorizer_2_BW3kSC/http_credentials'
I0727 08:08:08.437734 30790 http.cpp:993] Creating default 'basic' HTTP authenticator for
realm 'mesos-agent-readonly'
I0727 08:08:08.438184 30790 http.cpp:993] Creating default 'basic' HTTP authenticator for
realm 'mesos-agent-readwrite'
I0727 08:08:08.440536 30790 slave.cpp:565] Agent resources: [{"name":"cpus","scalar":{"value":2.0},"type":"SCALAR"},{"name":"mem","scalar":{"value":1024.0},"type":"SCALAR"},{"name":"disk","scalar":{"value":1024.0},"type":"SCALAR"},{"name":"ports","ranges":{"range":[{"begin":31000,"end":32000}]},"type":"RANGES"}]
I0727 08:08:08.440862 30790 slave.cpp:573] Agent attributes: [  ]
I0727 08:08:08.440881 30790 slave.cpp:582] Agent hostname: 3a0894a21cce
I0727 08:08:08.442081 30792 status_update_manager.cpp:177] Pausing sending status updates
I0727 08:08:08.443681 30794 state.cpp:64] Recovering state from '/tmp/Endpoint_SlaveEndpointTest_NoAuthorizer_2_oqjxwo/meta'
I0727 08:08:08.444479 30794 status_update_manager.cpp:203] Recovering status update manager
I0727 08:08:08.444717 30794 containerizer.cpp:582] Recovering containerizer
I0727 08:08:08.446775 30794 provisioner.cpp:416] Provisioner recovery complete
I0727 08:08:08.447477 30792 slave.cpp:6207] Finished recovery
I0727 08:08:08.448407 30792 slave.cpp:6389] Querying resource estimator for oversubscribable
resources
I0727 08:08:08.448832 30790 slave.cpp:6403] Received oversubscribable resources {} from the
resource estimator
I0727 08:08:08.452661 30790 process.cpp:3837] Handling HTTP event for process 'slave(799)'
with path: '/slave(799)/containers'
I0727 08:08:08.455085 30794 http.cpp:1133] HTTP GET for /slave(799)/containers from 172.17.0.4:48640
I0727 08:08:08.455204 30794 http.cpp:957] Authorizing principal 'test-principal' to GET the
'/containers' endpoint
I0727 08:08:08.468056 30789 slave.cpp:843] Agent terminating
[       OK ] Endpoint/SlaveEndpointTest.NoAuthorizer/2 (67 ms)
[----------] 9 tests from Endpoint/SlaveEndpointTest (478 ms total)

[----------] Global test environment tear-down
[==========] 1602 tests from 174 test cases ran. (425318 ms total)
[  PASSED  ] 1601 tests.
[  FAILED  ] 1 test, listed below:
[  FAILED  ] SlaveTest.ContainersEndpoint

 1 FAILED TEST
  YOU HAVE 20 DISABLED TESTS

I0727 08:08:08.626634 30798 process.cpp:1006] Failed to accept socket: future discarded
make[3]: Leaving directory `/mesos/build'
make[3]: *** [CMakeFiles/check] Error 1
make[2]: *** [CMakeFiles/check.dir/all] Error 2
make[2]: Leaving directory `/mesos/build'
make[1]: *** [CMakeFiles/check.dir/rule] Error 2
make[1]: Leaving directory `/mesos/build'
make: *** [check] Error 2
+ docker rmi mesos-1501138149-20898
Untagged: mesos-1501138149-20898:latest
Deleted: sha256:2c4f7903507be8f7e5729afdba7f70db4099587ac1c2e8bf6809fff765afc642
Deleted: sha256:26cf0a76bdc7c28214c46add3f6b9203f7b3c0008d82e6d98c7d0fd6bef3747b
Deleted: sha256:bd41675f4d7c03c3a7c3fc57ceb2ffa4c72ffecd55dfab051d791adb0c772f83
Deleted: sha256:6089016d597266c47d0fd9fbd25e9df592e78a85e2a8b1011057ddc59964d832
Deleted: sha256:85401034f69cadfe74890965e549d00e487f340949d3c53610c3468da39bd118
Deleted: sha256:013c2c555c6d2f0419cef4827a337104c6fcdcfa5cd7bc5912b5717a9ee27f50
Deleted: sha256:0d39e5ed7825ad71d7fc6d61da7a68c4ebb8fc3a474087dcb72bbd47a2b41b82
Deleted: sha256:9d4d60b0edaf8895cfa56a6552f225c4ba326c14ae41d442108950d174710751
Deleted: sha256:9a4a32e406d25f156c9969abfcd6fdcd4b82438ade9534c6e477909cc854df4b
Deleted: sha256:02b369d11cce0e5077596f5d3f88be7a0d252bea73c25226f630081b756551df
Deleted: sha256:1597f1054e6efff88bece7d8a959a6bd381e484073d00544b78d2945652ae575
Deleted: sha256:09d56a8170f6ceec7219a6e6c3eb10e9c9b6d4545c7850de3622e38e8180c643
Deleted: sha256:0a2b9817712ae2aa05752d80ed304e9aed7231c645080dc229986880af2594d8
Deleted: sha256:fbaa1442ff6c65ce5ed72fa31cbe5bbfc8c9c73336ef3980ec14b154a0fc8df5
Deleted: sha256:36c036a7ac84e4de2ccccd0ebaeac390377e66c2e6337bb115440a76d8618060
Deleted: sha256:2f89cb08570cdb0e546d241ec7f68055c54a2cd975871e92f41e5ab9e7bfa977
Deleted: sha256:aa945af88f652a3191eb8cb0538b1bb087c879661ae8b9e19c7950cc7ce9a2e7
Deleted: sha256:3f4b409cfa0cb3b021ecff9d4e8b1a6de091807af2dfe7e8e5a37325f9d81fc8
Deleted: sha256:dadac958fa0d69ed710bcdfffe2acb28cce1b4adeba2df2fc080b0be46ae6766
Deleted: sha256:5ae8348dc33d1745bc28301aad53780614286b15d8cbd00b11bf7d0afc68af5f
Deleted: sha256:72ea022fb57abc6f9f686c36d136e4c48f640d5be515b72e1f2e264879012440
Deleted: sha256:14f290667deecddc2fca556bee75469b473ba87d690c996daf3708be8a219c92
Deleted: sha256:b8e1d7c7a5393f2f65755c2bb4bd4255c6d46cca885352a3afc97881e72cbd94
Deleted: sha256:37c512cf290861e7ab2a08b09503756fe82b9419cd0d8704bd56e79909b89c7a
Build step 'Execute shell' marked build as failure
Not sending mail to unregistered user zhq527725@gmail.com

Mime
View raw message