mesos-builds mailing list archives

Site index · List index
Message view « Date » · « Thread »
Top « Date » · « Thread »
From Apache Jenkins Server <jenk...@builds.apache.org>
Subject Build failed in Jenkins: Mesos-Buildbot » cmake,gcc,--verbose,GLOG_v=1 MESOS_VERBOSE=1,ubuntu:14.04,(ubuntu)&&(!ubuntu-us1)&&(!ubuntu-eu2) #3951
Date Tue, 25 Jul 2017 05:18:37 GMT
See <https://builds.apache.org/job/Mesos-Buildbot/BUILDTOOL=cmake,COMPILER=gcc,CONFIGURATION=--verbose,ENVIRONMENT=GLOG_v=1%20MESOS_VERBOSE=1,OS=ubuntu%3A14.04,label_exp=(ubuntu)&&(!ubuntu-us1)&&(!ubuntu-eu2)/3951/display/redirect>

------------------------------------------
[...truncated 28.04 MB...]
I0725 05:18:32.002205 32592 http.cpp:1133] HTTP GET for /slave(788)/monitor/statistics.json
from 172.17.0.2:48422
I0725 05:18:32.002285 32592 http.cpp:957] Authorizing principal 'test-principal' to GET the
'/monitor/statistics.json' endpoint
I0725 05:18:32.005887 32604 slave.cpp:843] Agent terminating
[       OK ] Endpoint/SlaveEndpointTest.AuthorizedRequest/1 (30 ms)
[ RUN      ] Endpoint/SlaveEndpointTest.AuthorizedRequest/2
I0725 05:18:32.020426 32591 containerizer.cpp:230] Using isolation: posix/cpu,posix/mem,filesystem/posix,network/cni,environment_secret
W0725 05:18:32.021268 32591 backend.cpp:76] Failed to create 'aufs' backend: AufsBackend requires
root privileges
W0725 05:18:32.021459 32591 backend.cpp:76] Failed to create 'bind' backend: BindBackend requires
root privileges
I0725 05:18:32.021487 32591 provisioner.cpp:255] Using default backend 'copy'
I0725 05:18:32.028060 32593 slave.cpp:250] Mesos agent started on (789)@172.17.0.2:38497
I0725 05:18:32.028081 32593 slave.cpp:251] Flags at startup: --acls="" --appc_simple_discovery_uri_prefix="http://"
--appc_store_dir="/tmp/Endpoint_SlaveEndpointTest_AuthorizedRequest_2_wHXfrw/store/appc" --authenticate_http_readonly="true"
--authenticate_http_readwrite="true" --authenticatee="crammd5" --authentication_backoff_factor="1secs"
--authorizer="local" --cgroups_cpu_enable_pids_and_tids_count="false" --cgroups_enable_cfs="false"
--cgroups_hierarchy="/sys/fs/cgroup" --cgroups_limit_swap="false" --cgroups_root="mesos" --container_disk_watch_interval="15secs"
--containerizers="mesos" --credential="/tmp/Endpoint_SlaveEndpointTest_AuthorizedRequest_2_wHXfrw/credential"
--default_role="*" --disk_watch_interval="1mins" --docker="docker" --docker_kill_orphans="true"
--docker_registry="https://registry-1.docker.io" --docker_remove_delay="6hrs" --docker_socket="/var/run/docker.sock"
--docker_stop_timeout="0ns" --docker_store_dir="/tmp/Endpoint_SlaveEndpointTest_AuthorizedRequest_2_wHXfrw/store/docker"
--docker_volume_checkpoint_dir="/var/run/mesos/isolators/docker/volume" --enforce_container_disk_quota="false"
--executor_registration_timeout="1mins" --executor_reregistration_timeout="2secs" --executor_shutdown_grace_period="5secs"
--fetcher_cache_dir="/tmp/Endpoint_SlaveEndpointTest_AuthorizedRequest_2_wHXfrw/fetch" --fetcher_cache_size="2GB"
--frameworks_home="" --gc_delay="1weeks" --gc_disk_headroom="0.1" --hadoop_home="" --help="false"
--hostname_lookup="true" --http_command_executor="false" --http_credentials="/tmp/Endpoint_SlaveEndpointTest_AuthorizedRequest_2_wHXfrw/http_credentials"
--http_heartbeat_interval="30secs" --initialize_driver_logging="true" --isolation="posix/cpu,posix/mem"
--launcher="posix" --launcher_dir="/mesos/build/src" --logbufsecs="0" --logging_level="INFO"
--max_completed_executors_per_framework="150" --oversubscribed_resources_interval="15secs"
--perf_duration="10secs" --perf_interval="1mins" --port="5051" --qos_correction_interval_min="0ns"
--quiet="false" --recover="reconnect" --recovery_timeout="15mins" --registration_backoff_factor="10ms"
--resources="cpus:2;gpus:0;mem:1024;disk:1024;ports:[31000-32000]" --revocable_cpu_low_priority="true"
--runtime_dir="/tmp/Endpoint_SlaveEndpointTest_AuthorizedRequest_2_wHXfrw" --sandbox_directory="/mnt/mesos/sandbox"
--strict="true" --switch_user="true" --systemd_enable_support="true" --systemd_runtime_directory="/run/systemd/system"
--version="false" --work_dir="/tmp/Endpoint_SlaveEndpointTest_AuthorizedRequest_2_Z1MKFx"
I0725 05:18:32.028520 32593 credentials.hpp:86] Loading credential for authentication from
'/tmp/Endpoint_SlaveEndpointTest_AuthorizedRequest_2_wHXfrw/credential'
I0725 05:18:32.028692 32593 slave.cpp:283] Agent using credential for: test-principal
I0725 05:18:32.028708 32593 credentials.hpp:37] Loading credentials for authentication from
'/tmp/Endpoint_SlaveEndpointTest_AuthorizedRequest_2_wHXfrw/http_credentials'
I0725 05:18:32.028941 32593 http.cpp:993] Creating default 'basic' HTTP authenticator for
realm 'mesos-agent-readonly'
I0725 05:18:32.029105 32593 http.cpp:993] Creating default 'basic' HTTP authenticator for
realm 'mesos-agent-readwrite'
I0725 05:18:32.030504 32593 slave.cpp:565] Agent resources: [{"name":"cpus","scalar":{"value":2.0},"type":"SCALAR"},{"name":"mem","scalar":{"value":1024.0},"type":"SCALAR"},{"name":"disk","scalar":{"value":1024.0},"type":"SCALAR"},{"name":"ports","ranges":{"range":[{"begin":31000,"end":32000}]},"type":"RANGES"}]
I0725 05:18:32.030716 32593 slave.cpp:573] Agent attributes: [  ]
I0725 05:18:32.030725 32593 slave.cpp:582] Agent hostname: da5ae405b8e4
I0725 05:18:32.030899 32613 status_update_manager.cpp:177] Pausing sending status updates
I0725 05:18:32.032428 32612 state.cpp:64] Recovering state from '/tmp/Endpoint_SlaveEndpointTest_AuthorizedRequest_2_Z1MKFx/meta'
I0725 05:18:32.032655 32610 status_update_manager.cpp:203] Recovering status update manager
I0725 05:18:32.032845 32606 containerizer.cpp:582] Recovering containerizer
I0725 05:18:32.034530 32614 provisioner.cpp:416] Provisioner recovery complete
I0725 05:18:32.034912 32612 slave.cpp:6207] Finished recovery
I0725 05:18:32.035593 32612 slave.cpp:6389] Querying resource estimator for oversubscribable
resources
I0725 05:18:32.035807 32611 slave.cpp:6403] Received oversubscribable resources {} from the
resource estimator
I0725 05:18:32.038890 32613 process.cpp:3837] Handling HTTP event for process 'slave(789)'
with path: '/slave(789)/containers'
I0725 05:18:32.040096 32615 http.cpp:1133] HTTP GET for /slave(789)/containers from 172.17.0.2:48424
I0725 05:18:32.040166 32615 http.cpp:957] Authorizing principal 'test-principal' to GET the
'/containers' endpoint
I0725 05:18:32.044734 32591 slave.cpp:843] Agent terminating
[       OK ] Endpoint/SlaveEndpointTest.AuthorizedRequest/2 (39 ms)
[ RUN      ] Endpoint/SlaveEndpointTest.UnauthorizedRequest/0
I0725 05:18:32.056352 32591 containerizer.cpp:230] Using isolation: posix/cpu,posix/mem,filesystem/posix,network/cni,environment_secret
W0725 05:18:32.056957 32591 backend.cpp:76] Failed to create 'aufs' backend: AufsBackend requires
root privileges
W0725 05:18:32.057062 32591 backend.cpp:76] Failed to create 'bind' backend: BindBackend requires
root privileges
I0725 05:18:32.057088 32591 provisioner.cpp:255] Using default backend 'copy'
I0725 05:18:32.060288 32594 slave.cpp:250] Mesos agent started on (790)@172.17.0.2:38497
I0725 05:18:32.060317 32594 slave.cpp:251] Flags at startup: --acls="" --appc_simple_discovery_uri_prefix="http://"
--appc_store_dir="/tmp/Endpoint_SlaveEndpointTest_UnauthorizedRequest_0_ou38Or/store/appc"
--authenticate_http_readonly="true" --authenticate_http_readwrite="true" --authenticatee="crammd5"
--authentication_backoff_factor="1secs" --authorizer="local" --cgroups_cpu_enable_pids_and_tids_count="false"
--cgroups_enable_cfs="false" --cgroups_hierarchy="/sys/fs/cgroup" --cgroups_limit_swap="false"
--cgroups_root="mesos" --container_disk_watch_interval="15secs" --containerizers="mesos" --credential="/tmp/Endpoint_SlaveEndpointTest_UnauthorizedRequest_0_ou38Or/credential"
--default_role="*" --disk_watch_interval="1mins" --docker="docker" --docker_kill_orphans="true"
--docker_registry="https://registry-1.docker.io" --docker_remove_delay="6hrs" --docker_socket="/var/run/docker.sock"
--docker_stop_timeout="0ns" --docker_store_dir="/tmp/Endpoint_SlaveEndpointTest_UnauthorizedRequest_0_ou38Or/store/docker"
--docker_volume_checkpoint_dir="/var/run/mesos/isolators/docker/volume" --enforce_container_disk_quota="false"
--executor_registration_timeout="1mins" --executor_reregistration_timeout="2secs" --executor_shutdown_grace_period="5secs"
--fetcher_cache_dir="/tmp/Endpoint_SlaveEndpointTest_UnauthorizedRequest_0_ou38Or/fetch" --fetcher_cache_size="2GB"
--frameworks_home="" --gc_delay="1weeks" --gc_disk_headroom="0.1" --hadoop_home="" --help="false"
--hostname_lookup="true" --http_command_executor="false" --http_credentials="/tmp/Endpoint_SlaveEndpointTest_UnauthorizedRequest_0_ou38Or/http_credentials"
--http_heartbeat_interval="30secs" --initialize_driver_logging="true" --isolation="posix/cpu,posix/mem"
--launcher="posix" --launcher_dir="/mesos/build/src" --logbufsecs="0" --logging_level="INFO"
--max_completed_executors_per_framework="150" --oversubscribed_resources_interval="15secs"
--perf_duration="10secs" --perf_interval="1mins" --port="5051" --qos_correction_interval_min="0ns"
--quiet="false" --recover="reconnect" --recovery_timeout="15mins" --registration_backoff_factor="10ms"
--resources="cpus:2;gpus:0;mem:1024;disk:1024;ports:[31000-32000]" --revocable_cpu_low_priority="true"
--runtime_dir="/tmp/Endpoint_SlaveEndpointTest_UnauthorizedRequest_0_ou38Or" --sandbox_directory="/mnt/mesos/sandbox"
--strict="true" --switch_user="true" --systemd_enable_support="true" --systemd_runtime_directory="/run/systemd/system"
--version="false" --work_dir="/tmp/Endpoint_SlaveEndpointTest_UnauthorizedRequest_0_B3iUXs"
I0725 05:18:32.060726 32594 credentials.hpp:86] Loading credential for authentication from
'/tmp/Endpoint_SlaveEndpointTest_UnauthorizedRequest_0_ou38Or/credential'
I0725 05:18:32.060915 32594 slave.cpp:283] Agent using credential for: test-principal
I0725 05:18:32.060930 32594 credentials.hpp:37] Loading credentials for authentication from
'/tmp/Endpoint_SlaveEndpointTest_UnauthorizedRequest_0_ou38Or/http_credentials'
I0725 05:18:32.061148 32594 http.cpp:993] Creating default 'basic' HTTP authenticator for
realm 'mesos-agent-readonly'
I0725 05:18:32.061290 32594 http.cpp:993] Creating default 'basic' HTTP authenticator for
realm 'mesos-agent-readwrite'
I0725 05:18:32.063313 32594 slave.cpp:565] Agent resources: [{"name":"cpus","scalar":{"value":2.0},"type":"SCALAR"},{"name":"mem","scalar":{"value":1024.0},"type":"SCALAR"},{"name":"disk","scalar":{"value":1024.0},"type":"SCALAR"},{"name":"ports","ranges":{"range":[{"begin":31000,"end":32000}]},"type":"RANGES"}]
I0725 05:18:32.063654 32594 slave.cpp:573] Agent attributes: [  ]
I0725 05:18:32.063668 32594 slave.cpp:582] Agent hostname: da5ae405b8e4
I0725 05:18:32.063884 32606 status_update_manager.cpp:177] Pausing sending status updates
I0725 05:18:32.065493 32597 state.cpp:64] Recovering state from '/tmp/Endpoint_SlaveEndpointTest_UnauthorizedRequest_0_B3iUXs/meta'
I0725 05:18:32.065803 32612 status_update_manager.cpp:203] Recovering status update manager
I0725 05:18:32.066009 32610 containerizer.cpp:582] Recovering containerizer
I0725 05:18:32.067690 32609 provisioner.cpp:416] Provisioner recovery complete
I0725 05:18:32.068153 32597 slave.cpp:6207] Finished recovery
I0725 05:18:32.068572 32597 slave.cpp:6389] Querying resource estimator for oversubscribable
resources
I0725 05:18:32.068766 32603 slave.cpp:6403] Received oversubscribable resources {} from the
resource estimator
I0725 05:18:32.071759 32606 process.cpp:3837] Handling HTTP event for process 'slave(790)'
with path: '/slave(790)/monitor/statistics'
I0725 05:18:32.073199 32613 http.cpp:1133] HTTP GET for /slave(790)/monitor/statistics from
172.17.0.2:48428
I0725 05:18:32.073276 32613 http.cpp:957] Authorizing principal 'test-principal' to GET the
'/monitor/statistics' endpoint
I0725 05:18:32.075585 32599 slave.cpp:843] Agent terminating
[       OK ] Endpoint/SlaveEndpointTest.UnauthorizedRequest/0 (30 ms)
[ RUN      ] Endpoint/SlaveEndpointTest.UnauthorizedRequest/1
I0725 05:18:32.085762 32591 containerizer.cpp:230] Using isolation: posix/cpu,posix/mem,filesystem/posix,network/cni,environment_secret
W0725 05:18:32.086221 32591 backend.cpp:76] Failed to create 'aufs' backend: AufsBackend requires
root privileges
W0725 05:18:32.086305 32591 backend.cpp:76] Failed to create 'bind' backend: BindBackend requires
root privileges
I0725 05:18:32.086333 32591 provisioner.cpp:255] Using default backend 'copy'
I0725 05:18:32.089221 32612 slave.cpp:250] Mesos agent started on (791)@172.17.0.2:38497
I0725 05:18:32.089238 32612 slave.cpp:251] Flags at startup: --acls="" --appc_simple_discovery_uri_prefix="http://"
--appc_store_dir="/tmp/Endpoint_SlaveEndpointTest_UnauthorizedRequest_1_QoIlvn/store/appc"
--authenticate_http_readonly="true" --authenticate_http_readwrite="true" --authenticatee="crammd5"
--authentication_backoff_factor="1secs" --authorizer="local" --cgroups_cpu_enable_pids_and_tids_count="false"
--cgroups_enable_cfs="false" --cgroups_hierarchy="/sys/fs/cgroup" --cgroups_limit_swap="false"
--cgroups_root="mesos" --container_disk_watch_interval="15secs" --containerizers="mesos" --credential="/tmp/Endpoint_SlaveEndpointTest_UnauthorizedRequest_1_QoIlvn/credential"
--default_role="*" --disk_watch_interval="1mins" --docker="docker" --docker_kill_orphans="true"
--docker_registry="https://registry-1.docker.io" --docker_remove_delay="6hrs" --docker_socket="/var/run/docker.sock"
--docker_stop_timeout="0ns" --docker_store_dir="/tmp/Endpoint_SlaveEndpointTest_UnauthorizedRequest_1_QoIlvn/store/docker"
--docker_volume_checkpoint_dir="/var/run/mesos/isolators/docker/volume" --enforce_container_disk_quota="false"
--executor_registration_timeout="1mins" --executor_reregistration_timeout="2secs" --executor_shutdown_grace_period="5secs"
--fetcher_cache_dir="/tmp/Endpoint_SlaveEndpointTest_UnauthorizedRequest_1_QoIlvn/fetch" --fetcher_cache_size="2GB"
--frameworks_home="" --gc_delay="1weeks" --gc_disk_headroom="0.1" --hadoop_home="" --help="false"
--hostname_lookup="true" --http_command_executor="false" --http_credentials="/tmp/Endpoint_SlaveEndpointTest_UnauthorizedRequest_1_QoIlvn/http_credentials"
--http_heartbeat_interval="30secs" --initialize_driver_logging="true" --isolation="posix/cpu,posix/mem"
--launcher="posix" --launcher_dir="/mesos/build/src" --logbufsecs="0" --logging_level="INFO"
--max_completed_executors_per_framework="150" --oversubscribed_resources_interval="15secs"
--perf_duration="10secs" --perf_interval="1mins" --port="5051" --qos_correction_interval_min="0ns"
--quiet="false" --recover="reconnect" --recovery_timeout="15mins" --registration_backoff_factor="10ms"
--resources="cpus:2;gpus:0;mem:1024;disk:1024;ports:[31000-32000]" --revocable_cpu_low_priority="true"
--runtime_dir="/tmp/Endpoint_SlaveEndpointTest_UnauthorizedRequest_1_QoIlvn" --sandbox_directory="/mnt/mesos/sandbox"
--strict="true" --switch_user="true" --systemd_enable_support="true" --systemd_runtime_directory="/run/systemd/system"
--version="false" --work_dir="/tmp/Endpoint_SlaveEndpointTest_UnauthorizedRequest_1_r85Fzo"
I0725 05:18:32.089596 32612 credentials.hpp:86] Loading credential for authentication from
'/tmp/Endpoint_SlaveEndpointTest_UnauthorizedRequest_1_QoIlvn/credential'
I0725 05:18:32.089735 32612 slave.cpp:283] Agent using credential for: test-principal
I0725 05:18:32.089756 32612 credentials.hpp:37] Loading credentials for authentication from
'/tmp/Endpoint_SlaveEndpointTest_UnauthorizedRequest_1_QoIlvn/http_credentials'
I0725 05:18:32.089967 32612 http.cpp:993] Creating default 'basic' HTTP authenticator for
realm 'mesos-agent-readonly'
I0725 05:18:32.090095 32612 http.cpp:993] Creating default 'basic' HTTP authenticator for
realm 'mesos-agent-readwrite'
I0725 05:18:32.091400 32612 slave.cpp:565] Agent resources: [{"name":"cpus","scalar":{"value":2.0},"type":"SCALAR"},{"name":"mem","scalar":{"value":1024.0},"type":"SCALAR"},{"name":"disk","scalar":{"value":1024.0},"type":"SCALAR"},{"name":"ports","ranges":{"range":[{"begin":31000,"end":32000}]},"type":"RANGES"}]
I0725 05:18:32.091599 32612 slave.cpp:573] Agent attributes: [  ]
I0725 05:18:32.091614 32612 slave.cpp:582] Agent hostname: da5ae405b8e4
I0725 05:18:32.091737 32598 status_update_manager.cpp:177] Pausing sending status updates
I0725 05:18:32.093016 32610 state.cpp:64] Recovering state from '/tmp/Endpoint_SlaveEndpointTest_UnauthorizedRequest_1_r85Fzo/meta'
I0725 05:18:32.093446 32595 status_update_manager.cpp:203] Recovering status update manager
I0725 05:18:32.093834 32613 containerizer.cpp:582] Recovering containerizer
I0725 05:18:32.095412 32592 provisioner.cpp:416] Provisioner recovery complete
I0725 05:18:32.095794 32615 slave.cpp:6207] Finished recovery
I0725 05:18:32.096200 32615 slave.cpp:6389] Querying resource estimator for oversubscribable
resources
I0725 05:18:32.096488 32600 slave.cpp:6403] Received oversubscribable resources {} from the
resource estimator
I0725 05:18:32.098865 32603 process.cpp:3837] Handling HTTP event for process 'slave(791)'
with path: '/slave(791)/monitor/statistics.json'
I0725 05:18:32.100116 32604 http.cpp:1133] HTTP GET for /slave(791)/monitor/statistics.json
from 172.17.0.2:48430
I0725 05:18:32.100185 32604 http.cpp:957] Authorizing principal 'test-principal' to GET the
'/monitor/statistics.json' endpoint
I0725 05:18:32.102339 32601 slave.cpp:843] Agent terminating
[       OK ] Endpoint/SlaveEndpointTest.UnauthorizedRequest/1 (26 ms)
[ RUN      ] Endpoint/SlaveEndpointTest.UnauthorizedRequest/2
I0725 05:18:32.112179 32591 containerizer.cpp:230] Using isolation: posix/cpu,posix/mem,filesystem/posix,network/cni,environment_secret
W0725 05:18:32.112642 32591 backend.cpp:76] Failed to create 'aufs' backend: AufsBackend requires
root privileges
W0725 05:18:32.112730 32591 backend.cpp:76] Failed to create 'bind' backend: BindBackend requires
root privileges
I0725 05:18:32.112757 32591 provisioner.cpp:255] Using default backend 'copy'
I0725 05:18:32.115797 32597 slave.cpp:250] Mesos agent started on (792)@172.17.0.2:38497
I0725 05:18:32.115818 32597 slave.cpp:251] Flags at startup: --acls="" --appc_simple_discovery_uri_prefix="http://"
--appc_store_dir="/tmp/Endpoint_SlaveEndpointTest_UnauthorizedRequest_2_6yWrrj/store/appc"
--authenticate_http_readonly="true" --authenticate_http_readwrite="true" --authenticatee="crammd5"
--authentication_backoff_factor="1secs" --authorizer="local" --cgroups_cpu_enable_pids_and_tids_count="false"
--cgroups_enable_cfs="false" --cgroups_hierarchy="/sys/fs/cgroup" --cgroups_limit_swap="false"
--cgroups_root="mesos" --container_disk_watch_interval="15secs" --containerizers="mesos" --credential="/tmp/Endpoint_SlaveEndpointTest_UnauthorizedRequest_2_6yWrrj/credential"
--default_role="*" --disk_watch_interval="1mins" --docker="docker" --docker_kill_orphans="true"
--docker_registry="https://registry-1.docker.io" --docker_remove_delay="6hrs" --docker_socket="/var/run/docker.sock"
--docker_stop_timeout="0ns" --docker_store_dir="/tmp/Endpoint_SlaveEndpointTest_UnauthorizedRequest_2_6yWrrj/store/docker"
--docker_volume_checkpoint_dir="/var/run/mesos/isolators/docker/volume" --enforce_container_disk_quota="false"
--executor_registration_timeout="1mins" --executor_reregistration_timeout="2secs" --executor_shutdown_grace_period="5secs"
--fetcher_cache_dir="/tmp/Endpoint_SlaveEndpointTest_UnauthorizedRequest_2_6yWrrj/fetch" --fetcher_cache_size="2GB"
--frameworks_home="" --gc_delay="1weeks" --gc_disk_headroom="0.1" --hadoop_home="" --help="false"
--hostname_lookup="true" --http_command_executor="false" --http_credentials="/tmp/Endpoint_SlaveEndpointTest_UnauthorizedRequest_2_6yWrrj/http_credentials"
--http_heartbeat_interval="30secs" --initialize_driver_logging="true" --isolation="posix/cpu,posix/mem"
--launcher="posix" --launcher_dir="/mesos/build/src" --logbufsecs="0" --logging_level="INFO"
--max_completed_executors_per_framework="150" --oversubscribed_resources_interval="15secs"
--perf_duration="10secs" --perf_interval="1mins" --port="5051" --qos_correction_interval_min="0ns"
--quiet="false" --recover="reconnect" --recovery_timeout="15mins" --registration_backoff_factor="10ms"
--resources="cpus:2;gpus:0;mem:1024;disk:1024;ports:[31000-32000]" --revocable_cpu_low_priority="true"
--runtime_dir="/tmp/Endpoint_SlaveEndpointTest_UnauthorizedRequest_2_6yWrrj" --sandbox_directory="/mnt/mesos/sandbox"
--strict="true" --switch_user="true" --systemd_enable_support="true" --systemd_runtime_directory="/run/systemd/system"
--version="false" --work_dir="/tmp/Endpoint_SlaveEndpointTest_UnauthorizedRequest_2_B8CQrk"
I0725 05:18:32.116221 32597 credentials.hpp:86] Loading credential for authentication from
'/tmp/Endpoint_SlaveEndpointTest_UnauthorizedRequest_2_6yWrrj/credential'
I0725 05:18:32.116359 32597 slave.cpp:283] Agent using credential for: test-principal
I0725 05:18:32.116375 32597 credentials.hpp:37] Loading credentials for authentication from
'/tmp/Endpoint_SlaveEndpointTest_UnauthorizedRequest_2_6yWrrj/http_credentials'
I0725 05:18:32.116581 32597 http.cpp:993] Creating default 'basic' HTTP authenticator for
realm 'mesos-agent-readonly'
I0725 05:18:32.116708 32597 http.cpp:993] Creating default 'basic' HTTP authenticator for
realm 'mesos-agent-readwrite'
I0725 05:18:32.118479 32597 slave.cpp:565] Agent resources: [{"name":"cpus","scalar":{"value":2.0},"type":"SCALAR"},{"name":"mem","scalar":{"value":1024.0},"type":"SCALAR"},{"name":"disk","scalar":{"value":1024.0},"type":"SCALAR"},{"name":"ports","ranges":{"range":[{"begin":31000,"end":32000}]},"type":"RANGES"}]
I0725 05:18:32.118818 32597 slave.cpp:573] Agent attributes: [  ]
I0725 05:18:32.118832 32597 slave.cpp:582] Agent hostname: da5ae405b8e4
I0725 05:18:32.119035 32596 status_update_manager.cpp:177] Pausing sending status updates
I0725 05:18:32.120489 32602 state.cpp:64] Recovering state from '/tmp/Endpoint_SlaveEndpointTest_UnauthorizedRequest_2_B8CQrk/meta'
I0725 05:18:32.120882 32602 status_update_manager.cpp:203] Recovering status update manager
I0725 05:18:32.121080 32607 containerizer.cpp:582] Recovering containerizer
I0725 05:18:32.122643 32605 provisioner.cpp:416] Provisioner recovery complete
I0725 05:18:32.123061 32614 slave.cpp:6207] Finished recovery
I0725 05:18:32.123595 32614 slave.cpp:6389] Querying resource estimator for oversubscribable
resources
I0725 05:18:32.123900 32611 slave.cpp:6403] Received oversubscribable resources {} from the
resource estimator
I0725 05:18:32.126468 32600 process.cpp:3837] Handling HTTP event for process 'slave(792)'
with path: '/slave(792)/containers'
I0725 05:18:32.128254 32608 http.cpp:1133] HTTP GET for /slave(792)/containers from 172.17.0.2:48432
I0725 05:18:32.128376 32608 http.cpp:957] Authorizing principal 'test-principal' to GET the
'/containers' endpoint
I0725 05:18:32.131106 32591 slave.cpp:843] Agent terminating
[       OK ] Endpoint/SlaveEndpointTest.UnauthorizedRequest/2 (29 ms)
[ RUN      ] Endpoint/SlaveEndpointTest.NoAuthorizer/0
I0725 05:18:32.141296 32591 containerizer.cpp:230] Using isolation: posix/cpu,posix/mem,filesystem/posix,network/cni,environment_secret
W0725 05:18:32.141739 32591 backend.cpp:76] Failed to create 'aufs' backend: AufsBackend requires
root privileges
W0725 05:18:32.141821 32591 backend.cpp:76] Failed to create 'bind' backend: BindBackend requires
root privileges
I0725 05:18:32.141846 32591 provisioner.cpp:255] Using default backend 'copy'
I0725 05:18:32.143404 32591 cluster.cpp:448] Creating default 'local' authorizer
I0725 05:18:32.144997 32603 slave.cpp:250] Mesos agent started on (793)@172.17.0.2:38497
I0725 05:18:32.145014 32603 slave.cpp:251] Flags at startup: --acls="" --appc_simple_discovery_uri_prefix="http://"
--appc_store_dir="/tmp/Endpoint_SlaveEndpointTest_NoAuthorizer_0_mIVvEf/store/appc" --authenticate_http_readonly="true"
--authenticate_http_readwrite="true" --authenticatee="crammd5" --authentication_backoff_factor="1secs"
--authorizer="local" --cgroups_cpu_enable_pids_and_tids_count="false" --cgroups_enable_cfs="false"
--cgroups_hierarchy="/sys/fs/cgroup" --cgroups_limit_swap="false" --cgroups_root="mesos" --container_disk_watch_interval="15secs"
--containerizers="mesos" --credential="/tmp/Endpoint_SlaveEndpointTest_NoAuthorizer_0_mIVvEf/credential"
--default_role="*" --disk_watch_interval="1mins" --docker="docker" --docker_kill_orphans="true"
--docker_registry="https://registry-1.docker.io" --docker_remove_delay="6hrs" --docker_socket="/var/run/docker.sock"
--docker_stop_timeout="0ns" --docker_store_dir="/tmp/Endpoint_SlaveEndpointTest_NoAuthorizer_0_mIVvEf/store/docker"
--docker_volume_checkpoint_dir="/var/run/mesos/isolators/docker/volume" --enforce_container_disk_quota="false"
--executor_registration_timeout="1mins" --executor_reregistration_timeout="2secs" --executor_shutdown_grace_period="5secs"
--fetcher_cache_dir="/tmp/Endpoint_SlaveEndpointTest_NoAuthorizer_0_mIVvEf/fetch" --fetcher_cache_size="2GB"
--frameworks_home="" --gc_delay="1weeks" --gc_disk_headroom="0.1" --hadoop_home="" --help="false"
--hostname_lookup="true" --http_command_executor="false" --http_credentials="/tmp/Endpoint_SlaveEndpointTest_NoAuthorizer_0_mIVvEf/http_credentials"
--http_heartbeat_interval="30secs" --initialize_driver_logging="true" --isolation="posix/cpu,posix/mem"
--launcher="posix" --launcher_dir="/mesos/build/src" --logbufsecs="0" --logging_level="INFO"
--max_completed_executors_per_framework="150" --oversubscribed_resources_interval="15secs"
--perf_duration="10secs" --perf_interval="1mins" --port="5051" --qos_correction_interval_min="0ns"
--quiet="false" --recover="reconnect" --recovery_timeout="15mins" --registration_backoff_factor="10ms"
--resources="cpus:2;gpus:0;mem:1024;disk:1024;ports:[31000-32000]" --revocable_cpu_low_priority="true"
--runtime_dir="/tmp/Endpoint_SlaveEndpointTest_NoAuthorizer_0_mIVvEf" --sandbox_directory="/mnt/mesos/sandbox"
--strict="true" --switch_user="true" --systemd_enable_support="true" --systemd_runtime_directory="/run/systemd/system"
--version="false" --work_dir="/tmp/Endpoint_SlaveEndpointTest_NoAuthorizer_0_RFJCAg"
I0725 05:18:32.145467 32603 credentials.hpp:86] Loading credential for authentication from
'/tmp/Endpoint_SlaveEndpointTest_NoAuthorizer_0_mIVvEf/credential'
I0725 05:18:32.145718 32603 slave.cpp:283] Agent using credential for: test-principal
I0725 05:18:32.145738 32603 credentials.hpp:37] Loading credentials for authentication from
'/tmp/Endpoint_SlaveEndpointTest_NoAuthorizer_0_mIVvEf/http_credentials'
I0725 05:18:32.145982 32603 http.cpp:993] Creating default 'basic' HTTP authenticator for
realm 'mesos-agent-readonly'
I0725 05:18:32.146105 32603 http.cpp:993] Creating default 'basic' HTTP authenticator for
realm 'mesos-agent-readwrite'
I0725 05:18:32.147637 32603 slave.cpp:565] Agent resources: [{"name":"cpus","scalar":{"value":2.0},"type":"SCALAR"},{"name":"mem","scalar":{"value":1024.0},"type":"SCALAR"},{"name":"disk","scalar":{"value":1024.0},"type":"SCALAR"},{"name":"ports","ranges":{"range":[{"begin":31000,"end":32000}]},"type":"RANGES"}]
I0725 05:18:32.147827 32603 slave.cpp:573] Agent attributes: [  ]
I0725 05:18:32.147837 32603 slave.cpp:582] Agent hostname: da5ae405b8e4
I0725 05:18:32.147975 32592 status_update_manager.cpp:177] Pausing sending status updates
I0725 05:18:32.149390 32593 state.cpp:64] Recovering state from '/tmp/Endpoint_SlaveEndpointTest_NoAuthorizer_0_RFJCAg/meta'
I0725 05:18:32.149682 32605 status_update_manager.cpp:203] Recovering status update manager
I0725 05:18:32.149948 32600 containerizer.cpp:582] Recovering containerizer
I0725 05:18:32.151741 32601 provisioner.cpp:416] Provisioner recovery complete
I0725 05:18:32.152087 32603 slave.cpp:6207] Finished recovery
I0725 05:18:32.152494 32603 slave.cpp:6389] Querying resource estimator for oversubscribable
resources
I0725 05:18:32.152801 32597 slave.cpp:6403] Received oversubscribable resources {} from the
resource estimator
I0725 05:18:32.155392 32599 process.cpp:3837] Handling HTTP event for process 'slave(793)'
with path: '/slave(793)/monitor/statistics'
I0725 05:18:32.156883 32615 http.cpp:1133] HTTP GET for /slave(793)/monitor/statistics from
172.17.0.2:48434
I0725 05:18:32.156956 32615 http.cpp:957] Authorizing principal 'test-principal' to GET the
'/monitor/statistics' endpoint
I0725 05:18:32.160413 32591 slave.cpp:843] Agent terminating
[       OK ] Endpoint/SlaveEndpointTest.NoAuthorizer/0 (29 ms)
[ RUN      ] Endpoint/SlaveEndpointTest.NoAuthorizer/1
I0725 05:18:32.172108 32591 containerizer.cpp:230] Using isolation: posix/cpu,posix/mem,filesystem/posix,network/cni,environment_secret
W0725 05:18:32.172708 32591 backend.cpp:76] Failed to create 'aufs' backend: AufsBackend requires
root privileges
W0725 05:18:32.172830 32591 backend.cpp:76] Failed to create 'bind' backend: BindBackend requires
root privileges
I0725 05:18:32.172879 32591 provisioner.cpp:255] Using default backend 'copy'
I0725 05:18:32.174728 32591 cluster.cpp:448] Creating default 'local' authorizer
I0725 05:18:32.176576 32596 slave.cpp:250] Mesos agent started on (794)@172.17.0.2:38497
I0725 05:18:32.176599 32596 slave.cpp:251] Flags at startup: --acls="" --appc_simple_discovery_uri_prefix="http://"
--appc_store_dir="/tmp/Endpoint_SlaveEndpointTest_NoAuthorizer_1_kbmn9b/store/appc" --authenticate_http_readonly="true"
--authenticate_http_readwrite="true" --authenticatee="crammd5" --authentication_backoff_factor="1secs"
--authorizer="local" --cgroups_cpu_enable_pids_and_tids_count="false" --cgroups_enable_cfs="false"
--cgroups_hierarchy="/sys/fs/cgroup" --cgroups_limit_swap="false" --cgroups_root="mesos" --container_disk_watch_interval="15secs"
--containerizers="mesos" --credential="/tmp/Endpoint_SlaveEndpointTest_NoAuthorizer_1_kbmn9b/credential"
--default_role="*" --disk_watch_interval="1mins" --docker="docker" --docker_kill_orphans="true"
--docker_registry="https://registry-1.docker.io" --docker_remove_delay="6hrs" --docker_socket="/var/run/docker.sock"
--docker_stop_timeout="0ns" --docker_store_dir="/tmp/Endpoint_SlaveEndpointTest_NoAuthorizer_1_kbmn9b/store/docker"
--docker_volume_checkpoint_dir="/var/run/mesos/isolators/docker/volume" --enforce_container_disk_quota="false"
--executor_registration_timeout="1mins" --executor_reregistration_timeout="2secs" --executor_shutdown_grace_period="5secs"
--fetcher_cache_dir="/tmp/Endpoint_SlaveEndpointTest_NoAuthorizer_1_kbmn9b/fetch" --fetcher_cache_size="2GB"
--frameworks_home="" --gc_delay="1weeks" --gc_disk_headroom="0.1" --hadoop_home="" --help="false"
--hostname_lookup="true" --http_command_executor="false" --http_credentials="/tmp/Endpoint_SlaveEndpointTest_NoAuthorizer_1_kbmn9b/http_credentials"
--http_heartbeat_interval="30secs" --initialize_driver_logging="true" --isolation="posix/cpu,posix/mem"
--launcher="posix" --launcher_dir="/mesos/build/src" --logbufsecs="0" --logging_level="INFO"
--max_completed_executors_per_framework="150" --oversubscribed_resources_interval="15secs"
--perf_duration="10secs" --perf_interval="1mins" --port="5051" --qos_correction_interval_min="0ns"
--quiet="false" --recover="reconnect" --recovery_timeout="15mins" --registration_backoff_factor="10ms"
--resources="cpus:2;gpus:0;mem:1024;disk:1024;ports:[31000-32000]" --revocable_cpu_low_priority="true"
--runtime_dir="/tmp/Endpoint_SlaveEndpointTest_NoAuthorizer_1_kbmn9b" --sandbox_directory="/mnt/mesos/sandbox"
--strict="true" --switch_user="true" --systemd_enable_support="true" --systemd_runtime_directory="/run/systemd/system"
--version="false" --work_dir="/tmp/Endpoint_SlaveEndpointTest_NoAuthorizer_1_7mWX0c"
I0725 05:18:32.177004 32596 credentials.hpp:86] Loading credential for authentication from
'/tmp/Endpoint_SlaveEndpointTest_NoAuthorizer_1_kbmn9b/credential'
I0725 05:18:32.177160 32596 slave.cpp:283] Agent using credential for: test-principal
I0725 05:18:32.177176 32596 credentials.hpp:37] Loading credentials for authentication from
'/tmp/Endpoint_SlaveEndpointTest_NoAuthorizer_1_kbmn9b/http_credentials'
I0725 05:18:32.177435 32596 http.cpp:993] Creating default 'basic' HTTP authenticator for
realm 'mesos-agent-readonly'
I0725 05:18:32.177549 32596 http.cpp:993] Creating default 'basic' HTTP authenticator for
realm 'mesos-agent-readwrite'
I0725 05:18:32.178804 32596 slave.cpp:565] Agent resources: [{"name":"cpus","scalar":{"value":2.0},"type":"SCALAR"},{"name":"mem","scalar":{"value":1024.0},"type":"SCALAR"},{"name":"disk","scalar":{"value":1024.0},"type":"SCALAR"},{"name":"ports","ranges":{"range":[{"begin":31000,"end":32000}]},"type":"RANGES"}]
I0725 05:18:32.178987 32596 slave.cpp:573] Agent attributes: [  ]
I0725 05:18:32.178995 32596 slave.cpp:582] Agent hostname: da5ae405b8e4
I0725 05:18:32.179147 32609 status_update_manager.cpp:177] Pausing sending status updates
I0725 05:18:32.180296 32601 state.cpp:64] Recovering state from '/tmp/Endpoint_SlaveEndpointTest_NoAuthorizer_1_7mWX0c/meta'
I0725 05:18:32.180655 32601 status_update_manager.cpp:203] Recovering status update manager
I0725 05:18:32.180896 32601 containerizer.cpp:582] Recovering containerizer
I0725 05:18:32.182339 32598 provisioner.cpp:416] Provisioner recovery complete
I0725 05:18:32.182724 32610 slave.cpp:6207] Finished recovery
I0725 05:18:32.183154 32610 slave.cpp:6389] Querying resource estimator for oversubscribable
resources
I0725 05:18:32.183378 32604 slave.cpp:6403] Received oversubscribable resources {} from the
resource estimator
I0725 05:18:32.186024 32609 process.cpp:3837] Handling HTTP event for process 'slave(794)'
with path: '/slave(794)/monitor/statistics.json'
I0725 05:18:32.187081 32598 http.cpp:1133] HTTP GET for /slave(794)/monitor/statistics.json
from 172.17.0.2:48438
I0725 05:18:32.187147 32598 http.cpp:957] Authorizing principal 'test-principal' to GET the
'/monitor/statistics.json' endpoint
I0725 05:18:32.191820 32591 slave.cpp:843] Agent terminating
[       OK ] Endpoint/SlaveEndpointTest.NoAuthorizer/1 (30 ms)
[ RUN      ] Endpoint/SlaveEndpointTest.NoAuthorizer/2
I0725 05:18:32.202512 32591 containerizer.cpp:230] Using isolation: posix/cpu,posix/mem,filesystem/posix,network/cni,environment_secret
W0725 05:18:32.203017 32591 backend.cpp:76] Failed to create 'aufs' backend: AufsBackend requires
root privileges
W0725 05:18:32.203105 32591 backend.cpp:76] Failed to create 'bind' backend: BindBackend requires
root privileges
I0725 05:18:32.203131 32591 provisioner.cpp:255] Using default backend 'copy'
I0725 05:18:32.204959 32591 cluster.cpp:448] Creating default 'local' authorizer
I0725 05:18:32.206888 32608 slave.cpp:250] Mesos agent started on (795)@172.17.0.2:38497
I0725 05:18:32.206913 32608 slave.cpp:251] Flags at startup: --acls="" --appc_simple_discovery_uri_prefix="http://"
--appc_store_dir="/tmp/Endpoint_SlaveEndpointTest_NoAuthorizer_2_GEXtW8/store/appc" --authenticate_http_readonly="true"
--authenticate_http_readwrite="true" --authenticatee="crammd5" --authentication_backoff_factor="1secs"
--authorizer="local" --cgroups_cpu_enable_pids_and_tids_count="false" --cgroups_enable_cfs="false"
--cgroups_hierarchy="/sys/fs/cgroup" --cgroups_limit_swap="false" --cgroups_root="mesos" --container_disk_watch_interval="15secs"
--containerizers="mesos" --credential="/tmp/Endpoint_SlaveEndpointTest_NoAuthorizer_2_GEXtW8/credential"
--default_role="*" --disk_watch_interval="1mins" --docker="docker" --docker_kill_orphans="true"
--docker_registry="https://registry-1.docker.io" --docker_remove_delay="6hrs" --docker_socket="/var/run/docker.sock"
--docker_stop_timeout="0ns" --docker_store_dir="/tmp/Endpoint_SlaveEndpointTest_NoAuthorizer_2_GEXtW8/store/docker"
--docker_volume_checkpoint_dir="/var/run/mesos/isolators/docker/volume" --enforce_container_disk_quota="false"
--executor_registration_timeout="1mins" --executor_reregistration_timeout="2secs" --executor_shutdown_grace_period="5secs"
--fetcher_cache_dir="/tmp/Endpoint_SlaveEndpointTest_NoAuthorizer_2_GEXtW8/fetch" --fetcher_cache_size="2GB"
--frameworks_home="" --gc_delay="1weeks" --gc_disk_headroom="0.1" --hadoop_home="" --help="false"
--hostname_lookup="true" --http_command_executor="false" --http_credentials="/tmp/Endpoint_SlaveEndpointTest_NoAuthorizer_2_GEXtW8/http_credentials"
--http_heartbeat_interval="30secs" --initialize_driver_logging="true" --isolation="posix/cpu,posix/mem"
--launcher="posix" --launcher_dir="/mesos/build/src" --logbufsecs="0" --logging_level="INFO"
--max_completed_executors_per_framework="150" --oversubscribed_resources_interval="15secs"
--perf_duration="10secs" --perf_interval="1mins" --port="5051" --qos_correction_interval_min="0ns"
--quiet="false" --recover="reconnect" --recovery_timeout="15mins" --registration_backoff_factor="10ms"
--resources="cpus:2;gpus:0;mem:1024;disk:1024;ports:[31000-32000]" --revocable_cpu_low_priority="true"
--runtime_dir="/tmp/Endpoint_SlaveEndpointTest_NoAuthorizer_2_GEXtW8" --sandbox_directory="/mnt/mesos/sandbox"
--strict="true" --switch_user="true" --systemd_enable_support="true" --systemd_runtime_directory="/run/systemd/system"
--version="false" --work_dir="/tmp/Endpoint_SlaveEndpointTest_NoAuthorizer_2_HQhwJ9"
I0725 05:18:32.207336 32608 credentials.hpp:86] Loading credential for authentication from
'/tmp/Endpoint_SlaveEndpointTest_NoAuthorizer_2_GEXtW8/credential'
I0725 05:18:32.207479 32608 slave.cpp:283] Agent using credential for: test-principal
I0725 05:18:32.207499 32608 credentials.hpp:37] Loading credentials for authentication from
'/tmp/Endpoint_SlaveEndpointTest_NoAuthorizer_2_GEXtW8/http_credentials'
I0725 05:18:32.207718 32608 http.cpp:993] Creating default 'basic' HTTP authenticator for
realm 'mesos-agent-readonly'
I0725 05:18:32.207906 32608 http.cpp:993] Creating default 'basic' HTTP authenticator for
realm 'mesos-agent-readwrite'
I0725 05:18:32.209378 32608 slave.cpp:565] Agent resources: [{"name":"cpus","scalar":{"value":2.0},"type":"SCALAR"},{"name":"mem","scalar":{"value":1024.0},"type":"SCALAR"},{"name":"disk","scalar":{"value":1024.0},"type":"SCALAR"},{"name":"ports","ranges":{"range":[{"begin":31000,"end":32000}]},"type":"RANGES"}]
I0725 05:18:32.209619 32608 slave.cpp:573] Agent attributes: [  ]
I0725 05:18:32.209636 32608 slave.cpp:582] Agent hostname: da5ae405b8e4
I0725 05:18:32.209856 32596 status_update_manager.cpp:177] Pausing sending status updates
I0725 05:18:32.211215 32592 state.cpp:64] Recovering state from '/tmp/Endpoint_SlaveEndpointTest_NoAuthorizer_2_HQhwJ9/meta'
I0725 05:18:32.211511 32599 status_update_manager.cpp:203] Recovering status update manager
I0725 05:18:32.211748 32599 containerizer.cpp:582] Recovering containerizer
I0725 05:18:32.213234 32598 provisioner.cpp:416] Provisioner recovery complete
I0725 05:18:32.213642 32608 slave.cpp:6207] Finished recovery
I0725 05:18:32.214109 32608 slave.cpp:6389] Querying resource estimator for oversubscribable
resources
I0725 05:18:32.214387 32606 slave.cpp:6403] Received oversubscribable resources {} from the
resource estimator
I0725 05:18:32.216606 32600 process.cpp:3837] Handling HTTP event for process 'slave(795)'
with path: '/slave(795)/containers'
I0725 05:18:32.217836 32614 http.cpp:1133] HTTP GET for /slave(795)/containers from 172.17.0.2:48440
I0725 05:18:32.217914 32614 http.cpp:957] Authorizing principal 'test-principal' to GET the
'/containers' endpoint
I0725 05:18:32.222029 32597 slave.cpp:843] Agent terminating
[       OK ] Endpoint/SlaveEndpointTest.NoAuthorizer/2 (30 ms)
[----------] 9 tests from Endpoint/SlaveEndpointTest (288 ms total)

[----------] Global test environment tear-down
[==========] 1590 tests from 172 test cases ran. (437732 ms total)
[  PASSED  ] 1589 tests.
[  FAILED  ] 1 test, listed below:
[  FAILED  ] ContentType/MasterAPITest.CreateAndDestroyVolumes/1, where GetParam() = application/json

 1 FAILED TEST
  YOU HAVE 20 DISABLED TESTS

I0725 05:18:32.301295 32616 process.cpp:1006] Failed to accept socket: future discarded
make[3]: Leaving directory `/mesos/build'
make[3]: *** [CMakeFiles/check] Error 1
make[2]: Leaving directory `/mesos/build'
make[2]: *** [CMakeFiles/check.dir/all] Error 2
make[1]: *** [CMakeFiles/check.dir/rule] Error 2
make[1]: Leaving directory `/mesos/build'
make: *** [check] Error 2
+ docker rmi mesos-1500956913-26449
Untagged: mesos-1500956913-26449:latest
Deleted: sha256:5aa8b9fd912d2563f83302f1aa7b2c0ccf7782f1cdff213771f0dd0df78a9097
Deleted: sha256:f6dd3f1c15a9069413e96fc5655125584bf57ef564d81427ac45e26cee6b4d27
Deleted: sha256:60712d30a9d0579a4e6b40ad9f7832daa20a44e455e01833c934fbcd8ce6a10e
Deleted: sha256:34ddf4f8eeef99cc3dd0b3cc435b1a3bc7a10ac50d5725614af2d7b408ccb259
Deleted: sha256:ae65866ccd9991a503f2740bce981668328dabc2c8f29f251ab3b8a21c63f785
Deleted: sha256:3f355c7ae98b7ce50568cb283d9ab7ce04fcbd5f8488e747c491c72912c2b482
Deleted: sha256:a735f07ff46fcf561e41b2b2ef45a2b5d6a669aee3349413dd7a3c5484fe137f
Deleted: sha256:a331f04c86372f87405e8128093bfd750d46e85a07723d973833f5c4d57b2e56
Deleted: sha256:dfd13d35807423bf7e7e91eacd38ac7319b5dde77ce4b0b14064a4e13f9ead6d
Deleted: sha256:97665c556657c4778d71faaed6d17adf3c0bb809109ae1f02b678f2ff0b96026
Deleted: sha256:0716445cb9850821a2b67907ae0c8043f6c0656e5986498ad0851ee996bbe7b4
Deleted: sha256:c708c945662bc90f413f129c7f56ebb0b1aa73a72b7b45771671e9e763f2317e
Deleted: sha256:f171ebac40c957bd39a1da36370644a5f7b0f991bd65f4ff95f3eda0592332af
Deleted: sha256:62ff652a4eb923f7c56f013bb0bdb0e8f0eabfaf2ee520c84d1e4a07e6b8f35f
Deleted: sha256:557c4a332911210f428a9bda8de76b26ca03041a0726684914f7353fb61c16e2
Deleted: sha256:913eb10cb262967b1f22c724415ab988eb7663daeb94a3201177bc289fc3d25a
Deleted: sha256:99d685c41a9d63b8e08cce01cbe0ccd692075fd6a15acbaf7e95e07840dbe284
Deleted: sha256:db91f5505cab79f02d513f3a34b0aae41cb9f049c003ec303f1998aa926684be
Deleted: sha256:ea016900eb694e6a1af5b02a0895f66d054914482bbcc2534f3c03bc9b18124d
Deleted: sha256:16da25477112533d476be498b375c3c41359c58a78f3c5dbae894d1435429913
Deleted: sha256:22323703d1d5afe03c7a07f5209b1ec3dc0ed8dd16d834d7e54fe438ea8f95eb
Deleted: sha256:962d60e668036dd63fd618c6e8904a7b31951d25b88bf9f7f8dcd72de355f43f
Deleted: sha256:78f4545cfa06979b5893a66bde1ac43d44f698f59e53b92e692bf542fe613402
Deleted: sha256:a3b50b92fbb897ec2fc0d9c11f279bd3b1b5cb1f466c3f2e3c7614dcb66e9091
Build step 'Execute shell' marked build as failure

Mime
View raw message