mesos-builds mailing list archives

Site index · List index
Message view « Date » · « Thread »
Top « Date » · « Thread »
From Apache Jenkins Server <jenk...@builds.apache.org>
Subject Build failed in Jenkins: Mesos-Reviewbot #18585
Date Mon, 24 Jul 2017 10:08:31 GMT
See <https://builds.apache.org/job/Mesos-Reviewbot/18585/display/redirect>

------------------------------------------
[...truncated 30.15 MB...]
I0724 10:08:24.680439  5026 containerizer.cpp:230] Using isolation: posix/cpu,posix/mem,filesystem/posix,network/cni,environment_secret
W0724 10:08:24.681288  5026 backend.cpp:76] Failed to create 'overlay' backend: OverlayBackend
requires root privileges
W0724 10:08:24.681483  5026 backend.cpp:76] Failed to create 'bind' backend: BindBackend requires
root privileges
I0724 10:08:24.681531  5026 provisioner.cpp:255] Using default backend 'copy'
I0724 10:08:24.686576  5052 slave.cpp:250] Mesos agent started on (792)@172.17.0.2:34297
I0724 10:08:24.686738  5052 slave.cpp:251] Flags at startup: --acls="" --appc_simple_discovery_uri_prefix="http://"
--appc_store_dir="/tmp/Endpoint_SlaveEndpointTest_AuthorizedRequest_2_Lk3Lkk/store/appc" --authenticate_http_readonly="true"
--authenticate_http_readwrite="true" --authenticatee="crammd5" --authentication_backoff_factor="1secs"
--authorizer="local" --cgroups_cpu_enable_pids_and_tids_count="false" --cgroups_enable_cfs="false"
--cgroups_hierarchy="/sys/fs/cgroup" --cgroups_limit_swap="false" --cgroups_root="mesos" --container_disk_watch_interval="15secs"
--containerizers="mesos" --credential="/tmp/Endpoint_SlaveEndpointTest_AuthorizedRequest_2_Lk3Lkk/credential"
--default_role="*" --disk_watch_interval="1mins" --docker="docker" --docker_kill_orphans="true"
--docker_registry="https://registry-1.docker.io" --docker_remove_delay="6hrs" --docker_socket="/var/run/docker.sock"
--docker_stop_timeout="0ns" --docker_store_dir="/tmp/Endpoint_SlaveEndpointTest_AuthorizedRequest_2_Lk3Lkk/store/docker"
--docker_volume_checkpoint_dir="/var/run/mesos/isolators/docker/volume" --enforce_container_disk_quota="false"
--executor_registration_timeout="1mins" --executor_reregistration_timeout="2secs" --executor_shutdown_grace_period="5secs"
--fetcher_cache_dir="/tmp/Endpoint_SlaveEndpointTest_AuthorizedRequest_2_Lk3Lkk/fetch" --fetcher_cache_size="2GB"
--frameworks_home="" --gc_delay="1weeks" --gc_disk_headroom="0.1" --hadoop_home="" --help="false"
--hostname_lookup="true" --http_command_executor="false" --http_credentials="/tmp/Endpoint_SlaveEndpointTest_AuthorizedRequest_2_Lk3Lkk/http_credentials"
--http_heartbeat_interval="30secs" --initialize_driver_logging="true" --isolation="posix/cpu,posix/mem"
--launcher="posix" --launcher_dir="/mesos/mesos-1.4.0/_build/src" --logbufsecs="0" --logging_level="INFO"
--max_completed_executors_per_framework="150" --oversubscribed_resources_interval="15secs"
--perf_duration="10secs" --perf_interval="1mins" --port="5051" --qos_correction_interval_min="0ns"
--quiet="false" --recover="reconnect" --recovery_timeout="15mins" --registration_backoff_factor="10ms"
--resources="cpus:2;gpus:0;mem:1024;disk:1024;ports:[31000-32000]" --revocable_cpu_low_priority="true"
--runtime_dir="/tmp/Endpoint_SlaveEndpointTest_AuthorizedRequest_2_Lk3Lkk" --sandbox_directory="/mnt/mesos/sandbox"
--strict="true" --switch_user="true" --systemd_enable_support="true" --systemd_runtime_directory="/run/systemd/system"
--version="false" --work_dir="/tmp/Endpoint_SlaveEndpointTest_AuthorizedRequest_2_5FOAYp"
I0724 10:08:24.687649  5052 credentials.hpp:86] Loading credential for authentication from
'/tmp/Endpoint_SlaveEndpointTest_AuthorizedRequest_2_Lk3Lkk/credential'
I0724 10:08:24.687999  5052 slave.cpp:283] Agent using credential for: test-principal
I0724 10:08:24.688026  5052 credentials.hpp:37] Loading credentials for authentication from
'/tmp/Endpoint_SlaveEndpointTest_AuthorizedRequest_2_Lk3Lkk/http_credentials'
I0724 10:08:24.688515  5052 http.cpp:993] Creating default 'basic' HTTP authenticator for
realm 'mesos-agent-readonly'
I0724 10:08:24.688863  5052 http.cpp:993] Creating default 'basic' HTTP authenticator for
realm 'mesos-agent-readwrite'
I0724 10:08:24.691141  5052 slave.cpp:565] Agent resources: [{"name":"cpus","scalar":{"value":2.0},"type":"SCALAR"},{"name":"mem","scalar":{"value":1024.0},"type":"SCALAR"},{"name":"disk","scalar":{"value":1024.0},"type":"SCALAR"},{"name":"ports","ranges":{"range":[{"begin":31000,"end":32000}]},"type":"RANGES"}]
I0724 10:08:24.691690  5052 slave.cpp:573] Agent attributes: [  ]
I0724 10:08:24.691715  5052 slave.cpp:582] Agent hostname: 86cd6e221d2a
I0724 10:08:24.692149  5051 status_update_manager.cpp:177] Pausing sending status updates
I0724 10:08:24.694098  5050 state.cpp:64] Recovering state from '/tmp/Endpoint_SlaveEndpointTest_AuthorizedRequest_2_5FOAYp/meta'
I0724 10:08:24.694633  5051 status_update_manager.cpp:203] Recovering status update manager
I0724 10:08:24.694905  5047 containerizer.cpp:582] Recovering containerizer
I0724 10:08:24.697078  5047 provisioner.cpp:416] Provisioner recovery complete
I0724 10:08:24.697804  5051 slave.cpp:6207] Finished recovery
I0724 10:08:24.698443  5051 slave.cpp:6389] Querying resource estimator for oversubscribable
resources
I0724 10:08:24.698858  5048 slave.cpp:6403] Received oversubscribable resources {} from the
resource estimator
I0724 10:08:24.703603  5046 process.cpp:3837] Handling HTTP event for process 'slave(792)'
with path: '/slave(792)/containers'
I0724 10:08:24.705705  5045 http.cpp:1133] HTTP GET for /slave(792)/containers from 172.17.0.2:47014
I0724 10:08:24.705844  5045 http.cpp:957] Authorizing principal 'test-principal' to GET the
'/containers' endpoint
I0724 10:08:24.712602  5026 slave.cpp:843] Agent terminating
[       OK ] Endpoint/SlaveEndpointTest.AuthorizedRequest/2 (47 ms)
[ RUN      ] Endpoint/SlaveEndpointTest.UnauthorizedRequest/0
I0724 10:08:24.728096  5026 containerizer.cpp:230] Using isolation: posix/cpu,posix/mem,filesystem/posix,network/cni,environment_secret
W0724 10:08:24.728886  5026 backend.cpp:76] Failed to create 'overlay' backend: OverlayBackend
requires root privileges
W0724 10:08:24.729065  5026 backend.cpp:76] Failed to create 'bind' backend: BindBackend requires
root privileges
I0724 10:08:24.729112  5026 provisioner.cpp:255] Using default backend 'copy'
I0724 10:08:24.734341  5047 slave.cpp:250] Mesos agent started on (793)@172.17.0.2:34297
I0724 10:08:24.734418  5047 slave.cpp:251] Flags at startup: --acls="" --appc_simple_discovery_uri_prefix="http://"
--appc_store_dir="/tmp/Endpoint_SlaveEndpointTest_UnauthorizedRequest_0_50zx5W/store/appc"
--authenticate_http_readonly="true" --authenticate_http_readwrite="true" --authenticatee="crammd5"
--authentication_backoff_factor="1secs" --authorizer="local" --cgroups_cpu_enable_pids_and_tids_count="false"
--cgroups_enable_cfs="false" --cgroups_hierarchy="/sys/fs/cgroup" --cgroups_limit_swap="false"
--cgroups_root="mesos" --container_disk_watch_interval="15secs" --containerizers="mesos" --credential="/tmp/Endpoint_SlaveEndpointTest_UnauthorizedRequest_0_50zx5W/credential"
--default_role="*" --disk_watch_interval="1mins" --docker="docker" --docker_kill_orphans="true"
--docker_registry="https://registry-1.docker.io" --docker_remove_delay="6hrs" --docker_socket="/var/run/docker.sock"
--docker_stop_timeout="0ns" --docker_store_dir="/tmp/Endpoint_SlaveEndpointTest_UnauthorizedRequest_0_50zx5W/store/docker"
--docker_volume_checkpoint_dir="/var/run/mesos/isolators/docker/volume" --enforce_container_disk_quota="false"
--executor_registration_timeout="1mins" --executor_reregistration_timeout="2secs" --executor_shutdown_grace_period="5secs"
--fetcher_cache_dir="/tmp/Endpoint_SlaveEndpointTest_UnauthorizedRequest_0_50zx5W/fetch" --fetcher_cache_size="2GB"
--frameworks_home="" --gc_delay="1weeks" --gc_disk_headroom="0.1" --hadoop_home="" --help="false"
--hostname_lookup="true" --http_command_executor="false" --http_credentials="/tmp/Endpoint_SlaveEndpointTest_UnauthorizedRequest_0_50zx5W/http_credentials"
--http_heartbeat_interval="30secs" --initialize_driver_logging="true" --isolation="posix/cpu,posix/mem"
--launcher="posix" --launcher_dir="/mesos/mesos-1.4.0/_build/src" --logbufsecs="0" --logging_level="INFO"
--max_completed_executors_per_framework="150" --oversubscribed_resources_interval="15secs"
--perf_duration="10secs" --perf_interval="1mins" --port="5051" --qos_correction_interval_min="0ns"
--quiet="false" --recover="reconnect" --recovery_timeout="15mins" --registration_backoff_factor="10ms"
--resources="cpus:2;gpus:0;mem:1024;disk:1024;ports:[31000-32000]" --revocable_cpu_low_priority="true"
--runtime_dir="/tmp/Endpoint_SlaveEndpointTest_UnauthorizedRequest_0_50zx5W" --sandbox_directory="/mnt/mesos/sandbox"
--strict="true" --switch_user="true" --systemd_enable_support="true" --systemd_runtime_directory="/run/systemd/system"
--version="false" --work_dir="/tmp/Endpoint_SlaveEndpointTest_UnauthorizedRequest_0_3AeEB2"
I0724 10:08:24.735304  5047 credentials.hpp:86] Loading credential for authentication from
'/tmp/Endpoint_SlaveEndpointTest_UnauthorizedRequest_0_50zx5W/credential'
I0724 10:08:24.735707  5047 slave.cpp:283] Agent using credential for: test-principal
I0724 10:08:24.735762  5047 credentials.hpp:37] Loading credentials for authentication from
'/tmp/Endpoint_SlaveEndpointTest_UnauthorizedRequest_0_50zx5W/http_credentials'
I0724 10:08:24.736289  5047 http.cpp:993] Creating default 'basic' HTTP authenticator for
realm 'mesos-agent-readonly'
I0724 10:08:24.736634  5047 http.cpp:993] Creating default 'basic' HTTP authenticator for
realm 'mesos-agent-readwrite'
I0724 10:08:24.738957  5047 slave.cpp:565] Agent resources: [{"name":"cpus","scalar":{"value":2.0},"type":"SCALAR"},{"name":"mem","scalar":{"value":1024.0},"type":"SCALAR"},{"name":"disk","scalar":{"value":1024.0},"type":"SCALAR"},{"name":"ports","ranges":{"range":[{"begin":31000,"end":32000}]},"type":"RANGES"}]
I0724 10:08:24.739681  5047 slave.cpp:573] Agent attributes: [  ]
I0724 10:08:24.739761  5047 slave.cpp:582] Agent hostname: 86cd6e221d2a
I0724 10:08:24.740100  5049 status_update_manager.cpp:177] Pausing sending status updates
I0724 10:08:24.742276  5045 state.cpp:64] Recovering state from '/tmp/Endpoint_SlaveEndpointTest_UnauthorizedRequest_0_3AeEB2/meta'
I0724 10:08:24.742770  5052 status_update_manager.cpp:203] Recovering status update manager
I0724 10:08:24.743005  5052 containerizer.cpp:582] Recovering containerizer
I0724 10:08:24.745043  5051 provisioner.cpp:416] Provisioner recovery complete
I0724 10:08:24.745564  5050 slave.cpp:6207] Finished recovery
I0724 10:08:24.746459  5050 slave.cpp:6389] Querying resource estimator for oversubscribable
resources
I0724 10:08:24.746861  5049 slave.cpp:6403] Received oversubscribable resources {} from the
resource estimator
I0724 10:08:24.750901  5050 process.cpp:3837] Handling HTTP event for process 'slave(793)'
with path: '/slave(793)/monitor/statistics'
I0724 10:08:24.753089  5052 http.cpp:1133] HTTP GET for /slave(793)/monitor/statistics from
172.17.0.2:47016
I0724 10:08:24.753214  5052 http.cpp:957] Authorizing principal 'test-principal' to GET the
'/monitor/statistics' endpoint
I0724 10:08:24.756860  5046 slave.cpp:843] Agent terminating
[       OK ] Endpoint/SlaveEndpointTest.UnauthorizedRequest/0 (43 ms)
[ RUN      ] Endpoint/SlaveEndpointTest.UnauthorizedRequest/1
I0724 10:08:24.772202  5026 containerizer.cpp:230] Using isolation: posix/cpu,posix/mem,filesystem/posix,network/cni,environment_secret
W0724 10:08:24.772974  5026 backend.cpp:76] Failed to create 'overlay' backend: OverlayBackend
requires root privileges
W0724 10:08:24.773141  5026 backend.cpp:76] Failed to create 'bind' backend: BindBackend requires
root privileges
I0724 10:08:24.773183  5026 provisioner.cpp:255] Using default backend 'copy'
I0724 10:08:24.778283  5045 slave.cpp:250] Mesos agent started on (794)@172.17.0.2:34297
I0724 10:08:24.778323  5045 slave.cpp:251] Flags at startup: --acls="" --appc_simple_discovery_uri_prefix="http://"
--appc_store_dir="/tmp/Endpoint_SlaveEndpointTest_UnauthorizedRequest_1_HKzHpB/store/appc"
--authenticate_http_readonly="true" --authenticate_http_readwrite="true" --authenticatee="crammd5"
--authentication_backoff_factor="1secs" --authorizer="local" --cgroups_cpu_enable_pids_and_tids_count="false"
--cgroups_enable_cfs="false" --cgroups_hierarchy="/sys/fs/cgroup" --cgroups_limit_swap="false"
--cgroups_root="mesos" --container_disk_watch_interval="15secs" --containerizers="mesos" --credential="/tmp/Endpoint_SlaveEndpointTest_UnauthorizedRequest_1_HKzHpB/credential"
--default_role="*" --disk_watch_interval="1mins" --docker="docker" --docker_kill_orphans="true"
--docker_registry="https://registry-1.docker.io" --docker_remove_delay="6hrs" --docker_socket="/var/run/docker.sock"
--docker_stop_timeout="0ns" --docker_store_dir="/tmp/Endpoint_SlaveEndpointTest_UnauthorizedRequest_1_HKzHpB/store/docker"
--docker_volume_checkpoint_dir="/var/run/mesos/isolators/docker/volume" --enforce_container_disk_quota="false"
--executor_registration_timeout="1mins" --executor_reregistration_timeout="2secs" --executor_shutdown_grace_period="5secs"
--fetcher_cache_dir="/tmp/Endpoint_SlaveEndpointTest_UnauthorizedRequest_1_HKzHpB/fetch" --fetcher_cache_size="2GB"
--frameworks_home="" --gc_delay="1weeks" --gc_disk_headroom="0.1" --hadoop_home="" --help="false"
--hostname_lookup="true" --http_command_executor="false" --http_credentials="/tmp/Endpoint_SlaveEndpointTest_UnauthorizedRequest_1_HKzHpB/http_credentials"
--http_heartbeat_interval="30secs" --initialize_driver_logging="true" --isolation="posix/cpu,posix/mem"
--launcher="posix" --launcher_dir="/mesos/mesos-1.4.0/_build/src" --logbufsecs="0" --logging_level="INFO"
--max_completed_executors_per_framework="150" --oversubscribed_resources_interval="15secs"
--perf_duration="10secs" --perf_interval="1mins" --port="5051" --qos_correction_interval_min="0ns"
--quiet="false" --recover="reconnect" --recovery_timeout="15mins" --registration_backoff_factor="10ms"
--resources="cpus:2;gpus:0;mem:1024;disk:1024;ports:[31000-32000]" --revocable_cpu_low_priority="true"
--runtime_dir="/tmp/Endpoint_SlaveEndpointTest_UnauthorizedRequest_1_HKzHpB" --sandbox_directory="/mnt/mesos/sandbox"
--strict="true" --switch_user="true" --systemd_enable_support="true" --systemd_runtime_directory="/run/systemd/system"
--version="false" --work_dir="/tmp/Endpoint_SlaveEndpointTest_UnauthorizedRequest_1_hcMEOG"
I0724 10:08:24.779060  5045 credentials.hpp:86] Loading credential for authentication from
'/tmp/Endpoint_SlaveEndpointTest_UnauthorizedRequest_1_HKzHpB/credential'
I0724 10:08:24.779325  5045 slave.cpp:283] Agent using credential for: test-principal
I0724 10:08:24.779352  5045 credentials.hpp:37] Loading credentials for authentication from
'/tmp/Endpoint_SlaveEndpointTest_UnauthorizedRequest_1_HKzHpB/http_credentials'
I0724 10:08:24.779744  5045 http.cpp:993] Creating default 'basic' HTTP authenticator for
realm 'mesos-agent-readonly'
I0724 10:08:24.779990  5045 http.cpp:993] Creating default 'basic' HTTP authenticator for
realm 'mesos-agent-readwrite'
I0724 10:08:24.782138  5045 slave.cpp:565] Agent resources: [{"name":"cpus","scalar":{"value":2.0},"type":"SCALAR"},{"name":"mem","scalar":{"value":1024.0},"type":"SCALAR"},{"name":"disk","scalar":{"value":1024.0},"type":"SCALAR"},{"name":"ports","ranges":{"range":[{"begin":31000,"end":32000}]},"type":"RANGES"}]
I0724 10:08:24.782567  5045 slave.cpp:573] Agent attributes: [  ]
I0724 10:08:24.782588  5045 slave.cpp:582] Agent hostname: 86cd6e221d2a
I0724 10:08:24.782845  5049 status_update_manager.cpp:177] Pausing sending status updates
I0724 10:08:24.784852  5047 state.cpp:64] Recovering state from '/tmp/Endpoint_SlaveEndpointTest_UnauthorizedRequest_1_hcMEOG/meta'
I0724 10:08:24.785362  5049 status_update_manager.cpp:203] Recovering status update manager
I0724 10:08:24.785761  5050 containerizer.cpp:582] Recovering containerizer
I0724 10:08:24.787901  5048 provisioner.cpp:416] Provisioner recovery complete
I0724 10:08:24.788547  5047 slave.cpp:6207] Finished recovery
I0724 10:08:24.789235  5047 slave.cpp:6389] Querying resource estimator for oversubscribable
resources
I0724 10:08:24.789600  5051 slave.cpp:6403] Received oversubscribable resources {} from the
resource estimator
I0724 10:08:24.793548  5051 process.cpp:3837] Handling HTTP event for process 'slave(794)'
with path: '/slave(794)/monitor/statistics.json'
I0724 10:08:24.795534  5047 http.cpp:1133] HTTP GET for /slave(794)/monitor/statistics.json
from 172.17.0.2:47018
I0724 10:08:24.795706  5047 http.cpp:957] Authorizing principal 'test-principal' to GET the
'/monitor/statistics.json' endpoint
I0724 10:08:24.798808  5048 slave.cpp:843] Agent terminating
[       OK ] Endpoint/SlaveEndpointTest.UnauthorizedRequest/1 (42 ms)
[ RUN      ] Endpoint/SlaveEndpointTest.UnauthorizedRequest/2
I0724 10:08:24.814337  5026 containerizer.cpp:230] Using isolation: posix/cpu,posix/mem,filesystem/posix,network/cni,environment_secret
W0724 10:08:24.815110  5026 backend.cpp:76] Failed to create 'overlay' backend: OverlayBackend
requires root privileges
W0724 10:08:24.815274  5026 backend.cpp:76] Failed to create 'bind' backend: BindBackend requires
root privileges
I0724 10:08:24.815316  5026 provisioner.cpp:255] Using default backend 'copy'
I0724 10:08:24.820283  5047 slave.cpp:250] Mesos agent started on (795)@172.17.0.2:34297
I0724 10:08:24.820356  5047 slave.cpp:251] Flags at startup: --acls="" --appc_simple_discovery_uri_prefix="http://"
--appc_store_dir="/tmp/Endpoint_SlaveEndpointTest_UnauthorizedRequest_2_vwffbg/store/appc"
--authenticate_http_readonly="true" --authenticate_http_readwrite="true" --authenticatee="crammd5"
--authentication_backoff_factor="1secs" --authorizer="local" --cgroups_cpu_enable_pids_and_tids_count="false"
--cgroups_enable_cfs="false" --cgroups_hierarchy="/sys/fs/cgroup" --cgroups_limit_swap="false"
--cgroups_root="mesos" --container_disk_watch_interval="15secs" --containerizers="mesos" --credential="/tmp/Endpoint_SlaveEndpointTest_UnauthorizedRequest_2_vwffbg/credential"
--default_role="*" --disk_watch_interval="1mins" --docker="docker" --docker_kill_orphans="true"
--docker_registry="https://registry-1.docker.io" --docker_remove_delay="6hrs" --docker_socket="/var/run/docker.sock"
--docker_stop_timeout="0ns" --docker_store_dir="/tmp/Endpoint_SlaveEndpointTest_UnauthorizedRequest_2_vwffbg/store/docker"
--docker_volume_checkpoint_dir="/var/run/mesos/isolators/docker/volume" --enforce_container_disk_quota="false"
--executor_registration_timeout="1mins" --executor_reregistration_timeout="2secs" --executor_shutdown_grace_period="5secs"
--fetcher_cache_dir="/tmp/Endpoint_SlaveEndpointTest_UnauthorizedRequest_2_vwffbg/fetch" --fetcher_cache_size="2GB"
--frameworks_home="" --gc_delay="1weeks" --gc_disk_headroom="0.1" --hadoop_home="" --help="false"
--hostname_lookup="true" --http_command_executor="false" --http_credentials="/tmp/Endpoint_SlaveEndpointTest_UnauthorizedRequest_2_vwffbg/http_credentials"
--http_heartbeat_interval="30secs" --initialize_driver_logging="true" --isolation="posix/cpu,posix/mem"
--launcher="posix" --launcher_dir="/mesos/mesos-1.4.0/_build/src" --logbufsecs="0" --logging_level="INFO"
--max_completed_executors_per_framework="150" --oversubscribed_resources_interval="15secs"
--perf_duration="10secs" --perf_interval="1mins" --port="5051" --qos_correction_interval_min="0ns"
--quiet="false" --recover="reconnect" --recovery_timeout="15mins" --registration_backoff_factor="10ms"
--resources="cpus:2;gpus:0;mem:1024;disk:1024;ports:[31000-32000]" --revocable_cpu_low_priority="true"
--runtime_dir="/tmp/Endpoint_SlaveEndpointTest_UnauthorizedRequest_2_vwffbg" --sandbox_directory="/mnt/mesos/sandbox"
--strict="true" --switch_user="true" --systemd_enable_support="true" --systemd_runtime_directory="/run/systemd/system"
--version="false" --work_dir="/tmp/Endpoint_SlaveEndpointTest_UnauthorizedRequest_2_BOYntl"
I0724 10:08:24.821111  5047 credentials.hpp:86] Loading credential for authentication from
'/tmp/Endpoint_SlaveEndpointTest_UnauthorizedRequest_2_vwffbg/credential'
I0724 10:08:24.821385  5047 slave.cpp:283] Agent using credential for: test-principal
I0724 10:08:24.821434  5047 credentials.hpp:37] Loading credentials for authentication from
'/tmp/Endpoint_SlaveEndpointTest_UnauthorizedRequest_2_vwffbg/http_credentials'
I0724 10:08:24.821841  5047 http.cpp:993] Creating default 'basic' HTTP authenticator for
realm 'mesos-agent-readonly'
I0724 10:08:24.822105  5047 http.cpp:993] Creating default 'basic' HTTP authenticator for
realm 'mesos-agent-readwrite'
I0724 10:08:24.824393  5047 slave.cpp:565] Agent resources: [{"name":"cpus","scalar":{"value":2.0},"type":"SCALAR"},{"name":"mem","scalar":{"value":1024.0},"type":"SCALAR"},{"name":"disk","scalar":{"value":1024.0},"type":"SCALAR"},{"name":"ports","ranges":{"range":[{"begin":31000,"end":32000}]},"type":"RANGES"}]
I0724 10:08:24.824869  5047 slave.cpp:573] Agent attributes: [  ]
I0724 10:08:24.824918  5047 slave.cpp:582] Agent hostname: 86cd6e221d2a
I0724 10:08:24.825196  5045 status_update_manager.cpp:177] Pausing sending status updates
I0724 10:08:24.827409  5048 state.cpp:64] Recovering state from '/tmp/Endpoint_SlaveEndpointTest_UnauthorizedRequest_2_BOYntl/meta'
I0724 10:08:24.827934  5050 status_update_manager.cpp:203] Recovering status update manager
I0724 10:08:24.828277  5052 containerizer.cpp:582] Recovering containerizer
I0724 10:08:24.830159  5050 provisioner.cpp:416] Provisioner recovery complete
I0724 10:08:24.830746  5052 slave.cpp:6207] Finished recovery
I0724 10:08:24.831375  5052 slave.cpp:6389] Querying resource estimator for oversubscribable
resources
I0724 10:08:24.831804  5048 slave.cpp:6403] Received oversubscribable resources {} from the
resource estimator
I0724 10:08:24.835856  5046 process.cpp:3837] Handling HTTP event for process 'slave(795)'
with path: '/slave(795)/containers'
I0724 10:08:24.837911  5047 http.cpp:1133] HTTP GET for /slave(795)/containers from 172.17.0.2:47020
I0724 10:08:24.838080  5047 http.cpp:957] Authorizing principal 'test-principal' to GET the
'/containers' endpoint
I0724 10:08:24.841356  5051 slave.cpp:843] Agent terminating
[       OK ] Endpoint/SlaveEndpointTest.UnauthorizedRequest/2 (42 ms)
[ RUN      ] Endpoint/SlaveEndpointTest.NoAuthorizer/0
I0724 10:08:24.857064  5026 containerizer.cpp:230] Using isolation: posix/cpu,posix/mem,filesystem/posix,network/cni,environment_secret
W0724 10:08:24.857859  5026 backend.cpp:76] Failed to create 'overlay' backend: OverlayBackend
requires root privileges
W0724 10:08:24.858024  5026 backend.cpp:76] Failed to create 'bind' backend: BindBackend requires
root privileges
I0724 10:08:24.858067  5026 provisioner.cpp:255] Using default backend 'copy'
I0724 10:08:24.860419  5026 cluster.cpp:448] Creating default 'local' authorizer
I0724 10:08:24.863099  5049 slave.cpp:250] Mesos agent started on (796)@172.17.0.2:34297
I0724 10:08:24.863144  5049 slave.cpp:251] Flags at startup: --acls="" --appc_simple_discovery_uri_prefix="http://"
--appc_store_dir="/tmp/Endpoint_SlaveEndpointTest_NoAuthorizer_0_J1JcoV/store/appc" --authenticate_http_readonly="true"
--authenticate_http_readwrite="true" --authenticatee="crammd5" --authentication_backoff_factor="1secs"
--authorizer="local" --cgroups_cpu_enable_pids_and_tids_count="false" --cgroups_enable_cfs="false"
--cgroups_hierarchy="/sys/fs/cgroup" --cgroups_limit_swap="false" --cgroups_root="mesos" --container_disk_watch_interval="15secs"
--containerizers="mesos" --credential="/tmp/Endpoint_SlaveEndpointTest_NoAuthorizer_0_J1JcoV/credential"
--default_role="*" --disk_watch_interval="1mins" --docker="docker" --docker_kill_orphans="true"
--docker_registry="https://registry-1.docker.io" --docker_remove_delay="6hrs" --docker_socket="/var/run/docker.sock"
--docker_stop_timeout="0ns" --docker_store_dir="/tmp/Endpoint_SlaveEndpointTest_NoAuthorizer_0_J1JcoV/store/docker"
--docker_volume_checkpoint_dir="/var/run/mesos/isolators/docker/volume" --enforce_container_disk_quota="false"
--executor_registration_timeout="1mins" --executor_reregistration_timeout="2secs" --executor_shutdown_grace_period="5secs"
--fetcher_cache_dir="/tmp/Endpoint_SlaveEndpointTest_NoAuthorizer_0_J1JcoV/fetch" --fetcher_cache_size="2GB"
--frameworks_home="" --gc_delay="1weeks" --gc_disk_headroom="0.1" --hadoop_home="" --help="false"
--hostname_lookup="true" --http_command_executor="false" --http_credentials="/tmp/Endpoint_SlaveEndpointTest_NoAuthorizer_0_J1JcoV/http_credentials"
--http_heartbeat_interval="30secs" --initialize_driver_logging="true" --isolation="posix/cpu,posix/mem"
--launcher="posix" --launcher_dir="/mesos/mesos-1.4.0/_build/src" --logbufsecs="0" --logging_level="INFO"
--max_completed_executors_per_framework="150" --oversubscribed_resources_interval="15secs"
--perf_duration="10secs" --perf_interval="1mins" --port="5051" --qos_correction_interval_min="0ns"
--quiet="false" --recover="reconnect" --recovery_timeout="15mins" --registration_backoff_factor="10ms"
--resources="cpus:2;gpus:0;mem:1024;disk:1024;ports:[31000-32000]" --revocable_cpu_low_priority="true"
--runtime_dir="/tmp/Endpoint_SlaveEndpointTest_NoAuthorizer_0_J1JcoV" --sandbox_directory="/mnt/mesos/sandbox"
--strict="true" --switch_user="true" --systemd_enable_support="true" --systemd_runtime_directory="/run/systemd/system"
--version="false" --work_dir="/tmp/Endpoint_SlaveEndpointTest_NoAuthorizer_0_xImuz0"
I0724 10:08:24.863873  5049 credentials.hpp:86] Loading credential for authentication from
'/tmp/Endpoint_SlaveEndpointTest_NoAuthorizer_0_J1JcoV/credential'
I0724 10:08:24.864177  5049 slave.cpp:283] Agent using credential for: test-principal
I0724 10:08:24.864205  5049 credentials.hpp:37] Loading credentials for authentication from
'/tmp/Endpoint_SlaveEndpointTest_NoAuthorizer_0_J1JcoV/http_credentials'
I0724 10:08:24.864612  5049 http.cpp:993] Creating default 'basic' HTTP authenticator for
realm 'mesos-agent-readonly'
I0724 10:08:24.864887  5049 http.cpp:993] Creating default 'basic' HTTP authenticator for
realm 'mesos-agent-readwrite'
I0724 10:08:24.867102  5049 slave.cpp:565] Agent resources: [{"name":"cpus","scalar":{"value":2.0},"type":"SCALAR"},{"name":"mem","scalar":{"value":1024.0},"type":"SCALAR"},{"name":"disk","scalar":{"value":1024.0},"type":"SCALAR"},{"name":"ports","ranges":{"range":[{"begin":31000,"end":32000}]},"type":"RANGES"}]
I0724 10:08:24.867532  5049 slave.cpp:573] Agent attributes: [  ]
I0724 10:08:24.867552  5049 slave.cpp:582] Agent hostname: 86cd6e221d2a
I0724 10:08:24.867790  5045 status_update_manager.cpp:177] Pausing sending status updates
I0724 10:08:24.869848  5046 state.cpp:64] Recovering state from '/tmp/Endpoint_SlaveEndpointTest_NoAuthorizer_0_xImuz0/meta'
I0724 10:08:24.870409  5050 status_update_manager.cpp:203] Recovering status update manager
I0724 10:08:24.870923  5047 containerizer.cpp:582] Recovering containerizer
I0724 10:08:24.873226  5051 provisioner.cpp:416] Provisioner recovery complete
I0724 10:08:24.873672  5046 slave.cpp:6207] Finished recovery
I0724 10:08:24.874356  5046 slave.cpp:6389] Querying resource estimator for oversubscribable
resources
I0724 10:08:24.874722  5048 slave.cpp:6403] Received oversubscribable resources {} from the
resource estimator
I0724 10:08:24.878723  5048 process.cpp:3837] Handling HTTP event for process 'slave(796)'
with path: '/slave(796)/monitor/statistics'
I0724 10:08:24.880970  5050 http.cpp:1133] HTTP GET for /slave(796)/monitor/statistics from
172.17.0.2:47022
I0724 10:08:24.881098  5050 http.cpp:957] Authorizing principal 'test-principal' to GET the
'/monitor/statistics' endpoint
I0724 10:08:24.887111  5050 slave.cpp:843] Agent terminating
[       OK ] Endpoint/SlaveEndpointTest.NoAuthorizer/0 (45 ms)
[ RUN      ] Endpoint/SlaveEndpointTest.NoAuthorizer/1
I0724 10:08:24.902817  5026 containerizer.cpp:230] Using isolation: posix/cpu,posix/mem,filesystem/posix,network/cni,environment_secret
W0724 10:08:24.903602  5026 backend.cpp:76] Failed to create 'overlay' backend: OverlayBackend
requires root privileges
W0724 10:08:24.903774  5026 backend.cpp:76] Failed to create 'bind' backend: BindBackend requires
root privileges
I0724 10:08:24.903817  5026 provisioner.cpp:255] Using default backend 'copy'
I0724 10:08:24.906321  5026 cluster.cpp:448] Creating default 'local' authorizer
I0724 10:08:24.908994  5049 slave.cpp:250] Mesos agent started on (797)@172.17.0.2:34297
I0724 10:08:24.909034  5049 slave.cpp:251] Flags at startup: --acls="" --appc_simple_discovery_uri_prefix="http://"
--appc_store_dir="/tmp/Endpoint_SlaveEndpointTest_NoAuthorizer_1_1mEm4A/store/appc" --authenticate_http_readonly="true"
--authenticate_http_readwrite="true" --authenticatee="crammd5" --authentication_backoff_factor="1secs"
--authorizer="local" --cgroups_cpu_enable_pids_and_tids_count="false" --cgroups_enable_cfs="false"
--cgroups_hierarchy="/sys/fs/cgroup" --cgroups_limit_swap="false" --cgroups_root="mesos" --container_disk_watch_interval="15secs"
--containerizers="mesos" --credential="/tmp/Endpoint_SlaveEndpointTest_NoAuthorizer_1_1mEm4A/credential"
--default_role="*" --disk_watch_interval="1mins" --docker="docker" --docker_kill_orphans="true"
--docker_registry="https://registry-1.docker.io" --docker_remove_delay="6hrs" --docker_socket="/var/run/docker.sock"
--docker_stop_timeout="0ns" --docker_store_dir="/tmp/Endpoint_SlaveEndpointTest_NoAuthorizer_1_1mEm4A/store/docker"
--docker_volume_checkpoint_dir="/var/run/mesos/isolators/docker/volume" --enforce_container_disk_quota="false"
--executor_registration_timeout="1mins" --executor_reregistration_timeout="2secs" --executor_shutdown_grace_period="5secs"
--fetcher_cache_dir="/tmp/Endpoint_SlaveEndpointTest_NoAuthorizer_1_1mEm4A/fetch" --fetcher_cache_size="2GB"
--frameworks_home="" --gc_delay="1weeks" --gc_disk_headroom="0.1" --hadoop_home="" --help="false"
--hostname_lookup="true" --http_command_executor="false" --http_credentials="/tmp/Endpoint_SlaveEndpointTest_NoAuthorizer_1_1mEm4A/http_credentials"
--http_heartbeat_interval="30secs" --initialize_driver_logging="true" --isolation="posix/cpu,posix/mem"
--launcher="posix" --launcher_dir="/mesos/mesos-1.4.0/_build/src" --logbufsecs="0" --logging_level="INFO"
--max_completed_executors_per_framework="150" --oversubscribed_resources_interval="15secs"
--perf_duration="10secs" --perf_interval="1mins" --port="5051" --qos_correction_interval_min="0ns"
--quiet="false" --recover="reconnect" --recovery_timeout="15mins" --registration_backoff_factor="10ms"
--resources="cpus:2;gpus:0;mem:1024;disk:1024;ports:[31000-32000]" --revocable_cpu_low_priority="true"
--runtime_dir="/tmp/Endpoint_SlaveEndpointTest_NoAuthorizer_1_1mEm4A" --sandbox_directory="/mnt/mesos/sandbox"
--strict="true" --switch_user="true" --systemd_enable_support="true" --systemd_runtime_directory="/run/systemd/system"
--version="false" --work_dir="/tmp/Endpoint_SlaveEndpointTest_NoAuthorizer_1_7kxe8F"
I0724 10:08:24.909795  5049 credentials.hpp:86] Loading credential for authentication from
'/tmp/Endpoint_SlaveEndpointTest_NoAuthorizer_1_1mEm4A/credential'
I0724 10:08:24.910096  5049 slave.cpp:283] Agent using credential for: test-principal
I0724 10:08:24.910122  5049 credentials.hpp:37] Loading credentials for authentication from
'/tmp/Endpoint_SlaveEndpointTest_NoAuthorizer_1_1mEm4A/http_credentials'
I0724 10:08:24.910526  5049 http.cpp:993] Creating default 'basic' HTTP authenticator for
realm 'mesos-agent-readonly'
I0724 10:08:24.910795  5049 http.cpp:993] Creating default 'basic' HTTP authenticator for
realm 'mesos-agent-readwrite'
I0724 10:08:24.912993  5049 slave.cpp:565] Agent resources: [{"name":"cpus","scalar":{"value":2.0},"type":"SCALAR"},{"name":"mem","scalar":{"value":1024.0},"type":"SCALAR"},{"name":"disk","scalar":{"value":1024.0},"type":"SCALAR"},{"name":"ports","ranges":{"range":[{"begin":31000,"end":32000}]},"type":"RANGES"}]
I0724 10:08:24.913427  5049 slave.cpp:573] Agent attributes: [  ]
I0724 10:08:24.913450  5049 slave.cpp:582] Agent hostname: 86cd6e221d2a
I0724 10:08:24.913713  5046 status_update_manager.cpp:177] Pausing sending status updates
I0724 10:08:24.915652  5047 state.cpp:64] Recovering state from '/tmp/Endpoint_SlaveEndpointTest_NoAuthorizer_1_7kxe8F/meta'
I0724 10:08:24.916404  5046 status_update_manager.cpp:203] Recovering status update manager
I0724 10:08:24.916712  5050 containerizer.cpp:582] Recovering containerizer
I0724 10:08:24.918982  5051 provisioner.cpp:416] Provisioner recovery complete
I0724 10:08:24.919592  5046 slave.cpp:6207] Finished recovery
I0724 10:08:24.920272  5046 slave.cpp:6389] Querying resource estimator for oversubscribable
resources
I0724 10:08:24.920667  5045 slave.cpp:6403] Received oversubscribable resources {} from the
resource estimator
I0724 10:08:24.924741  5045 process.cpp:3837] Handling HTTP event for process 'slave(797)'
with path: '/slave(797)/monitor/statistics.json'
I0724 10:08:24.926805  5052 http.cpp:1133] HTTP GET for /slave(797)/monitor/statistics.json
from 172.17.0.2:47024
I0724 10:08:24.926928  5052 http.cpp:957] Authorizing principal 'test-principal' to GET the
'/monitor/statistics.json' endpoint
I0724 10:08:24.932086  5026 slave.cpp:843] Agent terminating
[       OK ] Endpoint/SlaveEndpointTest.NoAuthorizer/1 (44 ms)
[ RUN      ] Endpoint/SlaveEndpointTest.NoAuthorizer/2
I0724 10:08:24.947496  5026 containerizer.cpp:230] Using isolation: posix/cpu,posix/mem,filesystem/posix,network/cni,environment_secret
W0724 10:08:24.948261  5026 backend.cpp:76] Failed to create 'overlay' backend: OverlayBackend
requires root privileges
W0724 10:08:24.948420  5026 backend.cpp:76] Failed to create 'bind' backend: BindBackend requires
root privileges
I0724 10:08:24.948462  5026 provisioner.cpp:255] Using default backend 'copy'
I0724 10:08:24.950806  5026 cluster.cpp:448] Creating default 'local' authorizer
I0724 10:08:24.953444  5052 slave.cpp:250] Mesos agent started on (798)@172.17.0.2:34297
I0724 10:08:24.953482  5052 slave.cpp:251] Flags at startup: --acls="" --appc_simple_discovery_uri_prefix="http://"
--appc_store_dir="/tmp/Endpoint_SlaveEndpointTest_NoAuthorizer_2_10sHdh/store/appc" --authenticate_http_readonly="true"
--authenticate_http_readwrite="true" --authenticatee="crammd5" --authentication_backoff_factor="1secs"
--authorizer="local" --cgroups_cpu_enable_pids_and_tids_count="false" --cgroups_enable_cfs="false"
--cgroups_hierarchy="/sys/fs/cgroup" --cgroups_limit_swap="false" --cgroups_root="mesos" --container_disk_watch_interval="15secs"
--containerizers="mesos" --credential="/tmp/Endpoint_SlaveEndpointTest_NoAuthorizer_2_10sHdh/credential"
--default_role="*" --disk_watch_interval="1mins" --docker="docker" --docker_kill_orphans="true"
--docker_registry="https://registry-1.docker.io" --docker_remove_delay="6hrs" --docker_socket="/var/run/docker.sock"
--docker_stop_timeout="0ns" --docker_store_dir="/tmp/Endpoint_SlaveEndpointTest_NoAuthorizer_2_10sHdh/store/docker"
--docker_volume_checkpoint_dir="/var/run/mesos/isolators/docker/volume" --enforce_container_disk_quota="false"
--executor_registration_timeout="1mins" --executor_reregistration_timeout="2secs" --executor_shutdown_grace_period="5secs"
--fetcher_cache_dir="/tmp/Endpoint_SlaveEndpointTest_NoAuthorizer_2_10sHdh/fetch" --fetcher_cache_size="2GB"
--frameworks_home="" --gc_delay="1weeks" --gc_disk_headroom="0.1" --hadoop_home="" --help="false"
--hostname_lookup="true" --http_command_executor="false" --http_credentials="/tmp/Endpoint_SlaveEndpointTest_NoAuthorizer_2_10sHdh/http_credentials"
--http_heartbeat_interval="30secs" --initialize_driver_logging="true" --isolation="posix/cpu,posix/mem"
--launcher="posix" --launcher_dir="/mesos/mesos-1.4.0/_build/src" --logbufsecs="0" --logging_level="INFO"
--max_completed_executors_per_framework="150" --oversubscribed_resources_interval="15secs"
--perf_duration="10secs" --perf_interval="1mins" --port="5051" --qos_correction_interval_min="0ns"
--quiet="false" --recover="reconnect" --recovery_timeout="15mins" --registration_backoff_factor="10ms"
--resources="cpus:2;gpus:0;mem:1024;disk:1024;ports:[31000-32000]" --revocable_cpu_low_priority="true"
--runtime_dir="/tmp/Endpoint_SlaveEndpointTest_NoAuthorizer_2_10sHdh" --sandbox_directory="/mnt/mesos/sandbox"
--strict="true" --switch_user="true" --systemd_enable_support="true" --systemd_runtime_directory="/run/systemd/system"
--version="false" --work_dir="/tmp/Endpoint_SlaveEndpointTest_NoAuthorizer_2_3Krkam"
I0724 10:08:24.954322  5052 credentials.hpp:86] Loading credential for authentication from
'/tmp/Endpoint_SlaveEndpointTest_NoAuthorizer_2_10sHdh/credential'
I0724 10:08:24.954573  5052 slave.cpp:283] Agent using credential for: test-principal
I0724 10:08:24.954594  5052 credentials.hpp:37] Loading credentials for authentication from
'/tmp/Endpoint_SlaveEndpointTest_NoAuthorizer_2_10sHdh/http_credentials'
I0724 10:08:24.954936  5052 http.cpp:993] Creating default 'basic' HTTP authenticator for
realm 'mesos-agent-readonly'
I0724 10:08:24.955157  5052 http.cpp:993] Creating default 'basic' HTTP authenticator for
realm 'mesos-agent-readwrite'
I0724 10:08:24.957417  5052 slave.cpp:565] Agent resources: [{"name":"cpus","scalar":{"value":2.0},"type":"SCALAR"},{"name":"mem","scalar":{"value":1024.0},"type":"SCALAR"},{"name":"disk","scalar":{"value":1024.0},"type":"SCALAR"},{"name":"ports","ranges":{"range":[{"begin":31000,"end":32000}]},"type":"RANGES"}]
I0724 10:08:24.957849  5052 slave.cpp:573] Agent attributes: [  ]
I0724 10:08:24.957868  5052 slave.cpp:582] Agent hostname: 86cd6e221d2a
I0724 10:08:24.958207  5048 status_update_manager.cpp:177] Pausing sending status updates
I0724 10:08:24.960260  5049 state.cpp:64] Recovering state from '/tmp/Endpoint_SlaveEndpointTest_NoAuthorizer_2_3Krkam/meta'
I0724 10:08:24.960629  5048 status_update_manager.cpp:203] Recovering status update manager
I0724 10:08:24.960947  5048 containerizer.cpp:582] Recovering containerizer
I0724 10:08:24.963070  5049 provisioner.cpp:416] Provisioner recovery complete
I0724 10:08:24.963596  5047 slave.cpp:6207] Finished recovery
I0724 10:08:24.964531  5047 slave.cpp:6389] Querying resource estimator for oversubscribable
resources
I0724 10:08:24.964979  5051 slave.cpp:6403] Received oversubscribable resources {} from the
resource estimator
I0724 10:08:24.968948  5047 process.cpp:3837] Handling HTTP event for process 'slave(798)'
with path: '/slave(798)/containers'
I0724 10:08:24.971333  5051 http.cpp:1133] HTTP GET for /slave(798)/containers from 172.17.0.2:47026
I0724 10:08:24.971468  5051 http.cpp:957] Authorizing principal 'test-principal' to GET the
'/containers' endpoint
I0724 10:08:24.977879  5026 slave.cpp:843] Agent terminating
[       OK ] Endpoint/SlaveEndpointTest.NoAuthorizer/2 (46 ms)
[----------] 9 tests from Endpoint/SlaveEndpointTest (408 ms total)

[----------] Global test environment tear-down
[==========] 1637 tests from 179 test cases ran. (713644 ms total)
[  PASSED  ] 1633 tests.
[  FAILED  ] 4 tests, listed below:
[  FAILED  ] DefaultExecutorCheckTest.CommandCheckDeliveredAndReconciled
[  FAILED  ] DefaultExecutorCheckTest.CommandCheckStatusChange
[  FAILED  ] DefaultExecutorCheckTest.CommandCheckSeesParentsEnv
[  FAILED  ] DefaultExecutorCheckTest.CommandCheckSharesWorkDirWithTask

 4 FAILED TESTS
  YOU HAVE 20 DISABLED TESTS

I0724 10:08:25.120482  5053 process.cpp:1006] Failed to accept socket: future discarded
make[4]: *** [check-local] Error 1
make[4]: Leaving directory `/mesos/mesos-1.4.0/_build/src'
make[3]: *** [check-am] Error 2
make[3]: Leaving directory `/mesos/mesos-1.4.0/_build/src'
make[2]: *** [check] Error 2
make[2]: Leaving directory `/mesos/mesos-1.4.0/_build/src'
make[1]: *** [check-recursive] Error 1
make[1]: Leaving directory `/mesos/mesos-1.4.0/_build'
make: *** [distcheck] Error 1
+ docker rmi mesos-1500885273-6750
Untagged: mesos-1500885273-6750:latest
Deleted: sha256:7e041470f4d44010cc3bbf727eeec46a71b0ee4a10b1fd65263a775ad5dc99ff
Deleted: sha256:72c89c4e9287afcf362699cfbbedddeb39a4210211904b56b11b1c6806b3416b
Deleted: sha256:47fa57f1e72bbadb3cb3e778fafce3a1e61b2d52f2e5b188e2ccf80e82a8c956
Deleted: sha256:3fe30519c2e4f4e4c8efd6cc638666f94a01139e8c744a8009b0e47a175ecec2
Deleted: sha256:3b4cf0c621db17df7b3fd18f462a50553f9d3d785aa3682a68547fc884798dc3
Deleted: sha256:369741e3028317c02567f9f309fa6b10cf662bd4c5d7fc6ab818aefbcea4bc45
Deleted: sha256:e71b4dfa0d0897079f985d7e263e318f316fb4c6720018e48a9063ec4553e76a
Deleted: sha256:f43459d0de8aae3edf55365d4f5c5437b7539a396d6231fea535ac15aa45568e
Deleted: sha256:a7a77a907a2214b93c8db734fd1a9173139897f31ca10179286fe5615d03f8b8
Deleted: sha256:417c5e77e9f19e2b10cc96bdd038c5ca2ce43a107d4ed31687e7f3a9c71a9435
Deleted: sha256:54c67247a66f1842293338da05a362fc65d75677c97fdf4587a3f5c08b27b5a5
Deleted: sha256:5122e5a0269bd0860f4e57e5703c953898157a26d22a592084719c2e05d8c841
Deleted: sha256:6b03fd9a4e5746d53116f571bff41c0bbb2ef9181a6e8db660ec6130520bb94f
Deleted: sha256:a0b0be1b6676ee7892eb6d9bf94eac4d64e60e0b7d2a3d9b06c20e3fe7d2b5f8
Deleted: sha256:4b55dd85205c96af82270777d597d85e17f63ce613b2f115f3afacbe41f13fbc
Deleted: sha256:4960c731c17888bb05095af9fca511e019d382b151b633941e1171e1921e8676
Deleted: sha256:5408266122a156070cfde5bf19a933c72c1851719567537d9f9e28f6f3fc2d7d
Deleted: sha256:d3d695fb885f6b8ca78097e1c6cef75bbfd740964bcdaf6b7f36c0758ee07b30
Deleted: sha256:9fe1de5978fa40f493f26403b588274c4161f154b4704416b5275036d5a88bc4
Deleted: sha256:6497c70f878e8434b59382e711ca0bfd0ab844ff632c306c53e9d005a86db9ed
Deleted: sha256:e2455ea8395b6be06be56bdc800b90f39b9baaab47a321f2146714bf31f31a57
Deleted: sha256:465656a8fb9cfec09b54c7970eacb103b9b5b55f138016763ea5c7eaacba9ec3
Deleted: sha256:59c821990052bd5c54eb46d902883492f0301a4790a92b27b5394a88036a9db9
Deleted: sha256:c1c57b9a5da478c95e7c9aa5beb519c13ff4b38d13193d8f47595d534791631f
Build step 'Execute shell' marked build as failure

Mime
View raw message