mesos-builds mailing list archives

Site index · List index
Message view « Date » · « Thread »
Top « Date » · « Thread »
From Apache Jenkins Server <jenk...@builds.apache.org>
Subject Build failed in Jenkins: Mesos-Reviewbot #18469
Date Sun, 09 Jul 2017 06:28:44 GMT
See <https://builds.apache.org/job/Mesos-Reviewbot/18469/display/redirect?page=changes>

Changes:

[yujie.jay] Allowed to pass total resources in 'UpdateSlaveMessage'.

[yujie.jay] Changed semantics of allocator 'updateSlave' method.

[yujie.jay] Added MESOS-7755 to the upgrades guide and the CHANGELOG.

------------------------------------------
[...truncated 29.89 MB...]
W0709 06:28:32.946471  4966 backend.cpp:76] Failed to create 'overlay' backend: OverlayBackend
requires root privileges
W0709 06:28:32.946663  4966 backend.cpp:76] Failed to create 'bind' backend: BindBackend requires
root privileges
I0709 06:28:32.946712  4966 provisioner.cpp:255] Using default backend 'copy'
I0709 06:28:32.953999  4986 slave.cpp:250] Mesos agent started on (778)@172.17.0.2:35827
I0709 06:28:32.954051  4986 slave.cpp:251] Flags at startup: --acls="" --appc_simple_discovery_uri_prefix="http://"
--appc_store_dir="/tmp/Endpoint_SlaveEndpointTest_AuthorizedRequest_2_HI2QcA/store/appc" --authenticate_http_readonly="true"
--authenticate_http_readwrite="true" --authenticatee="crammd5" --authentication_backoff_factor="1secs"
--authorizer="local" --cgroups_cpu_enable_pids_and_tids_count="false" --cgroups_enable_cfs="false"
--cgroups_hierarchy="/sys/fs/cgroup" --cgroups_limit_swap="false" --cgroups_root="mesos" --container_disk_watch_interval="15secs"
--containerizers="mesos" --credential="/tmp/Endpoint_SlaveEndpointTest_AuthorizedRequest_2_HI2QcA/credential"
--default_role="*" --disk_watch_interval="1mins" --docker="docker" --docker_kill_orphans="true"
--docker_registry="https://registry-1.docker.io" --docker_remove_delay="6hrs" --docker_socket="/var/run/docker.sock"
--docker_stop_timeout="0ns" --docker_store_dir="/tmp/Endpoint_SlaveEndpointTest_AuthorizedRequest_2_HI2QcA/store/docker"
--docker_volume_checkpoint_dir="/var/run/mesos/isolators/docker/volume" --enforce_container_disk_quota="false"
--executor_registration_timeout="1mins" --executor_reregistration_timeout="2secs" --executor_shutdown_grace_period="5secs"
--fetcher_cache_dir="/tmp/Endpoint_SlaveEndpointTest_AuthorizedRequest_2_HI2QcA/fetch" --fetcher_cache_size="2GB"
--frameworks_home="" --gc_delay="1weeks" --gc_disk_headroom="0.1" --hadoop_home="" --help="false"
--hostname_lookup="true" --http_command_executor="false" --http_credentials="/tmp/Endpoint_SlaveEndpointTest_AuthorizedRequest_2_HI2QcA/http_credentials"
--http_heartbeat_interval="30secs" --initialize_driver_logging="true" --isolation="posix/cpu,posix/mem"
--launcher="posix" --launcher_dir="/mesos/mesos-1.4.0/_build/src" --logbufsecs="0" --logging_level="INFO"
--max_completed_executors_per_framework="150" --oversubscribed_resources_interval="15secs"
--perf_duration="10secs" --perf_interval="1mins" --port="5051" --qos_correction_interval_min="0ns"
--quiet="false" --recover="reconnect" --recovery_timeout="15mins" --registration_backoff_factor="10ms"
--resources="cpus:2;gpus:0;mem:1024;disk:1024;ports:[31000-32000]" --revocable_cpu_low_priority="true"
--runtime_dir="/tmp/Endpoint_SlaveEndpointTest_AuthorizedRequest_2_HI2QcA" --sandbox_directory="/mnt/mesos/sandbox"
--strict="true" --switch_user="true" --systemd_enable_support="true" --systemd_runtime_directory="/run/systemd/system"
--version="false" --work_dir="/tmp/Endpoint_SlaveEndpointTest_AuthorizedRequest_2_X9815Z"
I0709 06:28:32.955168  4986 credentials.hpp:86] Loading credential for authentication from
'/tmp/Endpoint_SlaveEndpointTest_AuthorizedRequest_2_HI2QcA/credential'
I0709 06:28:32.956090  4986 slave.cpp:283] Agent using credential for: test-principal
I0709 06:28:32.956141  4986 credentials.hpp:37] Loading credentials for authentication from
'/tmp/Endpoint_SlaveEndpointTest_AuthorizedRequest_2_HI2QcA/http_credentials'
I0709 06:28:32.956898  4986 http.cpp:976] Creating default 'basic' HTTP authenticator for
realm 'mesos-agent-readonly'
I0709 06:28:32.957593  4986 http.cpp:976] Creating default 'basic' HTTP authenticator for
realm 'mesos-agent-readwrite'
I0709 06:28:32.960530  4986 slave.cpp:565] Agent resources: [{"name":"cpus","scalar":{"value":2.0},"type":"SCALAR"},{"name":"mem","scalar":{"value":1024.0},"type":"SCALAR"},{"name":"disk","scalar":{"value":1024.0},"type":"SCALAR"},{"name":"ports","ranges":{"range":[{"begin":31000,"end":32000}]},"type":"RANGES"}]
I0709 06:28:32.961025  4986 slave.cpp:573] Agent attributes: [  ]
I0709 06:28:32.961055  4986 slave.cpp:578] Agent hostname: 2cb02656c33f
I0709 06:28:32.961668  4991 status_update_manager.cpp:177] Pausing sending status updates
I0709 06:28:32.965688  4986 state.cpp:64] Recovering state from '/tmp/Endpoint_SlaveEndpointTest_AuthorizedRequest_2_X9815Z/meta'
I0709 06:28:32.967389  4986 status_update_manager.cpp:203] Recovering status update manager
I0709 06:28:32.967624  4986 containerizer.cpp:582] Recovering containerizer
I0709 06:28:32.971045  4986 provisioner.cpp:416] Provisioner recovery complete
I0709 06:28:32.972131  4990 slave.cpp:6203] Finished recovery
I0709 06:28:32.973510  4990 slave.cpp:6385] Querying resource estimator for oversubscribable
resources
I0709 06:28:32.974442  4991 slave.cpp:6399] Received oversubscribable resources {} from the
resource estimator
I0709 06:28:32.981613  4991 process.cpp:3810] Handling HTTP event for process 'slave(778)'
with path: '/slave(778)/containers'
I0709 06:28:32.984304  4988 http.cpp:1116] HTTP GET for /slave(778)/containers from 172.17.0.2:48010
I0709 06:28:32.984458  4988 http.cpp:937] Authorizing principal 'test-principal' to GET the
'/containers' endpoint
I0709 06:28:32.993373  4966 slave.cpp:839] Agent terminating
[       OK ] Endpoint/SlaveEndpointTest.AuthorizedRequest/2 (68 ms)
[ RUN      ] Endpoint/SlaveEndpointTest.UnauthorizedRequest/0
I0709 06:28:33.020892  4966 containerizer.cpp:230] Using isolation: posix/cpu,posix/mem,filesystem/posix,network/cni,environment_secret
W0709 06:28:33.021894  4966 backend.cpp:76] Failed to create 'overlay' backend: OverlayBackend
requires root privileges
W0709 06:28:33.022285  4966 backend.cpp:76] Failed to create 'bind' backend: BindBackend requires
root privileges
I0709 06:28:33.022356  4966 provisioner.cpp:255] Using default backend 'copy'
I0709 06:28:33.033015  4988 slave.cpp:250] Mesos agent started on (779)@172.17.0.2:35827
I0709 06:28:33.033066  4988 slave.cpp:251] Flags at startup: --acls="" --appc_simple_discovery_uri_prefix="http://"
--appc_store_dir="/tmp/Endpoint_SlaveEndpointTest_UnauthorizedRequest_0_HWlshV/store/appc"
--authenticate_http_readonly="true" --authenticate_http_readwrite="true" --authenticatee="crammd5"
--authentication_backoff_factor="1secs" --authorizer="local" --cgroups_cpu_enable_pids_and_tids_count="false"
--cgroups_enable_cfs="false" --cgroups_hierarchy="/sys/fs/cgroup" --cgroups_limit_swap="false"
--cgroups_root="mesos" --container_disk_watch_interval="15secs" --containerizers="mesos" --credential="/tmp/Endpoint_SlaveEndpointTest_UnauthorizedRequest_0_HWlshV/credential"
--default_role="*" --disk_watch_interval="1mins" --docker="docker" --docker_kill_orphans="true"
--docker_registry="https://registry-1.docker.io" --docker_remove_delay="6hrs" --docker_socket="/var/run/docker.sock"
--docker_stop_timeout="0ns" --docker_store_dir="/tmp/Endpoint_SlaveEndpointTest_UnauthorizedRequest_0_HWlshV/store/docker"
--docker_volume_checkpoint_dir="/var/run/mesos/isolators/docker/volume" --enforce_container_disk_quota="false"
--executor_registration_timeout="1mins" --executor_reregistration_timeout="2secs" --executor_shutdown_grace_period="5secs"
--fetcher_cache_dir="/tmp/Endpoint_SlaveEndpointTest_UnauthorizedRequest_0_HWlshV/fetch" --fetcher_cache_size="2GB"
--frameworks_home="" --gc_delay="1weeks" --gc_disk_headroom="0.1" --hadoop_home="" --help="false"
--hostname_lookup="true" --http_command_executor="false" --http_credentials="/tmp/Endpoint_SlaveEndpointTest_UnauthorizedRequest_0_HWlshV/http_credentials"
--http_heartbeat_interval="30secs" --initialize_driver_logging="true" --isolation="posix/cpu,posix/mem"
--launcher="posix" --launcher_dir="/mesos/mesos-1.4.0/_build/src" --logbufsecs="0" --logging_level="INFO"
--max_completed_executors_per_framework="150" --oversubscribed_resources_interval="15secs"
--perf_duration="10secs" --perf_interval="1mins" --port="5051" --qos_correction_interval_min="0ns"
--quiet="false" --recover="reconnect" --recovery_timeout="15mins" --registration_backoff_factor="10ms"
--resources="cpus:2;gpus:0;mem:1024;disk:1024;ports:[31000-32000]" --revocable_cpu_low_priority="true"
--runtime_dir="/tmp/Endpoint_SlaveEndpointTest_UnauthorizedRequest_0_HWlshV" --sandbox_directory="/mnt/mesos/sandbox"
--strict="true" --switch_user="true" --systemd_enable_support="true" --systemd_runtime_directory="/run/systemd/system"
--version="false" --work_dir="/tmp/Endpoint_SlaveEndpointTest_UnauthorizedRequest_0_Z0bZYk"
I0709 06:28:33.033818  4988 credentials.hpp:86] Loading credential for authentication from
'/tmp/Endpoint_SlaveEndpointTest_UnauthorizedRequest_0_HWlshV/credential'
I0709 06:28:33.034138  4988 slave.cpp:283] Agent using credential for: test-principal
I0709 06:28:33.034175  4988 credentials.hpp:37] Loading credentials for authentication from
'/tmp/Endpoint_SlaveEndpointTest_UnauthorizedRequest_0_HWlshV/http_credentials'
I0709 06:28:33.034667  4988 http.cpp:976] Creating default 'basic' HTTP authenticator for
realm 'mesos-agent-readonly'
I0709 06:28:33.034955  4988 http.cpp:976] Creating default 'basic' HTTP authenticator for
realm 'mesos-agent-readwrite'
I0709 06:28:33.038410  4988 slave.cpp:565] Agent resources: [{"name":"cpus","scalar":{"value":2.0},"type":"SCALAR"},{"name":"mem","scalar":{"value":1024.0},"type":"SCALAR"},{"name":"disk","scalar":{"value":1024.0},"type":"SCALAR"},{"name":"ports","ranges":{"range":[{"begin":31000,"end":32000}]},"type":"RANGES"}]
I0709 06:28:33.038900  4988 slave.cpp:573] Agent attributes: [  ]
I0709 06:28:33.038933  4988 slave.cpp:578] Agent hostname: 2cb02656c33f
I0709 06:28:33.039427  4985 status_update_manager.cpp:177] Pausing sending status updates
I0709 06:28:33.041702  4988 state.cpp:64] Recovering state from '/tmp/Endpoint_SlaveEndpointTest_UnauthorizedRequest_0_Z0bZYk/meta'
I0709 06:28:33.042290  4987 status_update_manager.cpp:203] Recovering status update manager
I0709 06:28:33.043004  4986 containerizer.cpp:582] Recovering containerizer
I0709 06:28:33.048470  4986 provisioner.cpp:416] Provisioner recovery complete
I0709 06:28:33.049525  4987 slave.cpp:6203] Finished recovery
I0709 06:28:33.050876  4987 slave.cpp:6385] Querying resource estimator for oversubscribable
resources
I0709 06:28:33.052469  4989 slave.cpp:6399] Received oversubscribable resources {} from the
resource estimator
I0709 06:28:33.059264  4991 process.cpp:3810] Handling HTTP event for process 'slave(779)'
with path: '/slave(779)/monitor/statistics'
I0709 06:28:33.062607  4987 http.cpp:1116] HTTP GET for /slave(779)/monitor/statistics from
172.17.0.2:48014
I0709 06:28:33.062739  4987 http.cpp:937] Authorizing principal 'test-principal' to GET the
'/monitor/statistics' endpoint
I0709 06:28:33.069756  4992 slave.cpp:839] Agent terminating
[       OK ] Endpoint/SlaveEndpointTest.UnauthorizedRequest/0 (79 ms)
[ RUN      ] Endpoint/SlaveEndpointTest.UnauthorizedRequest/1
I0709 06:28:33.095451  4966 containerizer.cpp:230] Using isolation: posix/cpu,posix/mem,filesystem/posix,network/cni,environment_secret
W0709 06:28:33.096562  4966 backend.cpp:76] Failed to create 'overlay' backend: OverlayBackend
requires root privileges
W0709 06:28:33.096964  4966 backend.cpp:76] Failed to create 'bind' backend: BindBackend requires
root privileges
I0709 06:28:33.097036  4966 provisioner.cpp:255] Using default backend 'copy'
I0709 06:28:33.104893  4987 slave.cpp:250] Mesos agent started on (780)@172.17.0.2:35827
I0709 06:28:33.104941  4987 slave.cpp:251] Flags at startup: --acls="" --appc_simple_discovery_uri_prefix="http://"
--appc_store_dir="/tmp/Endpoint_SlaveEndpointTest_UnauthorizedRequest_1_X24Iah/store/appc"
--authenticate_http_readonly="true" --authenticate_http_readwrite="true" --authenticatee="crammd5"
--authentication_backoff_factor="1secs" --authorizer="local" --cgroups_cpu_enable_pids_and_tids_count="false"
--cgroups_enable_cfs="false" --cgroups_hierarchy="/sys/fs/cgroup" --cgroups_limit_swap="false"
--cgroups_root="mesos" --container_disk_watch_interval="15secs" --containerizers="mesos" --credential="/tmp/Endpoint_SlaveEndpointTest_UnauthorizedRequest_1_X24Iah/credential"
--default_role="*" --disk_watch_interval="1mins" --docker="docker" --docker_kill_orphans="true"
--docker_registry="https://registry-1.docker.io" --docker_remove_delay="6hrs" --docker_socket="/var/run/docker.sock"
--docker_stop_timeout="0ns" --docker_store_dir="/tmp/Endpoint_SlaveEndpointTest_UnauthorizedRequest_1_X24Iah/store/docker"
--docker_volume_checkpoint_dir="/var/run/mesos/isolators/docker/volume" --enforce_container_disk_quota="false"
--executor_registration_timeout="1mins" --executor_reregistration_timeout="2secs" --executor_shutdown_grace_period="5secs"
--fetcher_cache_dir="/tmp/Endpoint_SlaveEndpointTest_UnauthorizedRequest_1_X24Iah/fetch" --fetcher_cache_size="2GB"
--frameworks_home="" --gc_delay="1weeks" --gc_disk_headroom="0.1" --hadoop_home="" --help="false"
--hostname_lookup="true" --http_command_executor="false" --http_credentials="/tmp/Endpoint_SlaveEndpointTest_UnauthorizedRequest_1_X24Iah/http_credentials"
--http_heartbeat_interval="30secs" --initialize_driver_logging="true" --isolation="posix/cpu,posix/mem"
--launcher="posix" --launcher_dir="/mesos/mesos-1.4.0/_build/src" --logbufsecs="0" --logging_level="INFO"
--max_completed_executors_per_framework="150" --oversubscribed_resources_interval="15secs"
--perf_duration="10secs" --perf_interval="1mins" --port="5051" --qos_correction_interval_min="0ns"
--quiet="false" --recover="reconnect" --recovery_timeout="15mins" --registration_backoff_factor="10ms"
--resources="cpus:2;gpus:0;mem:1024;disk:1024;ports:[31000-32000]" --revocable_cpu_low_priority="true"
--runtime_dir="/tmp/Endpoint_SlaveEndpointTest_UnauthorizedRequest_1_X24Iah" --sandbox_directory="/mnt/mesos/sandbox"
--strict="true" --switch_user="true" --systemd_enable_support="true" --systemd_runtime_directory="/run/systemd/system"
--version="false" --work_dir="/tmp/Endpoint_SlaveEndpointTest_UnauthorizedRequest_1_Tv3EFG"
I0709 06:28:33.105949  4987 credentials.hpp:86] Loading credential for authentication from
'/tmp/Endpoint_SlaveEndpointTest_UnauthorizedRequest_1_X24Iah/credential'
I0709 06:28:33.106364  4987 slave.cpp:283] Agent using credential for: test-principal
I0709 06:28:33.106405  4987 credentials.hpp:37] Loading credentials for authentication from
'/tmp/Endpoint_SlaveEndpointTest_UnauthorizedRequest_1_X24Iah/http_credentials'
I0709 06:28:33.106932  4987 http.cpp:976] Creating default 'basic' HTTP authenticator for
realm 'mesos-agent-readonly'
I0709 06:28:33.107331  4987 http.cpp:976] Creating default 'basic' HTTP authenticator for
realm 'mesos-agent-readwrite'
I0709 06:28:33.109755  4987 slave.cpp:565] Agent resources: [{"name":"cpus","scalar":{"value":2.0},"type":"SCALAR"},{"name":"mem","scalar":{"value":1024.0},"type":"SCALAR"},{"name":"disk","scalar":{"value":1024.0},"type":"SCALAR"},{"name":"ports","ranges":{"range":[{"begin":31000,"end":32000}]},"type":"RANGES"}]
I0709 06:28:33.110332  4987 slave.cpp:573] Agent attributes: [  ]
I0709 06:28:33.110363  4987 slave.cpp:578] Agent hostname: 2cb02656c33f
I0709 06:28:33.110646  4990 status_update_manager.cpp:177] Pausing sending status updates
I0709 06:28:33.113658  4987 state.cpp:64] Recovering state from '/tmp/Endpoint_SlaveEndpointTest_UnauthorizedRequest_1_Tv3EFG/meta'
I0709 06:28:33.116428  4987 status_update_manager.cpp:203] Recovering status update manager
I0709 06:28:33.116956  4992 containerizer.cpp:582] Recovering containerizer
I0709 06:28:33.120667  4991 provisioner.cpp:416] Provisioner recovery complete
I0709 06:28:33.121948  4990 slave.cpp:6203] Finished recovery
I0709 06:28:33.123343  4990 slave.cpp:6385] Querying resource estimator for oversubscribable
resources
I0709 06:28:33.124107  4991 slave.cpp:6399] Received oversubscribable resources {} from the
resource estimator
I0709 06:28:33.129855  4991 process.cpp:3810] Handling HTTP event for process 'slave(780)'
with path: '/slave(780)/monitor/statistics.json'
I0709 06:28:33.133393  4985 http.cpp:1116] HTTP GET for /slave(780)/monitor/statistics.json
from 172.17.0.2:48016
I0709 06:28:33.133541  4985 http.cpp:937] Authorizing principal 'test-principal' to GET the
'/monitor/statistics.json' endpoint
I0709 06:28:33.142802  4989 slave.cpp:839] Agent terminating
[       OK ] Endpoint/SlaveEndpointTest.UnauthorizedRequest/1 (69 ms)
[ RUN      ] Endpoint/SlaveEndpointTest.UnauthorizedRequest/2
I0709 06:28:33.164868  4966 containerizer.cpp:230] Using isolation: posix/cpu,posix/mem,filesystem/posix,network/cni,environment_secret
W0709 06:28:33.165674  4966 backend.cpp:76] Failed to create 'overlay' backend: OverlayBackend
requires root privileges
W0709 06:28:33.165874  4966 backend.cpp:76] Failed to create 'bind' backend: BindBackend requires
root privileges
I0709 06:28:33.165916  4966 provisioner.cpp:255] Using default backend 'copy'
I0709 06:28:33.172843  4986 slave.cpp:250] Mesos agent started on (781)@172.17.0.2:35827
I0709 06:28:33.172891  4986 slave.cpp:251] Flags at startup: --acls="" --appc_simple_discovery_uri_prefix="http://"
--appc_store_dir="/tmp/Endpoint_SlaveEndpointTest_UnauthorizedRequest_2_vOIZND/store/appc"
--authenticate_http_readonly="true" --authenticate_http_readwrite="true" --authenticatee="crammd5"
--authentication_backoff_factor="1secs" --authorizer="local" --cgroups_cpu_enable_pids_and_tids_count="false"
--cgroups_enable_cfs="false" --cgroups_hierarchy="/sys/fs/cgroup" --cgroups_limit_swap="false"
--cgroups_root="mesos" --container_disk_watch_interval="15secs" --containerizers="mesos" --credential="/tmp/Endpoint_SlaveEndpointTest_UnauthorizedRequest_2_vOIZND/credential"
--default_role="*" --disk_watch_interval="1mins" --docker="docker" --docker_kill_orphans="true"
--docker_registry="https://registry-1.docker.io" --docker_remove_delay="6hrs" --docker_socket="/var/run/docker.sock"
--docker_stop_timeout="0ns" --docker_store_dir="/tmp/Endpoint_SlaveEndpointTest_UnauthorizedRequest_2_vOIZND/store/docker"
--docker_volume_checkpoint_dir="/var/run/mesos/isolators/docker/volume" --enforce_container_disk_quota="false"
--executor_registration_timeout="1mins" --executor_reregistration_timeout="2secs" --executor_shutdown_grace_period="5secs"
--fetcher_cache_dir="/tmp/Endpoint_SlaveEndpointTest_UnauthorizedRequest_2_vOIZND/fetch" --fetcher_cache_size="2GB"
--frameworks_home="" --gc_delay="1weeks" --gc_disk_headroom="0.1" --hadoop_home="" --help="false"
--hostname_lookup="true" --http_command_executor="false" --http_credentials="/tmp/Endpoint_SlaveEndpointTest_UnauthorizedRequest_2_vOIZND/http_credentials"
--http_heartbeat_interval="30secs" --initialize_driver_logging="true" --isolation="posix/cpu,posix/mem"
--launcher="posix" --launcher_dir="/mesos/mesos-1.4.0/_build/src" --logbufsecs="0" --logging_level="INFO"
--max_completed_executors_per_framework="150" --oversubscribed_resources_interval="15secs"
--perf_duration="10secs" --perf_interval="1mins" --port="5051" --qos_correction_interval_min="0ns"
--quiet="false" --recover="reconnect" --recovery_timeout="15mins" --registration_backoff_factor="10ms"
--resources="cpus:2;gpus:0;mem:1024;disk:1024;ports:[31000-32000]" --revocable_cpu_low_priority="true"
--runtime_dir="/tmp/Endpoint_SlaveEndpointTest_UnauthorizedRequest_2_vOIZND" --sandbox_directory="/mnt/mesos/sandbox"
--strict="true" --switch_user="true" --systemd_enable_support="true" --systemd_runtime_directory="/run/systemd/system"
--version="false" --work_dir="/tmp/Endpoint_SlaveEndpointTest_UnauthorizedRequest_2_nVCu72"
I0709 06:28:33.173785  4986 credentials.hpp:86] Loading credential for authentication from
'/tmp/Endpoint_SlaveEndpointTest_UnauthorizedRequest_2_vOIZND/credential'
I0709 06:28:33.174270  4986 slave.cpp:283] Agent using credential for: test-principal
I0709 06:28:33.174331  4986 credentials.hpp:37] Loading credentials for authentication from
'/tmp/Endpoint_SlaveEndpointTest_UnauthorizedRequest_2_vOIZND/http_credentials'
I0709 06:28:33.174953  4986 http.cpp:976] Creating default 'basic' HTTP authenticator for
realm 'mesos-agent-readonly'
I0709 06:28:33.175364  4986 http.cpp:976] Creating default 'basic' HTTP authenticator for
realm 'mesos-agent-readwrite'
I0709 06:28:33.178160  4986 slave.cpp:565] Agent resources: [{"name":"cpus","scalar":{"value":2.0},"type":"SCALAR"},{"name":"mem","scalar":{"value":1024.0},"type":"SCALAR"},{"name":"disk","scalar":{"value":1024.0},"type":"SCALAR"},{"name":"ports","ranges":{"range":[{"begin":31000,"end":32000}]},"type":"RANGES"}]
I0709 06:28:33.178635  4986 slave.cpp:573] Agent attributes: [  ]
I0709 06:28:33.178666  4986 slave.cpp:578] Agent hostname: 2cb02656c33f
I0709 06:28:33.180212  4988 status_update_manager.cpp:177] Pausing sending status updates
I0709 06:28:33.182662  4986 state.cpp:64] Recovering state from '/tmp/Endpoint_SlaveEndpointTest_UnauthorizedRequest_2_nVCu72/meta'
I0709 06:28:33.184211  4985 status_update_manager.cpp:203] Recovering status update manager
I0709 06:28:33.184821  4985 containerizer.cpp:582] Recovering containerizer
I0709 06:28:33.188302  4992 provisioner.cpp:416] Provisioner recovery complete
I0709 06:28:33.189061  4986 slave.cpp:6203] Finished recovery
I0709 06:28:33.189765  4986 slave.cpp:6385] Querying resource estimator for oversubscribable
resources
I0709 06:28:33.190505  4992 slave.cpp:6399] Received oversubscribable resources {} from the
resource estimator
I0709 06:28:33.197082  4992 process.cpp:3810] Handling HTTP event for process 'slave(781)'
with path: '/slave(781)/containers'
I0709 06:28:33.200068  4992 http.cpp:1116] HTTP GET for /slave(781)/containers from 172.17.0.2:48018
I0709 06:28:33.200202  4992 http.cpp:937] Authorizing principal 'test-principal' to GET the
'/containers' endpoint
I0709 06:28:33.207749  4966 slave.cpp:839] Agent terminating
[       OK ] Endpoint/SlaveEndpointTest.UnauthorizedRequest/2 (72 ms)
[ RUN      ] Endpoint/SlaveEndpointTest.NoAuthorizer/0
I0709 06:28:33.241051  4966 containerizer.cpp:230] Using isolation: posix/cpu,posix/mem,filesystem/posix,network/cni,environment_secret
W0709 06:28:33.241894  4966 backend.cpp:76] Failed to create 'overlay' backend: OverlayBackend
requires root privileges
W0709 06:28:33.242070  4966 backend.cpp:76] Failed to create 'bind' backend: BindBackend requires
root privileges
I0709 06:28:33.242115  4966 provisioner.cpp:255] Using default backend 'copy'
I0709 06:28:33.244601  4966 cluster.cpp:448] Creating default 'local' authorizer
I0709 06:28:33.247793  4992 slave.cpp:250] Mesos agent started on (782)@172.17.0.2:35827
I0709 06:28:33.247841  4992 slave.cpp:251] Flags at startup: --acls="" --appc_simple_discovery_uri_prefix="http://"
--appc_store_dir="/tmp/Endpoint_SlaveEndpointTest_NoAuthorizer_0_h9Gob1/store/appc" --authenticate_http_readonly="true"
--authenticate_http_readwrite="true" --authenticatee="crammd5" --authentication_backoff_factor="1secs"
--authorizer="local" --cgroups_cpu_enable_pids_and_tids_count="false" --cgroups_enable_cfs="false"
--cgroups_hierarchy="/sys/fs/cgroup" --cgroups_limit_swap="false" --cgroups_root="mesos" --container_disk_watch_interval="15secs"
--containerizers="mesos" --credential="/tmp/Endpoint_SlaveEndpointTest_NoAuthorizer_0_h9Gob1/credential"
--default_role="*" --disk_watch_interval="1mins" --docker="docker" --docker_kill_orphans="true"
--docker_registry="https://registry-1.docker.io" --docker_remove_delay="6hrs" --docker_socket="/var/run/docker.sock"
--docker_stop_timeout="0ns" --docker_store_dir="/tmp/Endpoint_SlaveEndpointTest_NoAuthorizer_0_h9Gob1/store/docker"
--docker_volume_checkpoint_dir="/var/run/mesos/isolators/docker/volume" --enforce_container_disk_quota="false"
--executor_registration_timeout="1mins" --executor_reregistration_timeout="2secs" --executor_shutdown_grace_period="5secs"
--fetcher_cache_dir="/tmp/Endpoint_SlaveEndpointTest_NoAuthorizer_0_h9Gob1/fetch" --fetcher_cache_size="2GB"
--frameworks_home="" --gc_delay="1weeks" --gc_disk_headroom="0.1" --hadoop_home="" --help="false"
--hostname_lookup="true" --http_command_executor="false" --http_credentials="/tmp/Endpoint_SlaveEndpointTest_NoAuthorizer_0_h9Gob1/http_credentials"
--http_heartbeat_interval="30secs" --initialize_driver_logging="true" --isolation="posix/cpu,posix/mem"
--launcher="posix" --launcher_dir="/mesos/mesos-1.4.0/_build/src" --logbufsecs="0" --logging_level="INFO"
--max_completed_executors_per_framework="150" --oversubscribed_resources_interval="15secs"
--perf_duration="10secs" --perf_interval="1mins" --port="5051" --qos_correction_interval_min="0ns"
--quiet="false" --recover="reconnect" --recovery_timeout="15mins" --registration_backoff_factor="10ms"
--resources="cpus:2;gpus:0;mem:1024;disk:1024;ports:[31000-32000]" --revocable_cpu_low_priority="true"
--runtime_dir="/tmp/Endpoint_SlaveEndpointTest_NoAuthorizer_0_h9Gob1" --sandbox_directory="/mnt/mesos/sandbox"
--strict="true" --switch_user="true" --systemd_enable_support="true" --systemd_runtime_directory="/run/systemd/system"
--version="false" --work_dir="/tmp/Endpoint_SlaveEndpointTest_NoAuthorizer_0_Z6K7iq"
I0709 06:28:33.248814  4992 credentials.hpp:86] Loading credential for authentication from
'/tmp/Endpoint_SlaveEndpointTest_NoAuthorizer_0_h9Gob1/credential'
I0709 06:28:33.249318  4992 slave.cpp:283] Agent using credential for: test-principal
I0709 06:28:33.249354  4992 credentials.hpp:37] Loading credentials for authentication from
'/tmp/Endpoint_SlaveEndpointTest_NoAuthorizer_0_h9Gob1/http_credentials'
I0709 06:28:33.249922  4992 http.cpp:976] Creating default 'basic' HTTP authenticator for
realm 'mesos-agent-readonly'
I0709 06:28:33.250344  4992 http.cpp:976] Creating default 'basic' HTTP authenticator for
realm 'mesos-agent-readwrite'
I0709 06:28:33.253100  4992 slave.cpp:565] Agent resources: [{"name":"cpus","scalar":{"value":2.0},"type":"SCALAR"},{"name":"mem","scalar":{"value":1024.0},"type":"SCALAR"},{"name":"disk","scalar":{"value":1024.0},"type":"SCALAR"},{"name":"ports","ranges":{"range":[{"begin":31000,"end":32000}]},"type":"RANGES"}]
I0709 06:28:33.253541  4992 slave.cpp:573] Agent attributes: [  ]
I0709 06:28:33.253563  4992 slave.cpp:578] Agent hostname: 2cb02656c33f
I0709 06:28:33.253991  4985 status_update_manager.cpp:177] Pausing sending status updates
I0709 06:28:33.260102  4992 state.cpp:64] Recovering state from '/tmp/Endpoint_SlaveEndpointTest_NoAuthorizer_0_Z6K7iq/meta'
I0709 06:28:33.260905  4992 status_update_manager.cpp:203] Recovering status update manager
I0709 06:28:33.261261  4992 containerizer.cpp:582] Recovering containerizer
I0709 06:28:33.267773  4985 provisioner.cpp:416] Provisioner recovery complete
I0709 06:28:33.274271  4988 slave.cpp:6203] Finished recovery
I0709 06:28:33.275141  4988 slave.cpp:6385] Querying resource estimator for oversubscribable
resources
I0709 06:28:33.275759  4986 slave.cpp:6399] Received oversubscribable resources {} from the
resource estimator
I0709 06:28:33.282011  4985 process.cpp:3810] Handling HTTP event for process 'slave(782)'
with path: '/slave(782)/monitor/statistics'
I0709 06:28:33.284760  4987 http.cpp:1116] HTTP GET for /slave(782)/monitor/statistics from
172.17.0.2:48024
I0709 06:28:33.284914  4987 http.cpp:937] Authorizing principal 'test-principal' to GET the
'/monitor/statistics' endpoint
I0709 06:28:33.294909  4966 slave.cpp:839] Agent terminating
[       OK ] Endpoint/SlaveEndpointTest.NoAuthorizer/0 (75 ms)
[ RUN      ] Endpoint/SlaveEndpointTest.NoAuthorizer/1
I0709 06:28:33.313599  4966 containerizer.cpp:230] Using isolation: posix/cpu,posix/mem,filesystem/posix,network/cni,environment_secret
W0709 06:28:33.314993  4966 backend.cpp:76] Failed to create 'overlay' backend: OverlayBackend
requires root privileges
W0709 06:28:33.315192  4966 backend.cpp:76] Failed to create 'bind' backend: BindBackend requires
root privileges
I0709 06:28:33.315238  4966 provisioner.cpp:255] Using default backend 'copy'
I0709 06:28:33.326851  4966 cluster.cpp:448] Creating default 'local' authorizer
I0709 06:28:33.333199  4988 slave.cpp:250] Mesos agent started on (783)@172.17.0.2:35827
I0709 06:28:33.333253  4988 slave.cpp:251] Flags at startup: --acls="" --appc_simple_discovery_uri_prefix="http://"
--appc_store_dir="/tmp/Endpoint_SlaveEndpointTest_NoAuthorizer_1_7V6qnp/store/appc" --authenticate_http_readonly="true"
--authenticate_http_readwrite="true" --authenticatee="crammd5" --authentication_backoff_factor="1secs"
--authorizer="local" --cgroups_cpu_enable_pids_and_tids_count="false" --cgroups_enable_cfs="false"
--cgroups_hierarchy="/sys/fs/cgroup" --cgroups_limit_swap="false" --cgroups_root="mesos" --container_disk_watch_interval="15secs"
--containerizers="mesos" --credential="/tmp/Endpoint_SlaveEndpointTest_NoAuthorizer_1_7V6qnp/credential"
--default_role="*" --disk_watch_interval="1mins" --docker="docker" --docker_kill_orphans="true"
--docker_registry="https://registry-1.docker.io" --docker_remove_delay="6hrs" --docker_socket="/var/run/docker.sock"
--docker_stop_timeout="0ns" --docker_store_dir="/tmp/Endpoint_SlaveEndpointTest_NoAuthorizer_1_7V6qnp/store/docker"
--docker_volume_checkpoint_dir="/var/run/mesos/isolators/docker/volume" --enforce_container_disk_quota="false"
--executor_registration_timeout="1mins" --executor_reregistration_timeout="2secs" --executor_shutdown_grace_period="5secs"
--fetcher_cache_dir="/tmp/Endpoint_SlaveEndpointTest_NoAuthorizer_1_7V6qnp/fetch" --fetcher_cache_size="2GB"
--frameworks_home="" --gc_delay="1weeks" --gc_disk_headroom="0.1" --hadoop_home="" --help="false"
--hostname_lookup="true" --http_command_executor="false" --http_credentials="/tmp/Endpoint_SlaveEndpointTest_NoAuthorizer_1_7V6qnp/http_credentials"
--http_heartbeat_interval="30secs" --initialize_driver_logging="true" --isolation="posix/cpu,posix/mem"
--launcher="posix" --launcher_dir="/mesos/mesos-1.4.0/_build/src" --logbufsecs="0" --logging_level="INFO"
--max_completed_executors_per_framework="150" --oversubscribed_resources_interval="15secs"
--perf_duration="10secs" --perf_interval="1mins" --port="5051" --qos_correction_interval_min="0ns"
--quiet="false" --recover="reconnect" --recovery_timeout="15mins" --registration_backoff_factor="10ms"
--resources="cpus:2;gpus:0;mem:1024;disk:1024;ports:[31000-32000]" --revocable_cpu_low_priority="true"
--runtime_dir="/tmp/Endpoint_SlaveEndpointTest_NoAuthorizer_1_7V6qnp" --sandbox_directory="/mnt/mesos/sandbox"
--strict="true" --switch_user="true" --systemd_enable_support="true" --systemd_runtime_directory="/run/systemd/system"
--version="false" --work_dir="/tmp/Endpoint_SlaveEndpointTest_NoAuthorizer_1_RQ2OiO"
I0709 06:28:33.334247  4988 credentials.hpp:86] Loading credential for authentication from
'/tmp/Endpoint_SlaveEndpointTest_NoAuthorizer_1_7V6qnp/credential'
I0709 06:28:33.334751  4988 slave.cpp:283] Agent using credential for: test-principal
I0709 06:28:33.335027  4988 credentials.hpp:37] Loading credentials for authentication from
'/tmp/Endpoint_SlaveEndpointTest_NoAuthorizer_1_7V6qnp/http_credentials'
I0709 06:28:33.335683  4988 http.cpp:976] Creating default 'basic' HTTP authenticator for
realm 'mesos-agent-readonly'
I0709 06:28:33.336140  4988 http.cpp:976] Creating default 'basic' HTTP authenticator for
realm 'mesos-agent-readwrite'
I0709 06:28:33.338989  4988 slave.cpp:565] Agent resources: [{"name":"cpus","scalar":{"value":2.0},"type":"SCALAR"},{"name":"mem","scalar":{"value":1024.0},"type":"SCALAR"},{"name":"disk","scalar":{"value":1024.0},"type":"SCALAR"},{"name":"ports","ranges":{"range":[{"begin":31000,"end":32000}]},"type":"RANGES"}]
I0709 06:28:33.339469  4988 slave.cpp:573] Agent attributes: [  ]
I0709 06:28:33.339491  4988 slave.cpp:578] Agent hostname: 2cb02656c33f
I0709 06:28:33.339983  4990 status_update_manager.cpp:177] Pausing sending status updates
I0709 06:28:33.342500  4988 state.cpp:64] Recovering state from '/tmp/Endpoint_SlaveEndpointTest_NoAuthorizer_1_RQ2OiO/meta'
I0709 06:28:33.343353  4991 status_update_manager.cpp:203] Recovering status update manager
I0709 06:28:33.344517  4991 containerizer.cpp:582] Recovering containerizer
I0709 06:28:33.348486  4991 provisioner.cpp:416] Provisioner recovery complete
I0709 06:28:33.350116  4990 slave.cpp:6203] Finished recovery
I0709 06:28:33.350772  4990 slave.cpp:6385] Querying resource estimator for oversubscribable
resources
I0709 06:28:33.351258  4986 slave.cpp:6399] Received oversubscribable resources {} from the
resource estimator
I0709 06:28:33.357893  4988 process.cpp:3810] Handling HTTP event for process 'slave(783)'
with path: '/slave(783)/monitor/statistics.json'
I0709 06:28:33.361474  4990 http.cpp:1116] HTTP GET for /slave(783)/monitor/statistics.json
from 172.17.0.2:48026
I0709 06:28:33.361624  4990 http.cpp:937] Authorizing principal 'test-principal' to GET the
'/monitor/statistics.json' endpoint
I0709 06:28:33.371186  4986 slave.cpp:839] Agent terminating
[       OK ] Endpoint/SlaveEndpointTest.NoAuthorizer/1 (79 ms)
[ RUN      ] Endpoint/SlaveEndpointTest.NoAuthorizer/2
I0709 06:28:33.393311  4966 containerizer.cpp:230] Using isolation: posix/cpu,posix/mem,filesystem/posix,network/cni,environment_secret
W0709 06:28:33.394296  4966 backend.cpp:76] Failed to create 'overlay' backend: OverlayBackend
requires root privileges
W0709 06:28:33.394518  4966 backend.cpp:76] Failed to create 'bind' backend: BindBackend requires
root privileges
I0709 06:28:33.394577  4966 provisioner.cpp:255] Using default backend 'copy'
I0709 06:28:33.399544  4966 cluster.cpp:448] Creating default 'local' authorizer
I0709 06:28:33.405081  4987 slave.cpp:250] Mesos agent started on (784)@172.17.0.2:35827
I0709 06:28:33.405131  4987 slave.cpp:251] Flags at startup: --acls="" --appc_simple_discovery_uri_prefix="http://"
--appc_store_dir="/tmp/Endpoint_SlaveEndpointTest_NoAuthorizer_2_t5r7nO/store/appc" --authenticate_http_readonly="true"
--authenticate_http_readwrite="true" --authenticatee="crammd5" --authentication_backoff_factor="1secs"
--authorizer="local" --cgroups_cpu_enable_pids_and_tids_count="false" --cgroups_enable_cfs="false"
--cgroups_hierarchy="/sys/fs/cgroup" --cgroups_limit_swap="false" --cgroups_root="mesos" --container_disk_watch_interval="15secs"
--containerizers="mesos" --credential="/tmp/Endpoint_SlaveEndpointTest_NoAuthorizer_2_t5r7nO/credential"
--default_role="*" --disk_watch_interval="1mins" --docker="docker" --docker_kill_orphans="true"
--docker_registry="https://registry-1.docker.io" --docker_remove_delay="6hrs" --docker_socket="/var/run/docker.sock"
--docker_stop_timeout="0ns" --docker_store_dir="/tmp/Endpoint_SlaveEndpointTest_NoAuthorizer_2_t5r7nO/store/docker"
--docker_volume_checkpoint_dir="/var/run/mesos/isolators/docker/volume" --enforce_container_disk_quota="false"
--executor_registration_timeout="1mins" --executor_reregistration_timeout="2secs" --executor_shutdown_grace_period="5secs"
--fetcher_cache_dir="/tmp/Endpoint_SlaveEndpointTest_NoAuthorizer_2_t5r7nO/fetch" --fetcher_cache_size="2GB"
--frameworks_home="" --gc_delay="1weeks" --gc_disk_headroom="0.1" --hadoop_home="" --help="false"
--hostname_lookup="true" --http_command_executor="false" --http_credentials="/tmp/Endpoint_SlaveEndpointTest_NoAuthorizer_2_t5r7nO/http_credentials"
--http_heartbeat_interval="30secs" --initialize_driver_logging="true" --isolation="posix/cpu,posix/mem"
--launcher="posix" --launcher_dir="/mesos/mesos-1.4.0/_build/src" --logbufsecs="0" --logging_level="INFO"
--max_completed_executors_per_framework="150" --oversubscribed_resources_interval="15secs"
--perf_duration="10secs" --perf_interval="1mins" --port="5051" --qos_correction_interval_min="0ns"
--quiet="false" --recover="reconnect" --recovery_timeout="15mins" --registration_backoff_factor="10ms"
--resources="cpus:2;gpus:0;mem:1024;disk:1024;ports:[31000-32000]" --revocable_cpu_low_priority="true"
--runtime_dir="/tmp/Endpoint_SlaveEndpointTest_NoAuthorizer_2_t5r7nO" --sandbox_directory="/mnt/mesos/sandbox"
--strict="true" --switch_user="true" --systemd_enable_support="true" --systemd_runtime_directory="/run/systemd/system"
--version="false" --work_dir="/tmp/Endpoint_SlaveEndpointTest_NoAuthorizer_2_V8iQ6c"
I0709 06:28:33.405985  4987 credentials.hpp:86] Loading credential for authentication from
'/tmp/Endpoint_SlaveEndpointTest_NoAuthorizer_2_t5r7nO/credential'
I0709 06:28:33.406309  4987 slave.cpp:283] Agent using credential for: test-principal
I0709 06:28:33.406395  4987 credentials.hpp:37] Loading credentials for authentication from
'/tmp/Endpoint_SlaveEndpointTest_NoAuthorizer_2_t5r7nO/http_credentials'
I0709 06:28:33.406870  4987 http.cpp:976] Creating default 'basic' HTTP authenticator for
realm 'mesos-agent-readonly'
I0709 06:28:33.407207  4987 http.cpp:976] Creating default 'basic' HTTP authenticator for
realm 'mesos-agent-readwrite'
I0709 06:28:33.410604  4987 slave.cpp:565] Agent resources: [{"name":"cpus","scalar":{"value":2.0},"type":"SCALAR"},{"name":"mem","scalar":{"value":1024.0},"type":"SCALAR"},{"name":"disk","scalar":{"value":1024.0},"type":"SCALAR"},{"name":"ports","ranges":{"range":[{"begin":31000,"end":32000}]},"type":"RANGES"}]
I0709 06:28:33.411082  4987 slave.cpp:573] Agent attributes: [  ]
I0709 06:28:33.411109  4987 slave.cpp:578] Agent hostname: 2cb02656c33f
I0709 06:28:33.411509  4986 status_update_manager.cpp:177] Pausing sending status updates
I0709 06:28:33.414669  4989 state.cpp:64] Recovering state from '/tmp/Endpoint_SlaveEndpointTest_NoAuthorizer_2_V8iQ6c/meta'
I0709 06:28:33.415518  4990 status_update_manager.cpp:203] Recovering status update manager
I0709 06:28:33.415947  4987 containerizer.cpp:582] Recovering containerizer
I0709 06:28:33.422308  4987 provisioner.cpp:416] Provisioner recovery complete
I0709 06:28:33.423094  4992 slave.cpp:6203] Finished recovery
I0709 06:28:33.423895  4992 slave.cpp:6385] Querying resource estimator for oversubscribable
resources
I0709 06:28:33.424535  4991 slave.cpp:6399] Received oversubscribable resources {} from the
resource estimator
I0709 06:28:33.444114  4985 process.cpp:3810] Handling HTTP event for process 'slave(784)'
with path: '/slave(784)/containers'
I0709 06:28:33.447335  4990 http.cpp:1116] HTTP GET for /slave(784)/containers from 172.17.0.2:48028
I0709 06:28:33.447525  4990 http.cpp:937] Authorizing principal 'test-principal' to GET the
'/containers' endpoint
I0709 06:28:33.458113  4966 slave.cpp:839] Agent terminating
[       OK ] Endpoint/SlaveEndpointTest.NoAuthorizer/2 (95 ms)
[----------] 9 tests from Endpoint/SlaveEndpointTest (685 ms total)

[----------] Global test environment tear-down
[==========] 1627 tests from 179 test cases ran. (858470 ms total)
[  PASSED  ] 1622 tests.
[  FAILED  ] 5 tests, listed below:
[  FAILED  ] DefaultExecutorCheckTest.CommandCheckDeliveredAndReconciled
[  FAILED  ] DefaultExecutorCheckTest.CommandCheckStatusChange
[  FAILED  ] DefaultExecutorCheckTest.CommandCheckSeesParentsEnv
[  FAILED  ] DefaultExecutorCheckTest.CommandCheckSharesWorkDirWithTask
[  FAILED  ] ReconciliationTest.RemovalInProgress

 5 FAILED TESTS
  YOU HAVE 20 DISABLED TESTS

I0709 06:28:33.636569  4993 process.cpp:988] Failed to accept socket: future discarded
make[4]: *** [check-local] Error 1
make[4]: Leaving directory `/mesos/mesos-1.4.0/_build/src'
make[3]: *** [check-am] Error 2
make[3]: Leaving directory `/mesos/mesos-1.4.0/_build/src'
make[2]: *** [check] Error 2
make[2]: Leaving directory `/mesos/mesos-1.4.0/_build/src'
make[1]: *** [check-recursive] Error 1
make[1]: Leaving directory `/mesos/mesos-1.4.0/_build'
make: *** [distcheck] Error 1
+ docker rmi mesos-1499573917-17829
Untagged: mesos-1499573917-17829:latest
Deleted: sha256:936f9fefccb1d2341d9e5ac330eeae54d01202766a20096a73cf9993777ae16e
Deleted: sha256:0827d4c55ca5707dc1365f77e987e171d575fc05150b620ca6a65afc8a8dc82e
Deleted: sha256:1f0e4a56c54f2283345d45c50ec53d5338e044ef30ce76b36788dd0a3117d116
Deleted: sha256:4c0b08b49dd440c66bafd1679984da3d18918bfb71924cd019a24c1e7788c6a0
Deleted: sha256:6d2564a8aed8fe6638fe9a760d6205fa3611cb79c3908d81717d50c6206429ab
Deleted: sha256:2615a1cd192ad853a066ca76e45ca4e5506bc8a273a3a0bab25de1cb103abd87
Deleted: sha256:83434764c8e950258e7ffdd7b27b47dc1bfa3c8e64c2163aef8e165d6232283d
Deleted: sha256:27533ac071f11e77f524032564216bfa38a99382dc43a7dc47e0bfda51d0e786
Deleted: sha256:846004dd0ac476070c11cef964fa6865c673100e6b7a4f76be1e55a0a9c17f5c
Deleted: sha256:3c9c7aebfaf501414558bb4684d0845d9492440187a7007b8e65daad90b6aa60
Deleted: sha256:478bed1e171eda897a3659119a1b11877d6760b7862c9dd53998abee2290f98e
Deleted: sha256:d6d16a2a2d961c847c521292e41690df5ad93b2f61740e3b0f1a2b1203e8d177
Deleted: sha256:c298e88d98a9dd4dcc889e2efe300850ed31b4181c8968f848a2d371f4bcc2a8
Deleted: sha256:169fcb0f855b4129b55659d4a3d795f8c68792f9b88323ff0d8d39b015857bd9
Deleted: sha256:5d25b482328b0b12e4fbe803bfbff9d0a154fd2758f07d0bb8653c29752903c5
Deleted: sha256:cb795a801b5e6ce85751a3ccb64595b26489428f2e9fbfadd7d4669a48f30a08
Deleted: sha256:03f3aae38834e96e446ac82e8e592b5a9cb4eed38f109f598ef92dcd8cd4639c
Deleted: sha256:a15bfd45ca9fa3fac41808f239f328454c26d4a9833ec7abc9922770a1ba14e2
Deleted: sha256:50e3ef0c080d970fb1e9cabdc23b6b0ea22a8f5dc509f2b79fd191288639696a
Deleted: sha256:24d47e05ba1f1b3d7f0a0f67227bb42c8a66aa7eacda3f32b960dd5eca4c41fe
Deleted: sha256:37aa914aae3a0b41bdae16e2a8e7a13df8523306ac3d4fa0c5f2d17bc3728bd8
Deleted: sha256:ac920d3ad1a6ba0776895c4dbb062e45783e44563a60ccd2673f6dc346d7d55d
Deleted: sha256:31979cabb2eec9fd30f1bbae8912dd278de2a2a8595c9fb2639a79d6c464ec58
Deleted: sha256:45b30b7c34f4294563a8416c3ec1cc009f1ac598d0ba6cd9363a73abcdc243fa
Build step 'Execute shell' marked build as failure

Mime
View raw message