mesos-builds mailing list archives

Site index · List index
Message view « Date » · « Thread »
Top « Date » · « Thread »
From Apache Jenkins Server <jenk...@builds.apache.org>
Subject Build failed in Jenkins: Mesos-Reviewbot #18481
Date Wed, 12 Jul 2017 03:57:05 GMT
See <https://builds.apache.org/job/Mesos-Reviewbot/18481/display/redirect?page=changes>

Changes:

[zhq527725] Fixed a typo in CNI isolator test.

------------------------------------------
[...truncated 29.98 MB...]
W0712 03:56:58.730821  4993 backend.cpp:76] Failed to create 'overlay' backend: OverlayBackend
requires root privileges
W0712 03:56:58.731262  4993 backend.cpp:76] Failed to create 'bind' backend: BindBackend requires
root privileges
I0712 03:56:58.731503  4993 provisioner.cpp:255] Using default backend 'copy'
I0712 03:56:58.738692  5017 slave.cpp:250] Mesos agent started on (787)@172.17.0.2:46111
I0712 03:56:58.738735  5017 slave.cpp:251] Flags at startup: --acls="" --appc_simple_discovery_uri_prefix="http://"
--appc_store_dir="/tmp/Endpoint_SlaveEndpointTest_AuthorizedRequest_2_MJFnli/store/appc" --authenticate_http_readonly="true"
--authenticate_http_readwrite="true" --authenticatee="crammd5" --authentication_backoff_factor="1secs"
--authorizer="local" --cgroups_cpu_enable_pids_and_tids_count="false" --cgroups_enable_cfs="false"
--cgroups_hierarchy="/sys/fs/cgroup" --cgroups_limit_swap="false" --cgroups_root="mesos" --container_disk_watch_interval="15secs"
--containerizers="mesos" --credential="/tmp/Endpoint_SlaveEndpointTest_AuthorizedRequest_2_MJFnli/credential"
--default_role="*" --disk_watch_interval="1mins" --docker="docker" --docker_kill_orphans="true"
--docker_registry="https://registry-1.docker.io" --docker_remove_delay="6hrs" --docker_socket="/var/run/docker.sock"
--docker_stop_timeout="0ns" --docker_store_dir="/tmp/Endpoint_SlaveEndpointTest_AuthorizedRequest_2_MJFnli/store/docker"
--docker_volume_checkpoint_dir="/var/run/mesos/isolators/docker/volume" --enforce_container_disk_quota="false"
--executor_registration_timeout="1mins" --executor_reregistration_timeout="2secs" --executor_shutdown_grace_period="5secs"
--fetcher_cache_dir="/tmp/Endpoint_SlaveEndpointTest_AuthorizedRequest_2_MJFnli/fetch" --fetcher_cache_size="2GB"
--frameworks_home="" --gc_delay="1weeks" --gc_disk_headroom="0.1" --hadoop_home="" --help="false"
--hostname_lookup="true" --http_command_executor="false" --http_credentials="/tmp/Endpoint_SlaveEndpointTest_AuthorizedRequest_2_MJFnli/http_credentials"
--http_heartbeat_interval="30secs" --initialize_driver_logging="true" --isolation="posix/cpu,posix/mem"
--launcher="posix" --launcher_dir="/mesos/mesos-1.4.0/_build/src" --logbufsecs="0" --logging_level="INFO"
--max_completed_executors_per_framework="150" --oversubscribed_resources_interval="15secs"
--perf_duration="10secs" --perf_interval="1mins" --port="5051" --qos_correction_interval_min="0ns"
--quiet="false" --recover="reconnect" --recovery_timeout="15mins" --registration_backoff_factor="10ms"
--resources="cpus:2;gpus:0;mem:1024;disk:1024;ports:[31000-32000]" --revocable_cpu_low_priority="true"
--runtime_dir="/tmp/Endpoint_SlaveEndpointTest_AuthorizedRequest_2_MJFnli" --sandbox_directory="/mnt/mesos/sandbox"
--strict="true" --switch_user="true" --systemd_enable_support="true" --systemd_runtime_directory="/run/systemd/system"
--version="false" --work_dir="/tmp/Endpoint_SlaveEndpointTest_AuthorizedRequest_2_XHnmTw"
I0712 03:56:58.739763  5017 credentials.hpp:86] Loading credential for authentication from
'/tmp/Endpoint_SlaveEndpointTest_AuthorizedRequest_2_MJFnli/credential'
I0712 03:56:58.740144  5017 slave.cpp:283] Agent using credential for: test-principal
I0712 03:56:58.740170  5017 credentials.hpp:37] Loading credentials for authentication from
'/tmp/Endpoint_SlaveEndpointTest_AuthorizedRequest_2_MJFnli/http_credentials'
I0712 03:56:58.740679  5017 http.cpp:1009] Creating default 'basic' HTTP authenticator for
realm 'mesos-agent-readonly'
I0712 03:56:58.741040  5017 http.cpp:1009] Creating default 'basic' HTTP authenticator for
realm 'mesos-agent-readwrite'
I0712 03:56:58.743434  5017 slave.cpp:565] Agent resources: [{"name":"cpus","scalar":{"value":2.0},"type":"SCALAR"},{"name":"mem","scalar":{"value":1024.0},"type":"SCALAR"},{"name":"disk","scalar":{"value":1024.0},"type":"SCALAR"},{"name":"ports","ranges":{"range":[{"begin":31000,"end":32000}]},"type":"RANGES"}]
I0712 03:56:58.743903  5017 slave.cpp:573] Agent attributes: [  ]
I0712 03:56:58.743926  5017 slave.cpp:582] Agent hostname: dff38a2bd0f3
I0712 03:56:58.744179  5015 status_update_manager.cpp:177] Pausing sending status updates
I0712 03:56:58.746552  5015 state.cpp:64] Recovering state from '/tmp/Endpoint_SlaveEndpointTest_AuthorizedRequest_2_XHnmTw/meta'
I0712 03:56:58.746922  5018 status_update_manager.cpp:203] Recovering status update manager
I0712 03:56:58.747342  5014 containerizer.cpp:582] Recovering containerizer
I0712 03:56:58.750385  5014 provisioner.cpp:416] Provisioner recovery complete
I0712 03:56:58.751721  5017 slave.cpp:6207] Finished recovery
I0712 03:56:58.752727  5017 slave.cpp:6389] Querying resource estimator for oversubscribable
resources
I0712 03:56:58.753154  5018 slave.cpp:6403] Received oversubscribable resources {} from the
resource estimator
I0712 03:56:58.758185  5018 process.cpp:3820] Handling HTTP event for process 'slave(787)'
with path: '/slave(787)/containers'
I0712 03:56:58.760684  5018 http.cpp:1149] HTTP GET for /slave(787)/containers from 172.17.0.2:51934
I0712 03:56:58.760880  5018 http.cpp:970] Authorizing principal 'test-principal' to GET the
'/containers' endpoint
I0712 03:56:58.767699  5013 slave.cpp:843] Agent terminating
[       OK ] Endpoint/SlaveEndpointTest.AuthorizedRequest/2 (55 ms)
[ RUN      ] Endpoint/SlaveEndpointTest.UnauthorizedRequest/0
I0712 03:56:58.783958  4993 containerizer.cpp:230] Using isolation: posix/cpu,posix/mem,filesystem/posix,network/cni,environment_secret
W0712 03:56:58.785059  4993 backend.cpp:76] Failed to create 'overlay' backend: OverlayBackend
requires root privileges
W0712 03:56:58.785486  4993 backend.cpp:76] Failed to create 'bind' backend: BindBackend requires
root privileges
I0712 03:56:58.785797  4993 provisioner.cpp:255] Using default backend 'copy'
I0712 03:56:58.792382  5012 slave.cpp:250] Mesos agent started on (788)@172.17.0.2:46111
I0712 03:56:58.792423  5012 slave.cpp:251] Flags at startup: --acls="" --appc_simple_discovery_uri_prefix="http://"
--appc_store_dir="/tmp/Endpoint_SlaveEndpointTest_UnauthorizedRequest_0_UTHJDm/store/appc"
--authenticate_http_readonly="true" --authenticate_http_readwrite="true" --authenticatee="crammd5"
--authentication_backoff_factor="1secs" --authorizer="local" --cgroups_cpu_enable_pids_and_tids_count="false"
--cgroups_enable_cfs="false" --cgroups_hierarchy="/sys/fs/cgroup" --cgroups_limit_swap="false"
--cgroups_root="mesos" --container_disk_watch_interval="15secs" --containerizers="mesos" --credential="/tmp/Endpoint_SlaveEndpointTest_UnauthorizedRequest_0_UTHJDm/credential"
--default_role="*" --disk_watch_interval="1mins" --docker="docker" --docker_kill_orphans="true"
--docker_registry="https://registry-1.docker.io" --docker_remove_delay="6hrs" --docker_socket="/var/run/docker.sock"
--docker_stop_timeout="0ns" --docker_store_dir="/tmp/Endpoint_SlaveEndpointTest_UnauthorizedRequest_0_UTHJDm/store/docker"
--docker_volume_checkpoint_dir="/var/run/mesos/isolators/docker/volume" --enforce_container_disk_quota="false"
--executor_registration_timeout="1mins" --executor_reregistration_timeout="2secs" --executor_shutdown_grace_period="5secs"
--fetcher_cache_dir="/tmp/Endpoint_SlaveEndpointTest_UnauthorizedRequest_0_UTHJDm/fetch" --fetcher_cache_size="2GB"
--frameworks_home="" --gc_delay="1weeks" --gc_disk_headroom="0.1" --hadoop_home="" --help="false"
--hostname_lookup="true" --http_command_executor="false" --http_credentials="/tmp/Endpoint_SlaveEndpointTest_UnauthorizedRequest_0_UTHJDm/http_credentials"
--http_heartbeat_interval="30secs" --initialize_driver_logging="true" --isolation="posix/cpu,posix/mem"
--launcher="posix" --launcher_dir="/mesos/mesos-1.4.0/_build/src" --logbufsecs="0" --logging_level="INFO"
--max_completed_executors_per_framework="150" --oversubscribed_resources_interval="15secs"
--perf_duration="10secs" --perf_interval="1mins" --port="5051" --qos_correction_interval_min="0ns"
--quiet="false" --recover="reconnect" --recovery_timeout="15mins" --registration_backoff_factor="10ms"
--resources="cpus:2;gpus:0;mem:1024;disk:1024;ports:[31000-32000]" --revocable_cpu_low_priority="true"
--runtime_dir="/tmp/Endpoint_SlaveEndpointTest_UnauthorizedRequest_0_UTHJDm" --sandbox_directory="/mnt/mesos/sandbox"
--strict="true" --switch_user="true" --systemd_enable_support="true" --systemd_runtime_directory="/run/systemd/system"
--version="false" --work_dir="/tmp/Endpoint_SlaveEndpointTest_UnauthorizedRequest_0_XD4T2A"
I0712 03:56:58.793115  5012 credentials.hpp:86] Loading credential for authentication from
'/tmp/Endpoint_SlaveEndpointTest_UnauthorizedRequest_0_UTHJDm/credential'
I0712 03:56:58.793365  5012 slave.cpp:283] Agent using credential for: test-principal
I0712 03:56:58.793390  5012 credentials.hpp:37] Loading credentials for authentication from
'/tmp/Endpoint_SlaveEndpointTest_UnauthorizedRequest_0_UTHJDm/http_credentials'
I0712 03:56:58.793743  5012 http.cpp:1009] Creating default 'basic' HTTP authenticator for
realm 'mesos-agent-readonly'
I0712 03:56:58.793990  5012 http.cpp:1009] Creating default 'basic' HTTP authenticator for
realm 'mesos-agent-readwrite'
I0712 03:56:58.796167  5012 slave.cpp:565] Agent resources: [{"name":"cpus","scalar":{"value":2.0},"type":"SCALAR"},{"name":"mem","scalar":{"value":1024.0},"type":"SCALAR"},{"name":"disk","scalar":{"value":1024.0},"type":"SCALAR"},{"name":"ports","ranges":{"range":[{"begin":31000,"end":32000}]},"type":"RANGES"}]
I0712 03:56:58.796617  5012 slave.cpp:573] Agent attributes: [  ]
I0712 03:56:58.796639  5012 slave.cpp:582] Agent hostname: dff38a2bd0f3
I0712 03:56:58.799145  5012 status_update_manager.cpp:177] Pausing sending status updates
I0712 03:56:58.799687  5015 state.cpp:64] Recovering state from '/tmp/Endpoint_SlaveEndpointTest_UnauthorizedRequest_0_XD4T2A/meta'
I0712 03:56:58.800325  5015 status_update_manager.cpp:203] Recovering status update manager
I0712 03:56:58.800655  5013 containerizer.cpp:582] Recovering containerizer
I0712 03:56:58.802943  5015 provisioner.cpp:416] Provisioner recovery complete
I0712 03:56:58.803782  5012 slave.cpp:6207] Finished recovery
I0712 03:56:58.804539  5012 slave.cpp:6389] Querying resource estimator for oversubscribable
resources
I0712 03:56:58.805050  5012 slave.cpp:6403] Received oversubscribable resources {} from the
resource estimator
I0712 03:56:58.809976  5018 process.cpp:3820] Handling HTTP event for process 'slave(788)'
with path: '/slave(788)/monitor/statistics'
I0712 03:56:58.812077  5016 http.cpp:1149] HTTP GET for /slave(788)/monitor/statistics from
172.17.0.2:51936
I0712 03:56:58.812204  5016 http.cpp:970] Authorizing principal 'test-principal' to GET the
'/monitor/statistics' endpoint
I0712 03:56:58.816918  5012 slave.cpp:843] Agent terminating
[       OK ] Endpoint/SlaveEndpointTest.UnauthorizedRequest/0 (49 ms)
[ RUN      ] Endpoint/SlaveEndpointTest.UnauthorizedRequest/1
I0712 03:56:58.833292  4993 containerizer.cpp:230] Using isolation: posix/cpu,posix/mem,filesystem/posix,network/cni,environment_secret
W0712 03:56:58.834396  4993 backend.cpp:76] Failed to create 'overlay' backend: OverlayBackend
requires root privileges
W0712 03:56:58.834812  4993 backend.cpp:76] Failed to create 'bind' backend: BindBackend requires
root privileges
I0712 03:56:58.835032  4993 provisioner.cpp:255] Using default backend 'copy'
I0712 03:56:58.841639  5013 slave.cpp:250] Mesos agent started on (789)@172.17.0.2:46111
I0712 03:56:58.841682  5013 slave.cpp:251] Flags at startup: --acls="" --appc_simple_discovery_uri_prefix="http://"
--appc_store_dir="/tmp/Endpoint_SlaveEndpointTest_UnauthorizedRequest_1_UJVtsr/store/appc"
--authenticate_http_readonly="true" --authenticate_http_readwrite="true" --authenticatee="crammd5"
--authentication_backoff_factor="1secs" --authorizer="local" --cgroups_cpu_enable_pids_and_tids_count="false"
--cgroups_enable_cfs="false" --cgroups_hierarchy="/sys/fs/cgroup" --cgroups_limit_swap="false"
--cgroups_root="mesos" --container_disk_watch_interval="15secs" --containerizers="mesos" --credential="/tmp/Endpoint_SlaveEndpointTest_UnauthorizedRequest_1_UJVtsr/credential"
--default_role="*" --disk_watch_interval="1mins" --docker="docker" --docker_kill_orphans="true"
--docker_registry="https://registry-1.docker.io" --docker_remove_delay="6hrs" --docker_socket="/var/run/docker.sock"
--docker_stop_timeout="0ns" --docker_store_dir="/tmp/Endpoint_SlaveEndpointTest_UnauthorizedRequest_1_UJVtsr/store/docker"
--docker_volume_checkpoint_dir="/var/run/mesos/isolators/docker/volume" --enforce_container_disk_quota="false"
--executor_registration_timeout="1mins" --executor_reregistration_timeout="2secs" --executor_shutdown_grace_period="5secs"
--fetcher_cache_dir="/tmp/Endpoint_SlaveEndpointTest_UnauthorizedRequest_1_UJVtsr/fetch" --fetcher_cache_size="2GB"
--frameworks_home="" --gc_delay="1weeks" --gc_disk_headroom="0.1" --hadoop_home="" --help="false"
--hostname_lookup="true" --http_command_executor="false" --http_credentials="/tmp/Endpoint_SlaveEndpointTest_UnauthorizedRequest_1_UJVtsr/http_credentials"
--http_heartbeat_interval="30secs" --initialize_driver_logging="true" --isolation="posix/cpu,posix/mem"
--launcher="posix" --launcher_dir="/mesos/mesos-1.4.0/_build/src" --logbufsecs="0" --logging_level="INFO"
--max_completed_executors_per_framework="150" --oversubscribed_resources_interval="15secs"
--perf_duration="10secs" --perf_interval="1mins" --port="5051" --qos_correction_interval_min="0ns"
--quiet="false" --recover="reconnect" --recovery_timeout="15mins" --registration_backoff_factor="10ms"
--resources="cpus:2;gpus:0;mem:1024;disk:1024;ports:[31000-32000]" --revocable_cpu_low_priority="true"
--runtime_dir="/tmp/Endpoint_SlaveEndpointTest_UnauthorizedRequest_1_UJVtsr" --sandbox_directory="/mnt/mesos/sandbox"
--strict="true" --switch_user="true" --systemd_enable_support="true" --systemd_runtime_directory="/run/systemd/system"
--version="false" --work_dir="/tmp/Endpoint_SlaveEndpointTest_UnauthorizedRequest_1_r1tEJF"
I0712 03:56:58.842435  5013 credentials.hpp:86] Loading credential for authentication from
'/tmp/Endpoint_SlaveEndpointTest_UnauthorizedRequest_1_UJVtsr/credential'
I0712 03:56:58.842703  5013 slave.cpp:283] Agent using credential for: test-principal
I0712 03:56:58.842730  5013 credentials.hpp:37] Loading credentials for authentication from
'/tmp/Endpoint_SlaveEndpointTest_UnauthorizedRequest_1_UJVtsr/http_credentials'
I0712 03:56:58.843117  5013 http.cpp:1009] Creating default 'basic' HTTP authenticator for
realm 'mesos-agent-readonly'
I0712 03:56:58.843354  5013 http.cpp:1009] Creating default 'basic' HTTP authenticator for
realm 'mesos-agent-readwrite'
I0712 03:56:58.845731  5013 slave.cpp:565] Agent resources: [{"name":"cpus","scalar":{"value":2.0},"type":"SCALAR"},{"name":"mem","scalar":{"value":1024.0},"type":"SCALAR"},{"name":"disk","scalar":{"value":1024.0},"type":"SCALAR"},{"name":"ports","ranges":{"range":[{"begin":31000,"end":32000}]},"type":"RANGES"}]
I0712 03:56:58.846169  5013 slave.cpp:573] Agent attributes: [  ]
I0712 03:56:58.846189  5013 slave.cpp:582] Agent hostname: dff38a2bd0f3
I0712 03:56:58.846403  5014 status_update_manager.cpp:177] Pausing sending status updates
I0712 03:56:58.848376  5012 state.cpp:64] Recovering state from '/tmp/Endpoint_SlaveEndpointTest_UnauthorizedRequest_1_r1tEJF/meta'
I0712 03:56:58.849117  5014 status_update_manager.cpp:203] Recovering status update manager
I0712 03:56:58.849452  5014 containerizer.cpp:582] Recovering containerizer
I0712 03:56:58.852174  5014 provisioner.cpp:416] Provisioner recovery complete
I0712 03:56:58.852900  5016 slave.cpp:6207] Finished recovery
I0712 03:56:58.853801  5016 slave.cpp:6389] Querying resource estimator for oversubscribable
resources
I0712 03:56:58.854475  5016 slave.cpp:6403] Received oversubscribable resources {} from the
resource estimator
I0712 03:56:58.860443  5019 process.cpp:3820] Handling HTTP event for process 'slave(789)'
with path: '/slave(789)/monitor/statistics.json'
I0712 03:56:58.862957  5019 http.cpp:1149] HTTP GET for /slave(789)/monitor/statistics.json
from 172.17.0.2:51938
I0712 03:56:58.863083  5019 http.cpp:970] Authorizing principal 'test-principal' to GET the
'/monitor/statistics.json' endpoint
I0712 03:56:58.867667  4993 slave.cpp:843] Agent terminating
[       OK ] Endpoint/SlaveEndpointTest.UnauthorizedRequest/1 (50 ms)
[ RUN      ] Endpoint/SlaveEndpointTest.UnauthorizedRequest/2
I0712 03:56:58.884275  4993 containerizer.cpp:230] Using isolation: posix/cpu,posix/mem,filesystem/posix,network/cni,environment_secret
W0712 03:56:58.885345  4993 backend.cpp:76] Failed to create 'overlay' backend: OverlayBackend
requires root privileges
W0712 03:56:58.885789  4993 backend.cpp:76] Failed to create 'bind' backend: BindBackend requires
root privileges
I0712 03:56:58.886036  4993 provisioner.cpp:255] Using default backend 'copy'
I0712 03:56:58.891316  5014 slave.cpp:250] Mesos agent started on (790)@172.17.0.2:46111
I0712 03:56:58.891356  5014 slave.cpp:251] Flags at startup: --acls="" --appc_simple_discovery_uri_prefix="http://"
--appc_store_dir="/tmp/Endpoint_SlaveEndpointTest_UnauthorizedRequest_2_gLx2Nw/store/appc"
--authenticate_http_readonly="true" --authenticate_http_readwrite="true" --authenticatee="crammd5"
--authentication_backoff_factor="1secs" --authorizer="local" --cgroups_cpu_enable_pids_and_tids_count="false"
--cgroups_enable_cfs="false" --cgroups_hierarchy="/sys/fs/cgroup" --cgroups_limit_swap="false"
--cgroups_root="mesos" --container_disk_watch_interval="15secs" --containerizers="mesos" --credential="/tmp/Endpoint_SlaveEndpointTest_UnauthorizedRequest_2_gLx2Nw/credential"
--default_role="*" --disk_watch_interval="1mins" --docker="docker" --docker_kill_orphans="true"
--docker_registry="https://registry-1.docker.io" --docker_remove_delay="6hrs" --docker_socket="/var/run/docker.sock"
--docker_stop_timeout="0ns" --docker_store_dir="/tmp/Endpoint_SlaveEndpointTest_UnauthorizedRequest_2_gLx2Nw/store/docker"
--docker_volume_checkpoint_dir="/var/run/mesos/isolators/docker/volume" --enforce_container_disk_quota="false"
--executor_registration_timeout="1mins" --executor_reregistration_timeout="2secs" --executor_shutdown_grace_period="5secs"
--fetcher_cache_dir="/tmp/Endpoint_SlaveEndpointTest_UnauthorizedRequest_2_gLx2Nw/fetch" --fetcher_cache_size="2GB"
--frameworks_home="" --gc_delay="1weeks" --gc_disk_headroom="0.1" --hadoop_home="" --help="false"
--hostname_lookup="true" --http_command_executor="false" --http_credentials="/tmp/Endpoint_SlaveEndpointTest_UnauthorizedRequest_2_gLx2Nw/http_credentials"
--http_heartbeat_interval="30secs" --initialize_driver_logging="true" --isolation="posix/cpu,posix/mem"
--launcher="posix" --launcher_dir="/mesos/mesos-1.4.0/_build/src" --logbufsecs="0" --logging_level="INFO"
--max_completed_executors_per_framework="150" --oversubscribed_resources_interval="15secs"
--perf_duration="10secs" --perf_interval="1mins" --port="5051" --qos_correction_interval_min="0ns"
--quiet="false" --recover="reconnect" --recovery_timeout="15mins" --registration_backoff_factor="10ms"
--resources="cpus:2;gpus:0;mem:1024;disk:1024;ports:[31000-32000]" --revocable_cpu_low_priority="true"
--runtime_dir="/tmp/Endpoint_SlaveEndpointTest_UnauthorizedRequest_2_gLx2Nw" --sandbox_directory="/mnt/mesos/sandbox"
--strict="true" --switch_user="true" --systemd_enable_support="true" --systemd_runtime_directory="/run/systemd/system"
--version="false" --work_dir="/tmp/Endpoint_SlaveEndpointTest_UnauthorizedRequest_2_3KkWWK"
I0712 03:56:58.892304  5014 credentials.hpp:86] Loading credential for authentication from
'/tmp/Endpoint_SlaveEndpointTest_UnauthorizedRequest_2_gLx2Nw/credential'
I0712 03:56:58.892560  5014 slave.cpp:283] Agent using credential for: test-principal
I0712 03:56:58.892583  5014 credentials.hpp:37] Loading credentials for authentication from
'/tmp/Endpoint_SlaveEndpointTest_UnauthorizedRequest_2_gLx2Nw/http_credentials'
I0712 03:56:58.893187  5014 http.cpp:1009] Creating default 'basic' HTTP authenticator for
realm 'mesos-agent-readonly'
I0712 03:56:58.893489  5014 http.cpp:1009] Creating default 'basic' HTTP authenticator for
realm 'mesos-agent-readwrite'
I0712 03:56:58.895723  5014 slave.cpp:565] Agent resources: [{"name":"cpus","scalar":{"value":2.0},"type":"SCALAR"},{"name":"mem","scalar":{"value":1024.0},"type":"SCALAR"},{"name":"disk","scalar":{"value":1024.0},"type":"SCALAR"},{"name":"ports","ranges":{"range":[{"begin":31000,"end":32000}]},"type":"RANGES"}]
I0712 03:56:58.896154  5014 slave.cpp:573] Agent attributes: [  ]
I0712 03:56:58.896173  5014 slave.cpp:582] Agent hostname: dff38a2bd0f3
I0712 03:56:58.896397  5015 status_update_manager.cpp:177] Pausing sending status updates
I0712 03:56:58.898638  5018 state.cpp:64] Recovering state from '/tmp/Endpoint_SlaveEndpointTest_UnauthorizedRequest_2_3KkWWK/meta'
I0712 03:56:58.899384  5018 status_update_manager.cpp:203] Recovering status update manager
I0712 03:56:58.899747  5016 containerizer.cpp:582] Recovering containerizer
I0712 03:56:58.902434  5015 provisioner.cpp:416] Provisioner recovery complete
I0712 03:56:58.903048  5015 slave.cpp:6207] Finished recovery
I0712 03:56:58.903676  5015 slave.cpp:6389] Querying resource estimator for oversubscribable
resources
I0712 03:56:58.904194  5018 slave.cpp:6403] Received oversubscribable resources {} from the
resource estimator
I0712 03:56:58.909152  5019 process.cpp:3820] Handling HTTP event for process 'slave(790)'
with path: '/slave(790)/containers'
I0712 03:56:58.911463  5017 http.cpp:1149] HTTP GET for /slave(790)/containers from 172.17.0.2:51940
I0712 03:56:58.911589  5017 http.cpp:970] Authorizing principal 'test-principal' to GET the
'/containers' endpoint
I0712 03:56:58.915876  4993 slave.cpp:843] Agent terminating
[       OK ] Endpoint/SlaveEndpointTest.UnauthorizedRequest/2 (48 ms)
[ RUN      ] Endpoint/SlaveEndpointTest.NoAuthorizer/0
I0712 03:56:58.933264  4993 containerizer.cpp:230] Using isolation: posix/cpu,posix/mem,filesystem/posix,network/cni,environment_secret
W0712 03:56:58.934291  4993 backend.cpp:76] Failed to create 'overlay' backend: OverlayBackend
requires root privileges
W0712 03:56:58.934691  4993 backend.cpp:76] Failed to create 'bind' backend: BindBackend requires
root privileges
I0712 03:56:58.934922  4993 provisioner.cpp:255] Using default backend 'copy'
I0712 03:56:58.937644  4993 cluster.cpp:448] Creating default 'local' authorizer
I0712 03:56:58.940773  5013 slave.cpp:250] Mesos agent started on (791)@172.17.0.2:46111
I0712 03:56:58.940814  5013 slave.cpp:251] Flags at startup: --acls="" --appc_simple_discovery_uri_prefix="http://"
--appc_store_dir="/tmp/Endpoint_SlaveEndpointTest_NoAuthorizer_0_WkwiFC/store/appc" --authenticate_http_readonly="true"
--authenticate_http_readwrite="true" --authenticatee="crammd5" --authentication_backoff_factor="1secs"
--authorizer="local" --cgroups_cpu_enable_pids_and_tids_count="false" --cgroups_enable_cfs="false"
--cgroups_hierarchy="/sys/fs/cgroup" --cgroups_limit_swap="false" --cgroups_root="mesos" --container_disk_watch_interval="15secs"
--containerizers="mesos" --credential="/tmp/Endpoint_SlaveEndpointTest_NoAuthorizer_0_WkwiFC/credential"
--default_role="*" --disk_watch_interval="1mins" --docker="docker" --docker_kill_orphans="true"
--docker_registry="https://registry-1.docker.io" --docker_remove_delay="6hrs" --docker_socket="/var/run/docker.sock"
--docker_stop_timeout="0ns" --docker_store_dir="/tmp/Endpoint_SlaveEndpointTest_NoAuthorizer_0_WkwiFC/store/docker"
--docker_volume_checkpoint_dir="/var/run/mesos/isolators/docker/volume" --enforce_container_disk_quota="false"
--executor_registration_timeout="1mins" --executor_reregistration_timeout="2secs" --executor_shutdown_grace_period="5secs"
--fetcher_cache_dir="/tmp/Endpoint_SlaveEndpointTest_NoAuthorizer_0_WkwiFC/fetch" --fetcher_cache_size="2GB"
--frameworks_home="" --gc_delay="1weeks" --gc_disk_headroom="0.1" --hadoop_home="" --help="false"
--hostname_lookup="true" --http_command_executor="false" --http_credentials="/tmp/Endpoint_SlaveEndpointTest_NoAuthorizer_0_WkwiFC/http_credentials"
--http_heartbeat_interval="30secs" --initialize_driver_logging="true" --isolation="posix/cpu,posix/mem"
--launcher="posix" --launcher_dir="/mesos/mesos-1.4.0/_build/src" --logbufsecs="0" --logging_level="INFO"
--max_completed_executors_per_framework="150" --oversubscribed_resources_interval="15secs"
--perf_duration="10secs" --perf_interval="1mins" --port="5051" --qos_correction_interval_min="0ns"
--quiet="false" --recover="reconnect" --recovery_timeout="15mins" --registration_backoff_factor="10ms"
--resources="cpus:2;gpus:0;mem:1024;disk:1024;ports:[31000-32000]" --revocable_cpu_low_priority="true"
--runtime_dir="/tmp/Endpoint_SlaveEndpointTest_NoAuthorizer_0_WkwiFC" --sandbox_directory="/mnt/mesos/sandbox"
--strict="true" --switch_user="true" --systemd_enable_support="true" --systemd_runtime_directory="/run/systemd/system"
--version="false" --work_dir="/tmp/Endpoint_SlaveEndpointTest_NoAuthorizer_0_l0gkGQ"
I0712 03:56:58.941535  5013 credentials.hpp:86] Loading credential for authentication from
'/tmp/Endpoint_SlaveEndpointTest_NoAuthorizer_0_WkwiFC/credential'
I0712 03:56:58.941823  5013 slave.cpp:283] Agent using credential for: test-principal
I0712 03:56:58.941869  5013 credentials.hpp:37] Loading credentials for authentication from
'/tmp/Endpoint_SlaveEndpointTest_NoAuthorizer_0_WkwiFC/http_credentials'
I0712 03:56:58.942435  5013 http.cpp:1009] Creating default 'basic' HTTP authenticator for
realm 'mesos-agent-readonly'
I0712 03:56:58.942631  5013 http.cpp:1009] Creating default 'basic' HTTP authenticator for
realm 'mesos-agent-readwrite'
I0712 03:56:58.944939  5013 slave.cpp:565] Agent resources: [{"name":"cpus","scalar":{"value":2.0},"type":"SCALAR"},{"name":"mem","scalar":{"value":1024.0},"type":"SCALAR"},{"name":"disk","scalar":{"value":1024.0},"type":"SCALAR"},{"name":"ports","ranges":{"range":[{"begin":31000,"end":32000}]},"type":"RANGES"}]
I0712 03:56:58.945446  5013 slave.cpp:573] Agent attributes: [  ]
I0712 03:56:58.945468  5013 slave.cpp:582] Agent hostname: dff38a2bd0f3
I0712 03:56:58.945708  5012 status_update_manager.cpp:177] Pausing sending status updates
I0712 03:56:58.947645  5016 state.cpp:64] Recovering state from '/tmp/Endpoint_SlaveEndpointTest_NoAuthorizer_0_l0gkGQ/meta'
I0712 03:56:58.948492  5018 status_update_manager.cpp:203] Recovering status update manager
I0712 03:56:58.948869  5019 containerizer.cpp:582] Recovering containerizer
I0712 03:56:58.951063  5012 provisioner.cpp:416] Provisioner recovery complete
I0712 03:56:58.951900  5012 slave.cpp:6207] Finished recovery
I0712 03:56:58.952829  5012 slave.cpp:6389] Querying resource estimator for oversubscribable
resources
I0712 03:56:58.953402  5018 slave.cpp:6403] Received oversubscribable resources {} from the
resource estimator
I0712 03:56:58.957906  5017 process.cpp:3820] Handling HTTP event for process 'slave(791)'
with path: '/slave(791)/monitor/statistics'
I0712 03:56:58.960041  5018 http.cpp:1149] HTTP GET for /slave(791)/monitor/statistics from
172.17.0.2:51942
I0712 03:56:58.960175  5018 http.cpp:970] Authorizing principal 'test-principal' to GET the
'/monitor/statistics' endpoint
I0712 03:56:58.966245  5016 slave.cpp:843] Agent terminating
[       OK ] Endpoint/SlaveEndpointTest.NoAuthorizer/0 (49 ms)
[ RUN      ] Endpoint/SlaveEndpointTest.NoAuthorizer/1
I0712 03:56:58.982385  4993 containerizer.cpp:230] Using isolation: posix/cpu,posix/mem,filesystem/posix,network/cni,environment_secret
W0712 03:56:58.983398  4993 backend.cpp:76] Failed to create 'overlay' backend: OverlayBackend
requires root privileges
W0712 03:56:58.983793  4993 backend.cpp:76] Failed to create 'bind' backend: BindBackend requires
root privileges
I0712 03:56:58.983978  4993 provisioner.cpp:255] Using default backend 'copy'
I0712 03:56:58.987013  4993 cluster.cpp:448] Creating default 'local' authorizer
I0712 03:56:58.990767  5014 slave.cpp:250] Mesos agent started on (792)@172.17.0.2:46111
I0712 03:56:58.990809  5014 slave.cpp:251] Flags at startup: --acls="" --appc_simple_discovery_uri_prefix="http://"
--appc_store_dir="/tmp/Endpoint_SlaveEndpointTest_NoAuthorizer_1_WwJl2I/store/appc" --authenticate_http_readonly="true"
--authenticate_http_readwrite="true" --authenticatee="crammd5" --authentication_backoff_factor="1secs"
--authorizer="local" --cgroups_cpu_enable_pids_and_tids_count="false" --cgroups_enable_cfs="false"
--cgroups_hierarchy="/sys/fs/cgroup" --cgroups_limit_swap="false" --cgroups_root="mesos" --container_disk_watch_interval="15secs"
--containerizers="mesos" --credential="/tmp/Endpoint_SlaveEndpointTest_NoAuthorizer_1_WwJl2I/credential"
--default_role="*" --disk_watch_interval="1mins" --docker="docker" --docker_kill_orphans="true"
--docker_registry="https://registry-1.docker.io" --docker_remove_delay="6hrs" --docker_socket="/var/run/docker.sock"
--docker_stop_timeout="0ns" --docker_store_dir="/tmp/Endpoint_SlaveEndpointTest_NoAuthorizer_1_WwJl2I/store/docker"
--docker_volume_checkpoint_dir="/var/run/mesos/isolators/docker/volume" --enforce_container_disk_quota="false"
--executor_registration_timeout="1mins" --executor_reregistration_timeout="2secs" --executor_shutdown_grace_period="5secs"
--fetcher_cache_dir="/tmp/Endpoint_SlaveEndpointTest_NoAuthorizer_1_WwJl2I/fetch" --fetcher_cache_size="2GB"
--frameworks_home="" --gc_delay="1weeks" --gc_disk_headroom="0.1" --hadoop_home="" --help="false"
--hostname_lookup="true" --http_command_executor="false" --http_credentials="/tmp/Endpoint_SlaveEndpointTest_NoAuthorizer_1_WwJl2I/http_credentials"
--http_heartbeat_interval="30secs" --initialize_driver_logging="true" --isolation="posix/cpu,posix/mem"
--launcher="posix" --launcher_dir="/mesos/mesos-1.4.0/_build/src" --logbufsecs="0" --logging_level="INFO"
--max_completed_executors_per_framework="150" --oversubscribed_resources_interval="15secs"
--perf_duration="10secs" --perf_interval="1mins" --port="5051" --qos_correction_interval_min="0ns"
--quiet="false" --recover="reconnect" --recovery_timeout="15mins" --registration_backoff_factor="10ms"
--resources="cpus:2;gpus:0;mem:1024;disk:1024;ports:[31000-32000]" --revocable_cpu_low_priority="true"
--runtime_dir="/tmp/Endpoint_SlaveEndpointTest_NoAuthorizer_1_WwJl2I" --sandbox_directory="/mnt/mesos/sandbox"
--strict="true" --switch_user="true" --systemd_enable_support="true" --systemd_runtime_directory="/run/systemd/system"
--version="false" --work_dir="/tmp/Endpoint_SlaveEndpointTest_NoAuthorizer_1_haSqVW"
I0712 03:56:58.991698  5014 credentials.hpp:86] Loading credential for authentication from
'/tmp/Endpoint_SlaveEndpointTest_NoAuthorizer_1_WwJl2I/credential'
I0712 03:56:58.992076  5014 slave.cpp:283] Agent using credential for: test-principal
I0712 03:56:58.992101  5014 credentials.hpp:37] Loading credentials for authentication from
'/tmp/Endpoint_SlaveEndpointTest_NoAuthorizer_1_WwJl2I/http_credentials'
I0712 03:56:58.992522  5014 http.cpp:1009] Creating default 'basic' HTTP authenticator for
realm 'mesos-agent-readonly'
I0712 03:56:58.992821  5014 http.cpp:1009] Creating default 'basic' HTTP authenticator for
realm 'mesos-agent-readwrite'
I0712 03:56:58.995396  5014 slave.cpp:565] Agent resources: [{"name":"cpus","scalar":{"value":2.0},"type":"SCALAR"},{"name":"mem","scalar":{"value":1024.0},"type":"SCALAR"},{"name":"disk","scalar":{"value":1024.0},"type":"SCALAR"},{"name":"ports","ranges":{"range":[{"begin":31000,"end":32000}]},"type":"RANGES"}]
I0712 03:56:58.995944  5014 slave.cpp:573] Agent attributes: [  ]
I0712 03:56:58.995966  5014 slave.cpp:582] Agent hostname: dff38a2bd0f3
I0712 03:56:58.996227  5013 status_update_manager.cpp:177] Pausing sending status updates
I0712 03:56:58.998435  5014 state.cpp:64] Recovering state from '/tmp/Endpoint_SlaveEndpointTest_NoAuthorizer_1_haSqVW/meta'
I0712 03:56:58.999199  5019 status_update_manager.cpp:203] Recovering status update manager
I0712 03:56:58.999552  5019 containerizer.cpp:582] Recovering containerizer
I0712 03:56:59.001862  5019 provisioner.cpp:416] Provisioner recovery complete
I0712 03:56:59.002516  5012 slave.cpp:6207] Finished recovery
I0712 03:56:59.003185  5012 slave.cpp:6389] Querying resource estimator for oversubscribable
resources
I0712 03:56:59.003695  5017 slave.cpp:6403] Received oversubscribable resources {} from the
resource estimator
I0712 03:56:59.008054  5013 process.cpp:3820] Handling HTTP event for process 'slave(792)'
with path: '/slave(792)/monitor/statistics.json'
I0712 03:56:59.010170  5013 http.cpp:1149] HTTP GET for /slave(792)/monitor/statistics.json
from 172.17.0.2:51944
I0712 03:56:59.010299  5013 http.cpp:970] Authorizing principal 'test-principal' to GET the
'/monitor/statistics.json' endpoint
I0712 03:56:59.016022  5013 slave.cpp:843] Agent terminating
[       OK ] Endpoint/SlaveEndpointTest.NoAuthorizer/1 (49 ms)
[ RUN      ] Endpoint/SlaveEndpointTest.NoAuthorizer/2
I0712 03:56:59.032078  4993 containerizer.cpp:230] Using isolation: posix/cpu,posix/mem,filesystem/posix,network/cni,environment_secret
W0712 03:56:59.032902  4993 backend.cpp:76] Failed to create 'overlay' backend: OverlayBackend
requires root privileges
W0712 03:56:59.033342  4993 backend.cpp:76] Failed to create 'bind' backend: BindBackend requires
root privileges
I0712 03:56:59.033566  4993 provisioner.cpp:255] Using default backend 'copy'
I0712 03:56:59.036286  4993 cluster.cpp:448] Creating default 'local' authorizer
I0712 03:56:59.039358  5017 slave.cpp:250] Mesos agent started on (793)@172.17.0.2:46111
I0712 03:56:59.039398  5017 slave.cpp:251] Flags at startup: --acls="" --appc_simple_discovery_uri_prefix="http://"
--appc_store_dir="/tmp/Endpoint_SlaveEndpointTest_NoAuthorizer_2_WE0JVP/store/appc" --authenticate_http_readonly="true"
--authenticate_http_readwrite="true" --authenticatee="crammd5" --authentication_backoff_factor="1secs"
--authorizer="local" --cgroups_cpu_enable_pids_and_tids_count="false" --cgroups_enable_cfs="false"
--cgroups_hierarchy="/sys/fs/cgroup" --cgroups_limit_swap="false" --cgroups_root="mesos" --container_disk_watch_interval="15secs"
--containerizers="mesos" --credential="/tmp/Endpoint_SlaveEndpointTest_NoAuthorizer_2_WE0JVP/credential"
--default_role="*" --disk_watch_interval="1mins" --docker="docker" --docker_kill_orphans="true"
--docker_registry="https://registry-1.docker.io" --docker_remove_delay="6hrs" --docker_socket="/var/run/docker.sock"
--docker_stop_timeout="0ns" --docker_store_dir="/tmp/Endpoint_SlaveEndpointTest_NoAuthorizer_2_WE0JVP/store/docker"
--docker_volume_checkpoint_dir="/var/run/mesos/isolators/docker/volume" --enforce_container_disk_quota="false"
--executor_registration_timeout="1mins" --executor_reregistration_timeout="2secs" --executor_shutdown_grace_period="5secs"
--fetcher_cache_dir="/tmp/Endpoint_SlaveEndpointTest_NoAuthorizer_2_WE0JVP/fetch" --fetcher_cache_size="2GB"
--frameworks_home="" --gc_delay="1weeks" --gc_disk_headroom="0.1" --hadoop_home="" --help="false"
--hostname_lookup="true" --http_command_executor="false" --http_credentials="/tmp/Endpoint_SlaveEndpointTest_NoAuthorizer_2_WE0JVP/http_credentials"
--http_heartbeat_interval="30secs" --initialize_driver_logging="true" --isolation="posix/cpu,posix/mem"
--launcher="posix" --launcher_dir="/mesos/mesos-1.4.0/_build/src" --logbufsecs="0" --logging_level="INFO"
--max_completed_executors_per_framework="150" --oversubscribed_resources_interval="15secs"
--perf_duration="10secs" --perf_interval="1mins" --port="5051" --qos_correction_interval_min="0ns"
--quiet="false" --recover="reconnect" --recovery_timeout="15mins" --registration_backoff_factor="10ms"
--resources="cpus:2;gpus:0;mem:1024;disk:1024;ports:[31000-32000]" --revocable_cpu_low_priority="true"
--runtime_dir="/tmp/Endpoint_SlaveEndpointTest_NoAuthorizer_2_WE0JVP" --sandbox_directory="/mnt/mesos/sandbox"
--strict="true" --switch_user="true" --systemd_enable_support="true" --systemd_runtime_directory="/run/systemd/system"
--version="false" --work_dir="/tmp/Endpoint_SlaveEndpointTest_NoAuthorizer_2_NSXLG3"
I0712 03:56:59.040189  5017 credentials.hpp:86] Loading credential for authentication from
'/tmp/Endpoint_SlaveEndpointTest_NoAuthorizer_2_WE0JVP/credential'
I0712 03:56:59.040550  5017 slave.cpp:283] Agent using credential for: test-principal
I0712 03:56:59.040576  5017 credentials.hpp:37] Loading credentials for authentication from
'/tmp/Endpoint_SlaveEndpointTest_NoAuthorizer_2_WE0JVP/http_credentials'
I0712 03:56:59.041084  5017 http.cpp:1009] Creating default 'basic' HTTP authenticator for
realm 'mesos-agent-readonly'
I0712 03:56:59.041401  5017 http.cpp:1009] Creating default 'basic' HTTP authenticator for
realm 'mesos-agent-readwrite'
I0712 03:56:59.043594  5017 slave.cpp:565] Agent resources: [{"name":"cpus","scalar":{"value":2.0},"type":"SCALAR"},{"name":"mem","scalar":{"value":1024.0},"type":"SCALAR"},{"name":"disk","scalar":{"value":1024.0},"type":"SCALAR"},{"name":"ports","ranges":{"range":[{"begin":31000,"end":32000}]},"type":"RANGES"}]
I0712 03:56:59.044056  5017 slave.cpp:573] Agent attributes: [  ]
I0712 03:56:59.044077  5017 slave.cpp:582] Agent hostname: dff38a2bd0f3
I0712 03:56:59.044292  5013 status_update_manager.cpp:177] Pausing sending status updates
I0712 03:56:59.046483  5013 state.cpp:64] Recovering state from '/tmp/Endpoint_SlaveEndpointTest_NoAuthorizer_2_NSXLG3/meta'
I0712 03:56:59.047051  5013 status_update_manager.cpp:203] Recovering status update manager
I0712 03:56:59.047322  5018 containerizer.cpp:582] Recovering containerizer
I0712 03:56:59.049579  5018 provisioner.cpp:416] Provisioner recovery complete
I0712 03:56:59.050211  5012 slave.cpp:6207] Finished recovery
I0712 03:56:59.050945  5012 slave.cpp:6389] Querying resource estimator for oversubscribable
resources
I0712 03:56:59.051435  5019 slave.cpp:6403] Received oversubscribable resources {} from the
resource estimator
I0712 03:56:59.056496  5016 process.cpp:3820] Handling HTTP event for process 'slave(793)'
with path: '/slave(793)/containers'
I0712 03:56:59.059244  5016 http.cpp:1149] HTTP GET for /slave(793)/containers from 172.17.0.2:51946
I0712 03:56:59.059367  5016 http.cpp:970] Authorizing principal 'test-principal' to GET the
'/containers' endpoint
I0712 03:56:59.065979  5018 slave.cpp:843] Agent terminating
[       OK ] Endpoint/SlaveEndpointTest.NoAuthorizer/2 (50 ms)
[----------] 9 tests from Endpoint/SlaveEndpointTest (447 ms total)

[----------] Global test environment tear-down
[==========] 1635 tests from 179 test cases ran. (734947 ms total)
[  PASSED  ] 1630 tests.
[  FAILED  ] 5 tests, listed below:
[  FAILED  ] DefaultExecutorCheckTest.CommandCheckDeliveredAndReconciled
[  FAILED  ] DefaultExecutorCheckTest.CommandCheckStatusChange
[  FAILED  ] DefaultExecutorCheckTest.CommandCheckSeesParentsEnv
[  FAILED  ] DefaultExecutorCheckTest.CommandCheckSharesWorkDirWithTask
[  FAILED  ] ContentType/AgentAPIStreamingTest.AttachInputToNestedContainerSession/0, where
GetParam() = application/x-protobuf

 5 FAILED TESTS
  YOU HAVE 20 DISABLED TESTS

I0712 03:56:59.213197  5020 process.cpp:993] Failed to accept socket: future discarded
make[4]: *** [check-local] Error 1
make[4]: Leaving directory `/mesos/mesos-1.4.0/_build/src'
make[3]: *** [check-am] Error 2
make[3]: Leaving directory `/mesos/mesos-1.4.0/_build/src'
make[2]: *** [check] Error 2
make[2]: Leaving directory `/mesos/mesos-1.4.0/_build/src'
make[1]: *** [check-recursive] Error 1
make[1]: Leaving directory `/mesos/mesos-1.4.0/_build'
make: *** [distcheck] Error 1
+ docker rmi mesos-1499825883-11527
Untagged: mesos-1499825883-11527:latest
Deleted: sha256:4b2b9d00c102823722b98cf61e5a26dfd028ab5c3ed4b7269034ac5ca545b117
Deleted: sha256:23f92f5ed67f8ba4d7cba9a4d83fabf3e3a4657f00eab18cbbdf6e5531988954
Deleted: sha256:b762a6a1b7281cb4a15ef5315c0802eaaee4671bba244346e8075785b6499333
Deleted: sha256:97b247206ddaf45535712ce85de501b58514d47c09cd5c895a52bd22ae75d648
Deleted: sha256:772b2e048e36cc9bdc6afa1c102f1476b67f0805847d083e54f3abf2795f5eb8
Deleted: sha256:eca5363c33c7b758b92fcc2bb27dd55fa8cdfb8c71c0b9240a5ce49b40aa0c73
Deleted: sha256:c2ddfa77f7dec61f07693ce6e2e3c656016ec80b8c51ab9c0246725e8fa0a170
Deleted: sha256:ccbfad6c35b740799ea72f52c09beab59238a126eb20eb91a8a05db78050f783
Deleted: sha256:35651d560ecfd3b4c0ea2ad0655bd09dea3d772fbb2f3c4f82d105804b2c649b
Deleted: sha256:b1ad7797beb733bff66b2760d8263b44a9f4cf60e5f64bac484a4574d1f23df5
Deleted: sha256:62b364633eb8c1e4a8d747c8dac2c354874aea0475bf0dd03d7835f02fd3777c
Deleted: sha256:995ea9e99f74c3c18cf7d43b6d3407a0e6fd56f21826e7f64243f6ce26f42126
Deleted: sha256:31b0b6bceb90bfd8ed72e2f0d085410453425e6f936e0f870649b35e5a2579fa
Deleted: sha256:1edb25ed1efd5ccddb54fac2c3cbe81027ce2d7a1c8d9687bff7f764217e176b
Deleted: sha256:92d3d7e0cb87301d182487c09a82197aba2f174a5a84596918692b36172770b7
Deleted: sha256:7867c8ef3a74ed300c1118453cc9369456c0cddc76a20ea3bf0f524123712f9b
Deleted: sha256:17c18f51c4f7e59a148ab2bbb913a1449d5d2957194e3141dc4da92c2efd0ff0
Deleted: sha256:ae406f394b9c8b8bdd615c456b8a09d17494a8cc11d6f45eb3b239c1006cdbb5
Deleted: sha256:435aedeac04fb3e9c3c96d31d8946bbcdb68c34e616a776c21dc35fea6ecee36
Deleted: sha256:63f5727367eb82c4a4a204fd4ff4716cd35a6d817a3db622e6d31f4bfef04d8f
Deleted: sha256:01f9c910926387da1e5f97f835f06ac0b7b467dae0012e897dea94dc67167ff0
Deleted: sha256:5f4b0bfcac81a1a21b7eea3878ebc08da31529e6abd3a0609c6c1ee2f9877484
Deleted: sha256:ae58df04158faa24ba277acb0131e3489d94a7768ab759ce3025915d78da97cc
Deleted: sha256:266a6e210c27cd465ca3120c224f8375e150375f4762b7ff885ae2d6119232a7
Build step 'Execute shell' marked build as failure

Mime
View raw message