mesos-builds mailing list archives

Site index · List index
Message view « Date » · « Thread »
Top « Date » · « Thread »
From Apache Jenkins Server <jenk...@builds.apache.org>
Subject Build failed in Jenkins: Mesos-Reviewbot #18553
Date Thu, 20 Jul 2017 19:16:13 GMT
See <https://builds.apache.org/job/Mesos-Reviewbot/18553/display/redirect?page=changes>

Changes:

[benjamin.hindman] Added a message passing benchmark.

[benjamin.hindman] Finalize when the tests finish.

------------------------------------------
[...truncated 30.20 MB...]
W0720 19:16:06.413635  5026 backend.cpp:76] Failed to create 'overlay' backend: OverlayBackend
requires root privileges
W0720 19:16:06.413806  5026 backend.cpp:76] Failed to create 'bind' backend: BindBackend requires
root privileges
I0720 19:16:06.413909  5026 provisioner.cpp:255] Using default backend 'copy'
I0720 19:16:06.419250  5049 slave.cpp:250] Mesos agent started on (792)@172.17.0.2:42069
I0720 19:16:06.419292  5049 slave.cpp:251] Flags at startup: --acls="" --appc_simple_discovery_uri_prefix="http://"
--appc_store_dir="/tmp/Endpoint_SlaveEndpointTest_AuthorizedRequest_2_R1Zg7f/store/appc" --authenticate_http_readonly="true"
--authenticate_http_readwrite="true" --authenticatee="crammd5" --authentication_backoff_factor="1secs"
--authorizer="local" --cgroups_cpu_enable_pids_and_tids_count="false" --cgroups_enable_cfs="false"
--cgroups_hierarchy="/sys/fs/cgroup" --cgroups_limit_swap="false" --cgroups_root="mesos" --container_disk_watch_interval="15secs"
--containerizers="mesos" --credential="/tmp/Endpoint_SlaveEndpointTest_AuthorizedRequest_2_R1Zg7f/credential"
--default_role="*" --disk_watch_interval="1mins" --docker="docker" --docker_kill_orphans="true"
--docker_registry="https://registry-1.docker.io" --docker_remove_delay="6hrs" --docker_socket="/var/run/docker.sock"
--docker_stop_timeout="0ns" --docker_store_dir="/tmp/Endpoint_SlaveEndpointTest_AuthorizedRequest_2_R1Zg7f/store/docker"
--docker_volume_checkpoint_dir="/var/run/mesos/isolators/docker/volume" --enforce_container_disk_quota="false"
--executor_registration_timeout="1mins" --executor_reregistration_timeout="2secs" --executor_shutdown_grace_period="5secs"
--fetcher_cache_dir="/tmp/Endpoint_SlaveEndpointTest_AuthorizedRequest_2_R1Zg7f/fetch" --fetcher_cache_size="2GB"
--frameworks_home="" --gc_delay="1weeks" --gc_disk_headroom="0.1" --hadoop_home="" --help="false"
--hostname_lookup="true" --http_command_executor="false" --http_credentials="/tmp/Endpoint_SlaveEndpointTest_AuthorizedRequest_2_R1Zg7f/http_credentials"
--http_heartbeat_interval="30secs" --initialize_driver_logging="true" --isolation="posix/cpu,posix/mem"
--launcher="posix" --launcher_dir="/mesos/mesos-1.4.0/_build/src" --logbufsecs="0" --logging_level="INFO"
--max_completed_executors_per_framework="150" --oversubscribed_resources_interval="15secs"
--perf_duration="10secs" --perf_interval="1mins" --port="5051" --qos_correction_interval_min="0ns"
--quiet="false" --recover="reconnect" --recovery_timeout="15mins" --registration_backoff_factor="10ms"
--resources="cpus:2;gpus:0;mem:1024;disk:1024;ports:[31000-32000]" --revocable_cpu_low_priority="true"
--runtime_dir="/tmp/Endpoint_SlaveEndpointTest_AuthorizedRequest_2_R1Zg7f" --sandbox_directory="/mnt/mesos/sandbox"
--strict="true" --switch_user="true" --systemd_enable_support="true" --systemd_runtime_directory="/run/systemd/system"
--version="false" --work_dir="/tmp/Endpoint_SlaveEndpointTest_AuthorizedRequest_2_dGiJJh"
I0720 19:16:06.420181  5049 credentials.hpp:86] Loading credential for authentication from
'/tmp/Endpoint_SlaveEndpointTest_AuthorizedRequest_2_R1Zg7f/credential'
I0720 19:16:06.420689  5049 slave.cpp:283] Agent using credential for: test-principal
I0720 19:16:06.420719  5049 credentials.hpp:37] Loading credentials for authentication from
'/tmp/Endpoint_SlaveEndpointTest_AuthorizedRequest_2_R1Zg7f/http_credentials'
I0720 19:16:06.421234  5049 http.cpp:993] Creating default 'basic' HTTP authenticator for
realm 'mesos-agent-readonly'
I0720 19:16:06.421581  5049 http.cpp:993] Creating default 'basic' HTTP authenticator for
realm 'mesos-agent-readwrite'
I0720 19:16:06.423800  5049 slave.cpp:565] Agent resources: [{"name":"cpus","scalar":{"value":2.0},"type":"SCALAR"},{"name":"mem","scalar":{"value":1024.0},"type":"SCALAR"},{"name":"disk","scalar":{"value":1024.0},"type":"SCALAR"},{"name":"ports","ranges":{"range":[{"begin":31000,"end":32000}]},"type":"RANGES"}]
I0720 19:16:06.424367  5049 slave.cpp:573] Agent attributes: [  ]
I0720 19:16:06.424391  5049 slave.cpp:582] Agent hostname: bee92691c081
I0720 19:16:06.424763  5050 status_update_manager.cpp:177] Pausing sending status updates
I0720 19:16:06.426847  5048 state.cpp:64] Recovering state from '/tmp/Endpoint_SlaveEndpointTest_AuthorizedRequest_2_dGiJJh/meta'
I0720 19:16:06.427443  5050 status_update_manager.cpp:203] Recovering status update manager
I0720 19:16:06.427764  5049 containerizer.cpp:582] Recovering containerizer
I0720 19:16:06.430064  5046 provisioner.cpp:416] Provisioner recovery complete
I0720 19:16:06.430989  5049 slave.cpp:6207] Finished recovery
I0720 19:16:06.431771  5049 slave.cpp:6389] Querying resource estimator for oversubscribable
resources
I0720 19:16:06.432303  5051 slave.cpp:6403] Received oversubscribable resources {} from the
resource estimator
I0720 19:16:06.436497  5051 process.cpp:3837] Handling HTTP event for process 'slave(792)'
with path: '/slave(792)/containers'
I0720 19:16:06.438879  5048 http.cpp:1133] HTTP GET for /slave(792)/containers from 172.17.0.2:52046
I0720 19:16:06.439056  5048 http.cpp:957] Authorizing principal 'test-principal' to GET the
'/containers' endpoint
I0720 19:16:06.445543  5050 slave.cpp:843] Agent terminating
[       OK ] Endpoint/SlaveEndpointTest.AuthorizedRequest/2 (48 ms)
[ RUN      ] Endpoint/SlaveEndpointTest.UnauthorizedRequest/0
I0720 19:16:06.461686  5026 containerizer.cpp:230] Using isolation: posix/cpu,posix/mem,filesystem/posix,network/cni,environment_secret
W0720 19:16:06.462468  5026 backend.cpp:76] Failed to create 'overlay' backend: OverlayBackend
requires root privileges
W0720 19:16:06.462646  5026 backend.cpp:76] Failed to create 'bind' backend: BindBackend requires
root privileges
I0720 19:16:06.462690  5026 provisioner.cpp:255] Using default backend 'copy'
I0720 19:16:06.468106  5049 slave.cpp:250] Mesos agent started on (793)@172.17.0.2:42069
I0720 19:16:06.468150  5049 slave.cpp:251] Flags at startup: --acls="" --appc_simple_discovery_uri_prefix="http://"
--appc_store_dir="/tmp/Endpoint_SlaveEndpointTest_UnauthorizedRequest_0_5kCl49/store/appc"
--authenticate_http_readonly="true" --authenticate_http_readwrite="true" --authenticatee="crammd5"
--authentication_backoff_factor="1secs" --authorizer="local" --cgroups_cpu_enable_pids_and_tids_count="false"
--cgroups_enable_cfs="false" --cgroups_hierarchy="/sys/fs/cgroup" --cgroups_limit_swap="false"
--cgroups_root="mesos" --container_disk_watch_interval="15secs" --containerizers="mesos" --credential="/tmp/Endpoint_SlaveEndpointTest_UnauthorizedRequest_0_5kCl49/credential"
--default_role="*" --disk_watch_interval="1mins" --docker="docker" --docker_kill_orphans="true"
--docker_registry="https://registry-1.docker.io" --docker_remove_delay="6hrs" --docker_socket="/var/run/docker.sock"
--docker_stop_timeout="0ns" --docker_store_dir="/tmp/Endpoint_SlaveEndpointTest_UnauthorizedRequest_0_5kCl49/store/docker"
--docker_volume_checkpoint_dir="/var/run/mesos/isolators/docker/volume" --enforce_container_disk_quota="false"
--executor_registration_timeout="1mins" --executor_reregistration_timeout="2secs" --executor_shutdown_grace_period="5secs"
--fetcher_cache_dir="/tmp/Endpoint_SlaveEndpointTest_UnauthorizedRequest_0_5kCl49/fetch" --fetcher_cache_size="2GB"
--frameworks_home="" --gc_delay="1weeks" --gc_disk_headroom="0.1" --hadoop_home="" --help="false"
--hostname_lookup="true" --http_command_executor="false" --http_credentials="/tmp/Endpoint_SlaveEndpointTest_UnauthorizedRequest_0_5kCl49/http_credentials"
--http_heartbeat_interval="30secs" --initialize_driver_logging="true" --isolation="posix/cpu,posix/mem"
--launcher="posix" --launcher_dir="/mesos/mesos-1.4.0/_build/src" --logbufsecs="0" --logging_level="INFO"
--max_completed_executors_per_framework="150" --oversubscribed_resources_interval="15secs"
--perf_duration="10secs" --perf_interval="1mins" --port="5051" --qos_correction_interval_min="0ns"
--quiet="false" --recover="reconnect" --recovery_timeout="15mins" --registration_backoff_factor="10ms"
--resources="cpus:2;gpus:0;mem:1024;disk:1024;ports:[31000-32000]" --revocable_cpu_low_priority="true"
--runtime_dir="/tmp/Endpoint_SlaveEndpointTest_UnauthorizedRequest_0_5kCl49" --sandbox_directory="/mnt/mesos/sandbox"
--strict="true" --switch_user="true" --systemd_enable_support="true" --systemd_runtime_directory="/run/systemd/system"
--version="false" --work_dir="/tmp/Endpoint_SlaveEndpointTest_UnauthorizedRequest_0_frEUyb"
I0720 19:16:06.468981  5049 credentials.hpp:86] Loading credential for authentication from
'/tmp/Endpoint_SlaveEndpointTest_UnauthorizedRequest_0_5kCl49/credential'
I0720 19:16:06.469285  5049 slave.cpp:283] Agent using credential for: test-principal
I0720 19:16:06.469311  5049 credentials.hpp:37] Loading credentials for authentication from
'/tmp/Endpoint_SlaveEndpointTest_UnauthorizedRequest_0_5kCl49/http_credentials'
I0720 19:16:06.469763  5049 http.cpp:993] Creating default 'basic' HTTP authenticator for
realm 'mesos-agent-readonly'
I0720 19:16:06.470078  5049 http.cpp:993] Creating default 'basic' HTTP authenticator for
realm 'mesos-agent-readwrite'
I0720 19:16:06.472268  5049 slave.cpp:565] Agent resources: [{"name":"cpus","scalar":{"value":2.0},"type":"SCALAR"},{"name":"mem","scalar":{"value":1024.0},"type":"SCALAR"},{"name":"disk","scalar":{"value":1024.0},"type":"SCALAR"},{"name":"ports","ranges":{"range":[{"begin":31000,"end":32000}]},"type":"RANGES"}]
I0720 19:16:06.472700  5049 slave.cpp:573] Agent attributes: [  ]
I0720 19:16:06.472790  5049 slave.cpp:582] Agent hostname: bee92691c081
I0720 19:16:06.473029  5048 status_update_manager.cpp:177] Pausing sending status updates
I0720 19:16:06.475222  5046 state.cpp:64] Recovering state from '/tmp/Endpoint_SlaveEndpointTest_UnauthorizedRequest_0_frEUyb/meta'
I0720 19:16:06.475888  5050 status_update_manager.cpp:203] Recovering status update manager
I0720 19:16:06.476331  5052 containerizer.cpp:582] Recovering containerizer
I0720 19:16:06.478543  5052 provisioner.cpp:416] Provisioner recovery complete
I0720 19:16:06.479200  5046 slave.cpp:6207] Finished recovery
I0720 19:16:06.479949  5046 slave.cpp:6389] Querying resource estimator for oversubscribable
resources
I0720 19:16:06.480505  5048 slave.cpp:6403] Received oversubscribable resources {} from the
resource estimator
I0720 19:16:06.484746  5045 process.cpp:3837] Handling HTTP event for process 'slave(793)'
with path: '/slave(793)/monitor/statistics'
I0720 19:16:06.487228  5052 http.cpp:1133] HTTP GET for /slave(793)/monitor/statistics from
172.17.0.2:52048
I0720 19:16:06.487401  5052 http.cpp:957] Authorizing principal 'test-principal' to GET the
'/monitor/statistics' endpoint
I0720 19:16:06.490882  5047 slave.cpp:843] Agent terminating
[       OK ] Endpoint/SlaveEndpointTest.UnauthorizedRequest/0 (45 ms)
[ RUN      ] Endpoint/SlaveEndpointTest.UnauthorizedRequest/1
I0720 19:16:06.507277  5026 containerizer.cpp:230] Using isolation: posix/cpu,posix/mem,filesystem/posix,network/cni,environment_secret
W0720 19:16:06.508074  5026 backend.cpp:76] Failed to create 'overlay' backend: OverlayBackend
requires root privileges
W0720 19:16:06.508255  5026 backend.cpp:76] Failed to create 'bind' backend: BindBackend requires
root privileges
I0720 19:16:06.508302  5026 provisioner.cpp:255] Using default backend 'copy'
I0720 19:16:06.513777  5046 slave.cpp:250] Mesos agent started on (794)@172.17.0.2:42069
I0720 19:16:06.513818  5046 slave.cpp:251] Flags at startup: --acls="" --appc_simple_discovery_uri_prefix="http://"
--appc_store_dir="/tmp/Endpoint_SlaveEndpointTest_UnauthorizedRequest_1_1Cgpv4/store/appc"
--authenticate_http_readonly="true" --authenticate_http_readwrite="true" --authenticatee="crammd5"
--authentication_backoff_factor="1secs" --authorizer="local" --cgroups_cpu_enable_pids_and_tids_count="false"
--cgroups_enable_cfs="false" --cgroups_hierarchy="/sys/fs/cgroup" --cgroups_limit_swap="false"
--cgroups_root="mesos" --container_disk_watch_interval="15secs" --containerizers="mesos" --credential="/tmp/Endpoint_SlaveEndpointTest_UnauthorizedRequest_1_1Cgpv4/credential"
--default_role="*" --disk_watch_interval="1mins" --docker="docker" --docker_kill_orphans="true"
--docker_registry="https://registry-1.docker.io" --docker_remove_delay="6hrs" --docker_socket="/var/run/docker.sock"
--docker_stop_timeout="0ns" --docker_store_dir="/tmp/Endpoint_SlaveEndpointTest_UnauthorizedRequest_1_1Cgpv4/store/docker"
--docker_volume_checkpoint_dir="/var/run/mesos/isolators/docker/volume" --enforce_container_disk_quota="false"
--executor_registration_timeout="1mins" --executor_reregistration_timeout="2secs" --executor_shutdown_grace_period="5secs"
--fetcher_cache_dir="/tmp/Endpoint_SlaveEndpointTest_UnauthorizedRequest_1_1Cgpv4/fetch" --fetcher_cache_size="2GB"
--frameworks_home="" --gc_delay="1weeks" --gc_disk_headroom="0.1" --hadoop_home="" --help="false"
--hostname_lookup="true" --http_command_executor="false" --http_credentials="/tmp/Endpoint_SlaveEndpointTest_UnauthorizedRequest_1_1Cgpv4/http_credentials"
--http_heartbeat_interval="30secs" --initialize_driver_logging="true" --isolation="posix/cpu,posix/mem"
--launcher="posix" --launcher_dir="/mesos/mesos-1.4.0/_build/src" --logbufsecs="0" --logging_level="INFO"
--max_completed_executors_per_framework="150" --oversubscribed_resources_interval="15secs"
--perf_duration="10secs" --perf_interval="1mins" --port="5051" --qos_correction_interval_min="0ns"
--quiet="false" --recover="reconnect" --recovery_timeout="15mins" --registration_backoff_factor="10ms"
--resources="cpus:2;gpus:0;mem:1024;disk:1024;ports:[31000-32000]" --revocable_cpu_low_priority="true"
--runtime_dir="/tmp/Endpoint_SlaveEndpointTest_UnauthorizedRequest_1_1Cgpv4" --sandbox_directory="/mnt/mesos/sandbox"
--strict="true" --switch_user="true" --systemd_enable_support="true" --systemd_runtime_directory="/run/systemd/system"
--version="false" --work_dir="/tmp/Endpoint_SlaveEndpointTest_UnauthorizedRequest_1_Za2zS5"
I0720 19:16:06.514673  5046 credentials.hpp:86] Loading credential for authentication from
'/tmp/Endpoint_SlaveEndpointTest_UnauthorizedRequest_1_1Cgpv4/credential'
I0720 19:16:06.515061  5046 slave.cpp:283] Agent using credential for: test-principal
I0720 19:16:06.515094  5046 credentials.hpp:37] Loading credentials for authentication from
'/tmp/Endpoint_SlaveEndpointTest_UnauthorizedRequest_1_1Cgpv4/http_credentials'
I0720 19:16:06.515578  5046 http.cpp:993] Creating default 'basic' HTTP authenticator for
realm 'mesos-agent-readonly'
I0720 19:16:06.515929  5046 http.cpp:993] Creating default 'basic' HTTP authenticator for
realm 'mesos-agent-readwrite'
I0720 19:16:06.518236  5046 slave.cpp:565] Agent resources: [{"name":"cpus","scalar":{"value":2.0},"type":"SCALAR"},{"name":"mem","scalar":{"value":1024.0},"type":"SCALAR"},{"name":"disk","scalar":{"value":1024.0},"type":"SCALAR"},{"name":"ports","ranges":{"range":[{"begin":31000,"end":32000}]},"type":"RANGES"}]
I0720 19:16:06.518673  5046 slave.cpp:573] Agent attributes: [  ]
I0720 19:16:06.518694  5046 slave.cpp:582] Agent hostname: bee92691c081
I0720 19:16:06.519021  5050 status_update_manager.cpp:177] Pausing sending status updates
I0720 19:16:06.521054  5051 state.cpp:64] Recovering state from '/tmp/Endpoint_SlaveEndpointTest_UnauthorizedRequest_1_Za2zS5/meta'
I0720 19:16:06.521652  5048 status_update_manager.cpp:203] Recovering status update manager
I0720 19:16:06.522050  5046 containerizer.cpp:582] Recovering containerizer
I0720 19:16:06.524410  5045 provisioner.cpp:416] Provisioner recovery complete
I0720 19:16:06.525161  5052 slave.cpp:6207] Finished recovery
I0720 19:16:06.525938  5052 slave.cpp:6389] Querying resource estimator for oversubscribable
resources
I0720 19:16:06.526496  5052 slave.cpp:6403] Received oversubscribable resources {} from the
resource estimator
I0720 19:16:06.530673  5048 process.cpp:3837] Handling HTTP event for process 'slave(794)'
with path: '/slave(794)/monitor/statistics.json'
I0720 19:16:06.533241  5051 http.cpp:1133] HTTP GET for /slave(794)/monitor/statistics.json
from 172.17.0.2:52050
I0720 19:16:06.533429  5051 http.cpp:957] Authorizing principal 'test-principal' to GET the
'/monitor/statistics.json' endpoint
I0720 19:16:06.537061  5046 slave.cpp:843] Agent terminating
[       OK ] Endpoint/SlaveEndpointTest.UnauthorizedRequest/1 (45 ms)
[ RUN      ] Endpoint/SlaveEndpointTest.UnauthorizedRequest/2
I0720 19:16:06.553198  5026 containerizer.cpp:230] Using isolation: posix/cpu,posix/mem,filesystem/posix,network/cni,environment_secret
W0720 19:16:06.554040  5026 backend.cpp:76] Failed to create 'overlay' backend: OverlayBackend
requires root privileges
W0720 19:16:06.554224  5026 backend.cpp:76] Failed to create 'bind' backend: BindBackend requires
root privileges
I0720 19:16:06.554272  5026 provisioner.cpp:255] Using default backend 'copy'
I0720 19:16:06.559929  5046 slave.cpp:250] Mesos agent started on (795)@172.17.0.2:42069
I0720 19:16:06.559972  5046 slave.cpp:251] Flags at startup: --acls="" --appc_simple_discovery_uri_prefix="http://"
--appc_store_dir="/tmp/Endpoint_SlaveEndpointTest_UnauthorizedRequest_2_BZqhqZ/store/appc"
--authenticate_http_readonly="true" --authenticate_http_readwrite="true" --authenticatee="crammd5"
--authentication_backoff_factor="1secs" --authorizer="local" --cgroups_cpu_enable_pids_and_tids_count="false"
--cgroups_enable_cfs="false" --cgroups_hierarchy="/sys/fs/cgroup" --cgroups_limit_swap="false"
--cgroups_root="mesos" --container_disk_watch_interval="15secs" --containerizers="mesos" --credential="/tmp/Endpoint_SlaveEndpointTest_UnauthorizedRequest_2_BZqhqZ/credential"
--default_role="*" --disk_watch_interval="1mins" --docker="docker" --docker_kill_orphans="true"
--docker_registry="https://registry-1.docker.io" --docker_remove_delay="6hrs" --docker_socket="/var/run/docker.sock"
--docker_stop_timeout="0ns" --docker_store_dir="/tmp/Endpoint_SlaveEndpointTest_UnauthorizedRequest_2_BZqhqZ/store/docker"
--docker_volume_checkpoint_dir="/var/run/mesos/isolators/docker/volume" --enforce_container_disk_quota="false"
--executor_registration_timeout="1mins" --executor_reregistration_timeout="2secs" --executor_shutdown_grace_period="5secs"
--fetcher_cache_dir="/tmp/Endpoint_SlaveEndpointTest_UnauthorizedRequest_2_BZqhqZ/fetch" --fetcher_cache_size="2GB"
--frameworks_home="" --gc_delay="1weeks" --gc_disk_headroom="0.1" --hadoop_home="" --help="false"
--hostname_lookup="true" --http_command_executor="false" --http_credentials="/tmp/Endpoint_SlaveEndpointTest_UnauthorizedRequest_2_BZqhqZ/http_credentials"
--http_heartbeat_interval="30secs" --initialize_driver_logging="true" --isolation="posix/cpu,posix/mem"
--launcher="posix" --launcher_dir="/mesos/mesos-1.4.0/_build/src" --logbufsecs="0" --logging_level="INFO"
--max_completed_executors_per_framework="150" --oversubscribed_resources_interval="15secs"
--perf_duration="10secs" --perf_interval="1mins" --port="5051" --qos_correction_interval_min="0ns"
--quiet="false" --recover="reconnect" --recovery_timeout="15mins" --registration_backoff_factor="10ms"
--resources="cpus:2;gpus:0;mem:1024;disk:1024;ports:[31000-32000]" --revocable_cpu_low_priority="true"
--runtime_dir="/tmp/Endpoint_SlaveEndpointTest_UnauthorizedRequest_2_BZqhqZ" --sandbox_directory="/mnt/mesos/sandbox"
--strict="true" --switch_user="true" --systemd_enable_support="true" --systemd_runtime_directory="/run/systemd/system"
--version="false" --work_dir="/tmp/Endpoint_SlaveEndpointTest_UnauthorizedRequest_2_ZuWZF0"
I0720 19:16:06.560847  5046 credentials.hpp:86] Loading credential for authentication from
'/tmp/Endpoint_SlaveEndpointTest_UnauthorizedRequest_2_BZqhqZ/credential'
I0720 19:16:06.561221  5046 slave.cpp:283] Agent using credential for: test-principal
I0720 19:16:06.561259  5046 credentials.hpp:37] Loading credentials for authentication from
'/tmp/Endpoint_SlaveEndpointTest_UnauthorizedRequest_2_BZqhqZ/http_credentials'
I0720 19:16:06.561769  5046 http.cpp:993] Creating default 'basic' HTTP authenticator for
realm 'mesos-agent-readonly'
I0720 19:16:06.562126  5046 http.cpp:993] Creating default 'basic' HTTP authenticator for
realm 'mesos-agent-readwrite'
I0720 19:16:06.564451  5046 slave.cpp:565] Agent resources: [{"name":"cpus","scalar":{"value":2.0},"type":"SCALAR"},{"name":"mem","scalar":{"value":1024.0},"type":"SCALAR"},{"name":"disk","scalar":{"value":1024.0},"type":"SCALAR"},{"name":"ports","ranges":{"range":[{"begin":31000,"end":32000}]},"type":"RANGES"}]
I0720 19:16:06.564890  5046 slave.cpp:573] Agent attributes: [  ]
I0720 19:16:06.564913  5046 slave.cpp:582] Agent hostname: bee92691c081
I0720 19:16:06.565276  5045 status_update_manager.cpp:177] Pausing sending status updates
I0720 19:16:06.567330  5047 state.cpp:64] Recovering state from '/tmp/Endpoint_SlaveEndpointTest_UnauthorizedRequest_2_ZuWZF0/meta'
I0720 19:16:06.568009  5050 status_update_manager.cpp:203] Recovering status update manager
I0720 19:16:06.568394  5046 containerizer.cpp:582] Recovering containerizer
I0720 19:16:06.570799  5047 provisioner.cpp:416] Provisioner recovery complete
I0720 19:16:06.571540  5048 slave.cpp:6207] Finished recovery
I0720 19:16:06.572295  5048 slave.cpp:6389] Querying resource estimator for oversubscribable
resources
I0720 19:16:06.572739  5047 slave.cpp:6403] Received oversubscribable resources {} from the
resource estimator
I0720 19:16:06.577101  5047 process.cpp:3837] Handling HTTP event for process 'slave(795)'
with path: '/slave(795)/containers'
I0720 19:16:06.579185  5045 http.cpp:1133] HTTP GET for /slave(795)/containers from 172.17.0.2:52052
I0720 19:16:06.579314  5045 http.cpp:957] Authorizing principal 'test-principal' to GET the
'/containers' endpoint
I0720 19:16:06.583372  5026 slave.cpp:843] Agent terminating
[       OK ] Endpoint/SlaveEndpointTest.UnauthorizedRequest/2 (45 ms)
[ RUN      ] Endpoint/SlaveEndpointTest.NoAuthorizer/0
I0720 19:16:06.599995  5026 containerizer.cpp:230] Using isolation: posix/cpu,posix/mem,filesystem/posix,network/cni,environment_secret
W0720 19:16:06.600795  5026 backend.cpp:76] Failed to create 'overlay' backend: OverlayBackend
requires root privileges
W0720 19:16:06.600972  5026 backend.cpp:76] Failed to create 'bind' backend: BindBackend requires
root privileges
I0720 19:16:06.601018  5026 provisioner.cpp:255] Using default backend 'copy'
I0720 19:16:06.603624  5026 cluster.cpp:448] Creating default 'local' authorizer
I0720 19:16:06.606515  5045 slave.cpp:250] Mesos agent started on (796)@172.17.0.2:42069
I0720 19:16:06.606559  5045 slave.cpp:251] Flags at startup: --acls="" --appc_simple_discovery_uri_prefix="http://"
--appc_store_dir="/tmp/Endpoint_SlaveEndpointTest_NoAuthorizer_0_1GybPU/store/appc" --authenticate_http_readonly="true"
--authenticate_http_readwrite="true" --authenticatee="crammd5" --authentication_backoff_factor="1secs"
--authorizer="local" --cgroups_cpu_enable_pids_and_tids_count="false" --cgroups_enable_cfs="false"
--cgroups_hierarchy="/sys/fs/cgroup" --cgroups_limit_swap="false" --cgroups_root="mesos" --container_disk_watch_interval="15secs"
--containerizers="mesos" --credential="/tmp/Endpoint_SlaveEndpointTest_NoAuthorizer_0_1GybPU/credential"
--default_role="*" --disk_watch_interval="1mins" --docker="docker" --docker_kill_orphans="true"
--docker_registry="https://registry-1.docker.io" --docker_remove_delay="6hrs" --docker_socket="/var/run/docker.sock"
--docker_stop_timeout="0ns" --docker_store_dir="/tmp/Endpoint_SlaveEndpointTest_NoAuthorizer_0_1GybPU/store/docker"
--docker_volume_checkpoint_dir="/var/run/mesos/isolators/docker/volume" --enforce_container_disk_quota="false"
--executor_registration_timeout="1mins" --executor_reregistration_timeout="2secs" --executor_shutdown_grace_period="5secs"
--fetcher_cache_dir="/tmp/Endpoint_SlaveEndpointTest_NoAuthorizer_0_1GybPU/fetch" --fetcher_cache_size="2GB"
--frameworks_home="" --gc_delay="1weeks" --gc_disk_headroom="0.1" --hadoop_home="" --help="false"
--hostname_lookup="true" --http_command_executor="false" --http_credentials="/tmp/Endpoint_SlaveEndpointTest_NoAuthorizer_0_1GybPU/http_credentials"
--http_heartbeat_interval="30secs" --initialize_driver_logging="true" --isolation="posix/cpu,posix/mem"
--launcher="posix" --launcher_dir="/mesos/mesos-1.4.0/_build/src" --logbufsecs="0" --logging_level="INFO"
--max_completed_executors_per_framework="150" --oversubscribed_resources_interval="15secs"
--perf_duration="10secs" --perf_interval="1mins" --port="5051" --qos_correction_interval_min="0ns"
--quiet="false" --recover="reconnect" --recovery_timeout="15mins" --registration_backoff_factor="10ms"
--resources="cpus:2;gpus:0;mem:1024;disk:1024;ports:[31000-32000]" --revocable_cpu_low_priority="true"
--runtime_dir="/tmp/Endpoint_SlaveEndpointTest_NoAuthorizer_0_1GybPU" --sandbox_directory="/mnt/mesos/sandbox"
--strict="true" --switch_user="true" --systemd_enable_support="true" --systemd_runtime_directory="/run/systemd/system"
--version="false" --work_dir="/tmp/Endpoint_SlaveEndpointTest_NoAuthorizer_0_NqbpXV"
I0720 19:16:06.607419  5045 credentials.hpp:86] Loading credential for authentication from
'/tmp/Endpoint_SlaveEndpointTest_NoAuthorizer_0_1GybPU/credential'
I0720 19:16:06.607764  5045 slave.cpp:283] Agent using credential for: test-principal
I0720 19:16:06.607798  5045 credentials.hpp:37] Loading credentials for authentication from
'/tmp/Endpoint_SlaveEndpointTest_NoAuthorizer_0_1GybPU/http_credentials'
I0720 19:16:06.608304  5045 http.cpp:993] Creating default 'basic' HTTP authenticator for
realm 'mesos-agent-readonly'
I0720 19:16:06.608633  5045 http.cpp:993] Creating default 'basic' HTTP authenticator for
realm 'mesos-agent-readwrite'
I0720 19:16:06.610870  5045 slave.cpp:565] Agent resources: [{"name":"cpus","scalar":{"value":2.0},"type":"SCALAR"},{"name":"mem","scalar":{"value":1024.0},"type":"SCALAR"},{"name":"disk","scalar":{"value":1024.0},"type":"SCALAR"},{"name":"ports","ranges":{"range":[{"begin":31000,"end":32000}]},"type":"RANGES"}]
I0720 19:16:06.611305  5045 slave.cpp:573] Agent attributes: [  ]
I0720 19:16:06.611328  5045 slave.cpp:582] Agent hostname: bee92691c081
I0720 19:16:06.611721  5049 status_update_manager.cpp:177] Pausing sending status updates
I0720 19:16:06.614241  5052 state.cpp:64] Recovering state from '/tmp/Endpoint_SlaveEndpointTest_NoAuthorizer_0_NqbpXV/meta'
I0720 19:16:06.614722  5047 status_update_manager.cpp:203] Recovering status update manager
I0720 19:16:06.615044  5048 containerizer.cpp:582] Recovering containerizer
I0720 19:16:06.617533  5046 provisioner.cpp:416] Provisioner recovery complete
I0720 19:16:06.618199  5047 slave.cpp:6207] Finished recovery
I0720 19:16:06.619091  5047 slave.cpp:6389] Querying resource estimator for oversubscribable
resources
I0720 19:16:06.619617  5048 slave.cpp:6403] Received oversubscribable resources {} from the
resource estimator
I0720 19:16:06.623700  5048 process.cpp:3837] Handling HTTP event for process 'slave(796)'
with path: '/slave(796)/monitor/statistics'
I0720 19:16:06.625824  5046 http.cpp:1133] HTTP GET for /slave(796)/monitor/statistics from
172.17.0.2:52054
I0720 19:16:06.625958  5046 http.cpp:957] Authorizing principal 'test-principal' to GET the
'/monitor/statistics' endpoint
I0720 19:16:06.631230  5050 slave.cpp:843] Agent terminating
[       OK ] Endpoint/SlaveEndpointTest.NoAuthorizer/0 (47 ms)
[ RUN      ] Endpoint/SlaveEndpointTest.NoAuthorizer/1
I0720 19:16:06.648006  5026 containerizer.cpp:230] Using isolation: posix/cpu,posix/mem,filesystem/posix,network/cni,environment_secret
W0720 19:16:06.648802  5026 backend.cpp:76] Failed to create 'overlay' backend: OverlayBackend
requires root privileges
W0720 19:16:06.648983  5026 backend.cpp:76] Failed to create 'bind' backend: BindBackend requires
root privileges
I0720 19:16:06.649031  5026 provisioner.cpp:255] Using default backend 'copy'
I0720 19:16:06.651693  5026 cluster.cpp:448] Creating default 'local' authorizer
I0720 19:16:06.654673  5046 slave.cpp:250] Mesos agent started on (797)@172.17.0.2:42069
I0720 19:16:06.654716  5046 slave.cpp:251] Flags at startup: --acls="" --appc_simple_discovery_uri_prefix="http://"
--appc_store_dir="/tmp/Endpoint_SlaveEndpointTest_NoAuthorizer_1_N3JZIQ/store/appc" --authenticate_http_readonly="true"
--authenticate_http_readwrite="true" --authenticatee="crammd5" --authentication_backoff_factor="1secs"
--authorizer="local" --cgroups_cpu_enable_pids_and_tids_count="false" --cgroups_enable_cfs="false"
--cgroups_hierarchy="/sys/fs/cgroup" --cgroups_limit_swap="false" --cgroups_root="mesos" --container_disk_watch_interval="15secs"
--containerizers="mesos" --credential="/tmp/Endpoint_SlaveEndpointTest_NoAuthorizer_1_N3JZIQ/credential"
--default_role="*" --disk_watch_interval="1mins" --docker="docker" --docker_kill_orphans="true"
--docker_registry="https://registry-1.docker.io" --docker_remove_delay="6hrs" --docker_socket="/var/run/docker.sock"
--docker_stop_timeout="0ns" --docker_store_dir="/tmp/Endpoint_SlaveEndpointTest_NoAuthorizer_1_N3JZIQ/store/docker"
--docker_volume_checkpoint_dir="/var/run/mesos/isolators/docker/volume" --enforce_container_disk_quota="false"
--executor_registration_timeout="1mins" --executor_reregistration_timeout="2secs" --executor_shutdown_grace_period="5secs"
--fetcher_cache_dir="/tmp/Endpoint_SlaveEndpointTest_NoAuthorizer_1_N3JZIQ/fetch" --fetcher_cache_size="2GB"
--frameworks_home="" --gc_delay="1weeks" --gc_disk_headroom="0.1" --hadoop_home="" --help="false"
--hostname_lookup="true" --http_command_executor="false" --http_credentials="/tmp/Endpoint_SlaveEndpointTest_NoAuthorizer_1_N3JZIQ/http_credentials"
--http_heartbeat_interval="30secs" --initialize_driver_logging="true" --isolation="posix/cpu,posix/mem"
--launcher="posix" --launcher_dir="/mesos/mesos-1.4.0/_build/src" --logbufsecs="0" --logging_level="INFO"
--max_completed_executors_per_framework="150" --oversubscribed_resources_interval="15secs"
--perf_duration="10secs" --perf_interval="1mins" --port="5051" --qos_correction_interval_min="0ns"
--quiet="false" --recover="reconnect" --recovery_timeout="15mins" --registration_backoff_factor="10ms"
--resources="cpus:2;gpus:0;mem:1024;disk:1024;ports:[31000-32000]" --revocable_cpu_low_priority="true"
--runtime_dir="/tmp/Endpoint_SlaveEndpointTest_NoAuthorizer_1_N3JZIQ" --sandbox_directory="/mnt/mesos/sandbox"
--strict="true" --switch_user="true" --systemd_enable_support="true" --systemd_runtime_directory="/run/systemd/system"
--version="false" --work_dir="/tmp/Endpoint_SlaveEndpointTest_NoAuthorizer_1_rtsrJR"
I0720 19:16:06.655550  5046 credentials.hpp:86] Loading credential for authentication from
'/tmp/Endpoint_SlaveEndpointTest_NoAuthorizer_1_N3JZIQ/credential'
I0720 19:16:06.655923  5046 slave.cpp:283] Agent using credential for: test-principal
I0720 19:16:06.655956  5046 credentials.hpp:37] Loading credentials for authentication from
'/tmp/Endpoint_SlaveEndpointTest_NoAuthorizer_1_N3JZIQ/http_credentials'
I0720 19:16:06.656436  5046 http.cpp:993] Creating default 'basic' HTTP authenticator for
realm 'mesos-agent-readonly'
I0720 19:16:06.656785  5046 http.cpp:993] Creating default 'basic' HTTP authenticator for
realm 'mesos-agent-readwrite'
I0720 19:16:06.659327  5046 slave.cpp:565] Agent resources: [{"name":"cpus","scalar":{"value":2.0},"type":"SCALAR"},{"name":"mem","scalar":{"value":1024.0},"type":"SCALAR"},{"name":"disk","scalar":{"value":1024.0},"type":"SCALAR"},{"name":"ports","ranges":{"range":[{"begin":31000,"end":32000}]},"type":"RANGES"}]
I0720 19:16:06.659765  5046 slave.cpp:573] Agent attributes: [  ]
I0720 19:16:06.659785  5046 slave.cpp:582] Agent hostname: bee92691c081
I0720 19:16:06.660082  5047 status_update_manager.cpp:177] Pausing sending status updates
I0720 19:16:06.662662  5045 state.cpp:64] Recovering state from '/tmp/Endpoint_SlaveEndpointTest_NoAuthorizer_1_rtsrJR/meta'
I0720 19:16:06.663296  5048 status_update_manager.cpp:203] Recovering status update manager
I0720 19:16:06.663656  5050 containerizer.cpp:582] Recovering containerizer
I0720 19:16:06.666101  5046 provisioner.cpp:416] Provisioner recovery complete
I0720 19:16:06.666736  5047 slave.cpp:6207] Finished recovery
I0720 19:16:06.667690  5047 slave.cpp:6389] Querying resource estimator for oversubscribable
resources
I0720 19:16:06.668177  5048 slave.cpp:6403] Received oversubscribable resources {} from the
resource estimator
I0720 19:16:06.672210  5048 process.cpp:3837] Handling HTTP event for process 'slave(797)'
with path: '/slave(797)/monitor/statistics.json'
I0720 19:16:06.674331  5049 http.cpp:1133] HTTP GET for /slave(797)/monitor/statistics.json
from 172.17.0.2:52056
I0720 19:16:06.674509  5049 http.cpp:957] Authorizing principal 'test-principal' to GET the
'/monitor/statistics.json' endpoint
I0720 19:16:06.680349  5026 slave.cpp:843] Agent terminating
[       OK ] Endpoint/SlaveEndpointTest.NoAuthorizer/1 (48 ms)
[ RUN      ] Endpoint/SlaveEndpointTest.NoAuthorizer/2
I0720 19:16:06.697235  5026 containerizer.cpp:230] Using isolation: posix/cpu,posix/mem,filesystem/posix,network/cni,environment_secret
W0720 19:16:06.698046  5026 backend.cpp:76] Failed to create 'overlay' backend: OverlayBackend
requires root privileges
W0720 19:16:06.698227  5026 backend.cpp:76] Failed to create 'bind' backend: BindBackend requires
root privileges
I0720 19:16:06.698274  5026 provisioner.cpp:255] Using default backend 'copy'
I0720 19:16:06.701001  5026 cluster.cpp:448] Creating default 'local' authorizer
I0720 19:16:06.703938  5050 slave.cpp:250] Mesos agent started on (798)@172.17.0.2:42069
I0720 19:16:06.703982  5050 slave.cpp:251] Flags at startup: --acls="" --appc_simple_discovery_uri_prefix="http://"
--appc_store_dir="/tmp/Endpoint_SlaveEndpointTest_NoAuthorizer_2_byxs8M/store/appc" --authenticate_http_readonly="true"
--authenticate_http_readwrite="true" --authenticatee="crammd5" --authentication_backoff_factor="1secs"
--authorizer="local" --cgroups_cpu_enable_pids_and_tids_count="false" --cgroups_enable_cfs="false"
--cgroups_hierarchy="/sys/fs/cgroup" --cgroups_limit_swap="false" --cgroups_root="mesos" --container_disk_watch_interval="15secs"
--containerizers="mesos" --credential="/tmp/Endpoint_SlaveEndpointTest_NoAuthorizer_2_byxs8M/credential"
--default_role="*" --disk_watch_interval="1mins" --docker="docker" --docker_kill_orphans="true"
--docker_registry="https://registry-1.docker.io" --docker_remove_delay="6hrs" --docker_socket="/var/run/docker.sock"
--docker_stop_timeout="0ns" --docker_store_dir="/tmp/Endpoint_SlaveEndpointTest_NoAuthorizer_2_byxs8M/store/docker"
--docker_volume_checkpoint_dir="/var/run/mesos/isolators/docker/volume" --enforce_container_disk_quota="false"
--executor_registration_timeout="1mins" --executor_reregistration_timeout="2secs" --executor_shutdown_grace_period="5secs"
--fetcher_cache_dir="/tmp/Endpoint_SlaveEndpointTest_NoAuthorizer_2_byxs8M/fetch" --fetcher_cache_size="2GB"
--frameworks_home="" --gc_delay="1weeks" --gc_disk_headroom="0.1" --hadoop_home="" --help="false"
--hostname_lookup="true" --http_command_executor="false" --http_credentials="/tmp/Endpoint_SlaveEndpointTest_NoAuthorizer_2_byxs8M/http_credentials"
--http_heartbeat_interval="30secs" --initialize_driver_logging="true" --isolation="posix/cpu,posix/mem"
--launcher="posix" --launcher_dir="/mesos/mesos-1.4.0/_build/src" --logbufsecs="0" --logging_level="INFO"
--max_completed_executors_per_framework="150" --oversubscribed_resources_interval="15secs"
--perf_duration="10secs" --perf_interval="1mins" --port="5051" --qos_correction_interval_min="0ns"
--quiet="false" --recover="reconnect" --recovery_timeout="15mins" --registration_backoff_factor="10ms"
--resources="cpus:2;gpus:0;mem:1024;disk:1024;ports:[31000-32000]" --revocable_cpu_low_priority="true"
--runtime_dir="/tmp/Endpoint_SlaveEndpointTest_NoAuthorizer_2_byxs8M" --sandbox_directory="/mnt/mesos/sandbox"
--strict="true" --switch_user="true" --systemd_enable_support="true" --systemd_runtime_directory="/run/systemd/system"
--version="false" --work_dir="/tmp/Endpoint_SlaveEndpointTest_NoAuthorizer_2_pwEY0N"
I0720 19:16:06.705420  5050 credentials.hpp:86] Loading credential for authentication from
'/tmp/Endpoint_SlaveEndpointTest_NoAuthorizer_2_byxs8M/credential'
I0720 19:16:06.705911  5050 slave.cpp:283] Agent using credential for: test-principal
I0720 19:16:06.705947  5050 credentials.hpp:37] Loading credentials for authentication from
'/tmp/Endpoint_SlaveEndpointTest_NoAuthorizer_2_byxs8M/http_credentials'
I0720 19:16:06.706423  5050 http.cpp:993] Creating default 'basic' HTTP authenticator for
realm 'mesos-agent-readonly'
I0720 19:16:06.706769  5050 http.cpp:993] Creating default 'basic' HTTP authenticator for
realm 'mesos-agent-readwrite'
I0720 19:16:06.708973  5050 slave.cpp:565] Agent resources: [{"name":"cpus","scalar":{"value":2.0},"type":"SCALAR"},{"name":"mem","scalar":{"value":1024.0},"type":"SCALAR"},{"name":"disk","scalar":{"value":1024.0},"type":"SCALAR"},{"name":"ports","ranges":{"range":[{"begin":31000,"end":32000}]},"type":"RANGES"}]
I0720 19:16:06.709405  5050 slave.cpp:573] Agent attributes: [  ]
I0720 19:16:06.709426  5050 slave.cpp:582] Agent hostname: bee92691c081
I0720 19:16:06.709858  5048 status_update_manager.cpp:177] Pausing sending status updates
I0720 19:16:06.712112  5051 state.cpp:64] Recovering state from '/tmp/Endpoint_SlaveEndpointTest_NoAuthorizer_2_pwEY0N/meta'
I0720 19:16:06.712677  5046 status_update_manager.cpp:203] Recovering status update manager
I0720 19:16:06.713096  5050 containerizer.cpp:582] Recovering containerizer
I0720 19:16:06.715595  5051 provisioner.cpp:416] Provisioner recovery complete
I0720 19:16:06.716529  5050 slave.cpp:6207] Finished recovery
I0720 19:16:06.717355  5050 slave.cpp:6389] Querying resource estimator for oversubscribable
resources
I0720 19:16:06.718077  5045 slave.cpp:6403] Received oversubscribable resources {} from the
resource estimator
I0720 19:16:06.722404  5052 process.cpp:3837] Handling HTTP event for process 'slave(798)'
with path: '/slave(798)/containers'
I0720 19:16:06.725121  5045 http.cpp:1133] HTTP GET for /slave(798)/containers from 172.17.0.2:52058
I0720 19:16:06.725258  5045 http.cpp:957] Authorizing principal 'test-principal' to GET the
'/containers' endpoint
I0720 19:16:06.731772  5045 slave.cpp:843] Agent terminating
[       OK ] Endpoint/SlaveEndpointTest.NoAuthorizer/2 (52 ms)
[----------] 9 tests from Endpoint/SlaveEndpointTest (433 ms total)

[----------] Global test environment tear-down
[==========] 1637 tests from 179 test cases ran. (777007 ms total)
[  PASSED  ] 1632 tests.
[  FAILED  ] 5 tests, listed below:
[  FAILED  ] DefaultExecutorCheckTest.CommandCheckDeliveredAndReconciled
[  FAILED  ] DefaultExecutorCheckTest.CommandCheckStatusChange
[  FAILED  ] DefaultExecutorCheckTest.CommandCheckSeesParentsEnv
[  FAILED  ] DefaultExecutorCheckTest.CommandCheckSharesWorkDirWithTask
[  FAILED  ] MasterTest.IgnoreOldAgentReregistration

 5 FAILED TESTS
  YOU HAVE 20 DISABLED TESTS

I0720 19:16:06.879256  5053 process.cpp:1006] Failed to accept socket: future discarded
make[4]: *** [check-local] Error 1
make[4]: Leaving directory `/mesos/mesos-1.4.0/_build/src'
make[3]: *** [check-am] Error 2
make[3]: Leaving directory `/mesos/mesos-1.4.0/_build/src'
make[2]: *** [check] Error 2
make[2]: Leaving directory `/mesos/mesos-1.4.0/_build/src'
make[1]: *** [check-recursive] Error 1
make[1]: Leaving directory `/mesos/mesos-1.4.0/_build'
make: *** [distcheck] Error 1
+ docker rmi mesos-1500572301-25650
Untagged: mesos-1500572301-25650:latest
Deleted: sha256:c545be17e3a18dd8345f359d7f842e9cf907fcf014fde756df78d1461a8d33e2
Deleted: sha256:5258a612f462421d142720016bbe1660dbdbbd49b5db1076f42f636f10417380
Deleted: sha256:f61d58e9ed5cfabb9e6ef9294ec86a95fadef7eb629818d1eb177441f177b41b
Deleted: sha256:c7a496ab5a469c55a61d1a891f43ed74ecae6d2f8da131b3cd5ca4dea97ed9c9
Deleted: sha256:40626ebbbff2f627d64071e634b3bea8af91c4a40a8a18249e6e8e57f0a659db
Deleted: sha256:48202f77e1dd683faa8a5b2bb1037cade0b75982533c41faade4438f533c8cd6
Deleted: sha256:525490511c1f051edde8d831f4450ad25b281d6e822caf1341c0533ddc25c092
Deleted: sha256:e77a2a5818252ab1354681e972ba3b15bdc216dd4fc868163aec06db28ef9455
Deleted: sha256:a9edef436beee15e2c571a13f16299f1c7262ffc73f100d94d9086c7b6255ae9
Deleted: sha256:1fbe0dcd4cbf26d0473053ff0bac4a3dfbf7c0a6d23a6e4851693976cf8102ed
Deleted: sha256:46cfabb610cf3140161366f3469902205116cfd79ef773f9756ae418256d531c
Deleted: sha256:91598e4e8ae874ab443bc2d694297b1271d127f97e204ed5fa9c80ac0a5e0868
Deleted: sha256:947552bbd0bc2fddb66be95a0791b4bf301b32325c67560cb734f7d19b9deb53
Deleted: sha256:fff333458cbf38807d9f59d54515dbab5298421c871dbcef9018dd8c0189b034
Deleted: sha256:1f6c76e5fd0a86066657f481f86c4b0c9ebe72d09d42801240627379aca8de04
Deleted: sha256:f57ab79375d22ffb971a3aa8b79aef5facc28e3c27ad973668a45e43bae8022f
Deleted: sha256:b2be7f6de2f8941a8d1030df049f9ae2c1971d020d935b117fd4017e4b76d7b5
Deleted: sha256:ebeebe83b710f8d47041dc41d876704caf8cbdfdcf78f694bc003f098416ebd8
Deleted: sha256:426e38dbe67d810933849c9dc5c4e408df1760cd3b467542745bc055d234d659
Deleted: sha256:8c42e9b635a2f94f6a0a156ea6eda9c2233c45aa62c4c7b7ef6cadabbbdf4007
Deleted: sha256:fc1644f69b6c16ee470e4bca09472f4dd8b598ac812147023caa5b948fc5b6e9
Deleted: sha256:b9ebea4ad0f4f7c612f020d3599e1ad5db611d574896094c1be73ad1b4adf709
Deleted: sha256:fd7f28eda1b77334887cdf319ddb2633689aa56926afca769844d0b9c6f35973
Deleted: sha256:b5e92116fbfc454c40e7fbbd263bf0830090a25b20d45389703bb33dfec275c8
Build step 'Execute shell' marked build as failure

Mime
View raw message