mesos-builds mailing list archives

Site index · List index
Message view « Date » · « Thread »
Top « Date » · « Thread »
From Apache Jenkins Server <jenk...@builds.apache.org>
Subject Build failed in Jenkins: Mesos-Buildbot » autotools,gcc,--verbose --enable-libevent --enable-ssl,GLOG_v=1 MESOS_VERBOSE=1,centos:7,(ubuntu)&&(!ubuntu-us1)&&(!ubuntu-eu2) #3859
Date Tue, 04 Jul 2017 04:08:07 GMT
See <https://builds.apache.org/job/Mesos-Buildbot/BUILDTOOL=autotools,COMPILER=gcc,CONFIGURATION=--verbose%20--enable-libevent%20--enable-ssl,ENVIRONMENT=GLOG_v=1%20MESOS_VERBOSE=1,OS=centos%3A7,label_exp=(ubuntu)&&(!ubuntu-us1)&&(!ubuntu-eu2)/3859/display/redirect?page=changes>

Changes:

[toenshoff] Fixed interference of unbundled dependency include paths with Boost.

[toenshoff] Added MESOS-7581 to the 1.3.1 CHANGELOG.

------------------------------------------
[...truncated 28.07 MB...]
I0704 04:07:58.952105 21585 slave.cpp:796] Agent terminating
[       OK ] Endpoint/SlaveEndpointTest.AuthorizedRequest/2 (27 ms)
[ RUN      ] Endpoint/SlaveEndpointTest.UnauthorizedRequest/0
I0704 04:07:58.961791  2251 containerizer.cpp:221] Using isolation: posix/cpu,posix/mem,filesystem/posix,network/cni
W0704 04:07:58.962294  2251 backend.cpp:76] Failed to create 'aufs' backend: AufsBackend requires
root privileges
W0704 04:07:58.962404  2251 backend.cpp:76] Failed to create 'bind' backend: BindBackend requires
root privileges
I0704 04:07:58.962450  2251 provisioner.cpp:249] Using default backend 'copy'
I0704 04:07:58.965421 21572 slave.cpp:231] Mesos agent started on (744)@172.17.0.7:42921
I0704 04:07:58.965441 21572 slave.cpp:232] Flags at startup: --acls="" --appc_simple_discovery_uri_prefix="http://"
--appc_store_dir="/tmp/mesos/store/appc" --authenticate_http_executors="true" --authenticate_http_readonly="true"
--authenticate_http_readwrite="true" --authenticatee="crammd5" --authentication_backoff_factor="1secs"
--authorizer="local" --cgroups_cpu_enable_pids_and_tids_count="false" --cgroups_enable_cfs="false"
--cgroups_hierarchy="/sys/fs/cgroup" --cgroups_limit_swap="false" --cgroups_root="mesos" --container_disk_watch_interval="15secs"
--containerizers="mesos" --credential="/tmp/Endpoint_SlaveEndpointTest_UnauthorizedRequest_0_xdUyO3/credential"
--default_role="*" --disk_watch_interval="1mins" --docker="docker" --docker_kill_orphans="true"
--docker_registry="https://registry-1.docker.io" --docker_remove_delay="6hrs" --docker_socket="/var/run/docker.sock"
--docker_stop_timeout="0ns" --docker_store_dir="/tmp/mesos/store/docker" --docker_volume_checkpoint_dir="/var/run/mesos/isolators/docker/volume"
--enforce_container_disk_quota="false" --executor_registration_timeout="1mins" --executor_reregistration_timeout="2secs"
--executor_secret_key="/tmp/Endpoint_SlaveEndpointTest_UnauthorizedRequest_0_xdUyO3/executor_secret_key"
--executor_shutdown_grace_period="5secs" --fetcher_cache_dir="/tmp/Endpoint_SlaveEndpointTest_UnauthorizedRequest_0_xdUyO3/fetch"
--fetcher_cache_size="2GB" --frameworks_home="" --gc_delay="1weeks" --gc_disk_headroom="0.1"
--hadoop_home="" --help="false" --hostname_lookup="true" --http_command_executor="false" --http_credentials="/tmp/Endpoint_SlaveEndpointTest_UnauthorizedRequest_0_xdUyO3/http_credentials"
--http_heartbeat_interval="30secs" --initialize_driver_logging="true" --isolation="posix/cpu,posix/mem"
--launcher="posix" --launcher_dir="/mesos/mesos-1.3.1/_build/src" --logbufsecs="0" --logging_level="INFO"
--max_completed_executors_per_framework="150" --oversubscribed_resources_interval="15secs"
--perf_duration="10secs" --perf_interval="1mins" --port="5051" --qos_correction_interval_min="0ns"
--quiet="false" --recover="reconnect" --recovery_timeout="15mins" --registration_backoff_factor="10ms"
--resources="cpus:2;gpus:0;mem:1024;disk:1024;ports:[31000-32000]" --revocable_cpu_low_priority="true"
--runtime_dir="/tmp/Endpoint_SlaveEndpointTest_UnauthorizedRequest_0_xdUyO3" --sandbox_directory="/mnt/mesos/sandbox"
--strict="true" --switch_user="true" --systemd_enable_support="true" --systemd_runtime_directory="/run/systemd/system"
--version="false" --work_dir="/tmp/Endpoint_SlaveEndpointTest_UnauthorizedRequest_0_63QOFd"
I0704 04:07:58.965850 21572 credentials.hpp:86] Loading credential for authentication from
'/tmp/Endpoint_SlaveEndpointTest_UnauthorizedRequest_0_xdUyO3/credential'
I0704 04:07:58.965996 21572 slave.cpp:264] Agent using credential for: test-principal
I0704 04:07:58.966017 21572 credentials.hpp:37] Loading credentials for authentication from
'/tmp/Endpoint_SlaveEndpointTest_UnauthorizedRequest_0_xdUyO3/http_credentials'
I0704 04:07:58.966317 21572 http.cpp:975] Creating default 'basic' HTTP authenticator for
realm 'mesos-agent-executor'
I0704 04:07:58.966424 21572 http.cpp:996] Creating default 'jwt' HTTP authenticator for realm
'mesos-agent-executor'
I0704 04:07:58.966779 21572 http.cpp:975] Creating default 'basic' HTTP authenticator for
realm 'mesos-agent-readonly'
I0704 04:07:58.966891 21572 http.cpp:996] Creating default 'jwt' HTTP authenticator for realm
'mesos-agent-readonly'
I0704 04:07:58.967078 21572 http.cpp:975] Creating default 'basic' HTTP authenticator for
realm 'mesos-agent-readwrite'
I0704 04:07:58.967258 21572 http.cpp:996] Creating default 'jwt' HTTP authenticator for realm
'mesos-agent-readwrite'
I0704 04:07:58.968574 21572 slave.cpp:531] Agent resources: cpus(*):2; mem(*):1024; disk(*):1024;
ports(*):[31000-32000]
I0704 04:07:58.968658 21572 slave.cpp:539] Agent attributes: [  ]
I0704 04:07:58.968674 21572 slave.cpp:544] Agent hostname: c479a3a87b44
I0704 04:07:58.968789 21591 status_update_manager.cpp:177] Pausing sending status updates
I0704 04:07:58.970077 21591 state.cpp:62] Recovering state from '/tmp/Endpoint_SlaveEndpointTest_UnauthorizedRequest_0_63QOFd/meta'
I0704 04:07:58.970418 21571 status_update_manager.cpp:203] Recovering status update manager
I0704 04:07:58.970616 21574 containerizer.cpp:608] Recovering containerizer
I0704 04:07:58.971958 21581 provisioner.cpp:410] Provisioner recovery complete
I0704 04:07:58.972479 21569 slave.cpp:6075] Finished recovery
I0704 04:07:58.972970 21569 slave.cpp:6257] Querying resource estimator for oversubscribable
resources
I0704 04:07:58.973222 21576 slave.cpp:6271] Received oversubscribable resources {} from the
resource estimator
I0704 04:07:58.975045 21590 process.cpp:3731] Handling HTTP event for process 'slave(744)'
with path: '/slave(744)/monitor/statistics'
I0704 04:07:58.976711 21585 http.cpp:1115] HTTP GET for /slave(744)/monitor/statistics from
172.17.0.7:55486
I0704 04:07:58.976799 21585 http.cpp:936] Authorizing principal 'test-principal' to GET the
'/monitor/statistics' endpoint
I0704 04:07:58.978785 21591 slave.cpp:796] Agent terminating
[       OK ] Endpoint/SlaveEndpointTest.UnauthorizedRequest/0 (26 ms)
[ RUN      ] Endpoint/SlaveEndpointTest.UnauthorizedRequest/1
I0704 04:07:58.988270  2251 containerizer.cpp:221] Using isolation: posix/cpu,posix/mem,filesystem/posix,network/cni
W0704 04:07:58.988749  2251 backend.cpp:76] Failed to create 'aufs' backend: AufsBackend requires
root privileges
W0704 04:07:58.988842  2251 backend.cpp:76] Failed to create 'bind' backend: BindBackend requires
root privileges
I0704 04:07:58.988874  2251 provisioner.cpp:249] Using default backend 'copy'
I0704 04:07:58.991766 21575 slave.cpp:231] Mesos agent started on (745)@172.17.0.7:42921
I0704 04:07:58.991788 21575 slave.cpp:232] Flags at startup: --acls="" --appc_simple_discovery_uri_prefix="http://"
--appc_store_dir="/tmp/mesos/store/appc" --authenticate_http_executors="true" --authenticate_http_readonly="true"
--authenticate_http_readwrite="true" --authenticatee="crammd5" --authentication_backoff_factor="1secs"
--authorizer="local" --cgroups_cpu_enable_pids_and_tids_count="false" --cgroups_enable_cfs="false"
--cgroups_hierarchy="/sys/fs/cgroup" --cgroups_limit_swap="false" --cgroups_root="mesos" --container_disk_watch_interval="15secs"
--containerizers="mesos" --credential="/tmp/Endpoint_SlaveEndpointTest_UnauthorizedRequest_1_vpk2Aq/credential"
--default_role="*" --disk_watch_interval="1mins" --docker="docker" --docker_kill_orphans="true"
--docker_registry="https://registry-1.docker.io" --docker_remove_delay="6hrs" --docker_socket="/var/run/docker.sock"
--docker_stop_timeout="0ns" --docker_store_dir="/tmp/mesos/store/docker" --docker_volume_checkpoint_dir="/var/run/mesos/isolators/docker/volume"
--enforce_container_disk_quota="false" --executor_registration_timeout="1mins" --executor_reregistration_timeout="2secs"
--executor_secret_key="/tmp/Endpoint_SlaveEndpointTest_UnauthorizedRequest_1_vpk2Aq/executor_secret_key"
--executor_shutdown_grace_period="5secs" --fetcher_cache_dir="/tmp/Endpoint_SlaveEndpointTest_UnauthorizedRequest_1_vpk2Aq/fetch"
--fetcher_cache_size="2GB" --frameworks_home="" --gc_delay="1weeks" --gc_disk_headroom="0.1"
--hadoop_home="" --help="false" --hostname_lookup="true" --http_command_executor="false" --http_credentials="/tmp/Endpoint_SlaveEndpointTest_UnauthorizedRequest_1_vpk2Aq/http_credentials"
--http_heartbeat_interval="30secs" --initialize_driver_logging="true" --isolation="posix/cpu,posix/mem"
--launcher="posix" --launcher_dir="/mesos/mesos-1.3.1/_build/src" --logbufsecs="0" --logging_level="INFO"
--max_completed_executors_per_framework="150" --oversubscribed_resources_interval="15secs"
--perf_duration="10secs" --perf_interval="1mins" --port="5051" --qos_correction_interval_min="0ns"
--quiet="false" --recover="reconnect" --recovery_timeout="15mins" --registration_backoff_factor="10ms"
--resources="cpus:2;gpus:0;mem:1024;disk:1024;ports:[31000-32000]" --revocable_cpu_low_priority="true"
--runtime_dir="/tmp/Endpoint_SlaveEndpointTest_UnauthorizedRequest_1_vpk2Aq" --sandbox_directory="/mnt/mesos/sandbox"
--strict="true" --switch_user="true" --systemd_enable_support="true" --systemd_runtime_directory="/run/systemd/system"
--version="false" --work_dir="/tmp/Endpoint_SlaveEndpointTest_UnauthorizedRequest_1_wv7loA"
I0704 04:07:58.992161 21575 credentials.hpp:86] Loading credential for authentication from
'/tmp/Endpoint_SlaveEndpointTest_UnauthorizedRequest_1_vpk2Aq/credential'
I0704 04:07:58.992300 21575 slave.cpp:264] Agent using credential for: test-principal
I0704 04:07:58.992323 21575 credentials.hpp:37] Loading credentials for authentication from
'/tmp/Endpoint_SlaveEndpointTest_UnauthorizedRequest_1_vpk2Aq/http_credentials'
I0704 04:07:58.992578 21575 http.cpp:975] Creating default 'basic' HTTP authenticator for
realm 'mesos-agent-executor'
I0704 04:07:58.992677 21575 http.cpp:996] Creating default 'jwt' HTTP authenticator for realm
'mesos-agent-executor'
I0704 04:07:58.993012 21575 http.cpp:975] Creating default 'basic' HTTP authenticator for
realm 'mesos-agent-readonly'
I0704 04:07:58.993121 21575 http.cpp:996] Creating default 'jwt' HTTP authenticator for realm
'mesos-agent-readonly'
I0704 04:07:58.993317 21575 http.cpp:975] Creating default 'basic' HTTP authenticator for
realm 'mesos-agent-readwrite'
I0704 04:07:58.993449 21575 http.cpp:996] Creating default 'jwt' HTTP authenticator for realm
'mesos-agent-readwrite'
I0704 04:07:58.994730 21575 slave.cpp:531] Agent resources: cpus(*):2; mem(*):1024; disk(*):1024;
ports(*):[31000-32000]
I0704 04:07:58.994817 21575 slave.cpp:539] Agent attributes: [  ]
I0704 04:07:58.994830 21575 slave.cpp:544] Agent hostname: c479a3a87b44
I0704 04:07:58.994953 21577 status_update_manager.cpp:177] Pausing sending status updates
I0704 04:07:58.996495 21573 state.cpp:62] Recovering state from '/tmp/Endpoint_SlaveEndpointTest_UnauthorizedRequest_1_wv7loA/meta'
I0704 04:07:58.996794 21572 status_update_manager.cpp:203] Recovering status update manager
I0704 04:07:58.997062 21590 containerizer.cpp:608] Recovering containerizer
I0704 04:07:58.998443 21568 provisioner.cpp:410] Provisioner recovery complete
I0704 04:07:58.998848 21589 slave.cpp:6075] Finished recovery
I0704 04:07:58.999347 21589 slave.cpp:6257] Querying resource estimator for oversubscribable
resources
I0704 04:07:58.999680 21586 slave.cpp:6271] Received oversubscribable resources {} from the
resource estimator
I0704 04:07:59.001436 21582 process.cpp:3731] Handling HTTP event for process 'slave(745)'
with path: '/slave(745)/monitor/statistics.json'
I0704 04:07:59.003007 21573 http.cpp:1115] HTTP GET for /slave(745)/monitor/statistics.json
from 172.17.0.7:55488
I0704 04:07:59.003101 21573 http.cpp:936] Authorizing principal 'test-principal' to GET the
'/monitor/statistics.json' endpoint
I0704 04:07:59.005064 21589 slave.cpp:796] Agent terminating
[       OK ] Endpoint/SlaveEndpointTest.UnauthorizedRequest/1 (26 ms)
[ RUN      ] Endpoint/SlaveEndpointTest.UnauthorizedRequest/2
I0704 04:07:59.014638  2251 containerizer.cpp:221] Using isolation: posix/cpu,posix/mem,filesystem/posix,network/cni
W0704 04:07:59.015154  2251 backend.cpp:76] Failed to create 'aufs' backend: AufsBackend requires
root privileges
W0704 04:07:59.015267  2251 backend.cpp:76] Failed to create 'bind' backend: BindBackend requires
root privileges
I0704 04:07:59.015312  2251 provisioner.cpp:249] Using default backend 'copy'
I0704 04:07:59.018046 21570 slave.cpp:231] Mesos agent started on (746)@172.17.0.7:42921
I0704 04:07:59.018074 21570 slave.cpp:232] Flags at startup: --acls="" --appc_simple_discovery_uri_prefix="http://"
--appc_store_dir="/tmp/mesos/store/appc" --authenticate_http_executors="true" --authenticate_http_readonly="true"
--authenticate_http_readwrite="true" --authenticatee="crammd5" --authentication_backoff_factor="1secs"
--authorizer="local" --cgroups_cpu_enable_pids_and_tids_count="false" --cgroups_enable_cfs="false"
--cgroups_hierarchy="/sys/fs/cgroup" --cgroups_limit_swap="false" --cgroups_root="mesos" --container_disk_watch_interval="15secs"
--containerizers="mesos" --credential="/tmp/Endpoint_SlaveEndpointTest_UnauthorizedRequest_2_XLLdDN/credential"
--default_role="*" --disk_watch_interval="1mins" --docker="docker" --docker_kill_orphans="true"
--docker_registry="https://registry-1.docker.io" --docker_remove_delay="6hrs" --docker_socket="/var/run/docker.sock"
--docker_stop_timeout="0ns" --docker_store_dir="/tmp/mesos/store/docker" --docker_volume_checkpoint_dir="/var/run/mesos/isolators/docker/volume"
--enforce_container_disk_quota="false" --executor_registration_timeout="1mins" --executor_reregistration_timeout="2secs"
--executor_secret_key="/tmp/Endpoint_SlaveEndpointTest_UnauthorizedRequest_2_XLLdDN/executor_secret_key"
--executor_shutdown_grace_period="5secs" --fetcher_cache_dir="/tmp/Endpoint_SlaveEndpointTest_UnauthorizedRequest_2_XLLdDN/fetch"
--fetcher_cache_size="2GB" --frameworks_home="" --gc_delay="1weeks" --gc_disk_headroom="0.1"
--hadoop_home="" --help="false" --hostname_lookup="true" --http_command_executor="false" --http_credentials="/tmp/Endpoint_SlaveEndpointTest_UnauthorizedRequest_2_XLLdDN/http_credentials"
--http_heartbeat_interval="30secs" --initialize_driver_logging="true" --isolation="posix/cpu,posix/mem"
--launcher="posix" --launcher_dir="/mesos/mesos-1.3.1/_build/src" --logbufsecs="0" --logging_level="INFO"
--max_completed_executors_per_framework="150" --oversubscribed_resources_interval="15secs"
--perf_duration="10secs" --perf_interval="1mins" --port="5051" --qos_correction_interval_min="0ns"
--quiet="false" --recover="reconnect" --recovery_timeout="15mins" --registration_backoff_factor="10ms"
--resources="cpus:2;gpus:0;mem:1024;disk:1024;ports:[31000-32000]" --revocable_cpu_low_priority="true"
--runtime_dir="/tmp/Endpoint_SlaveEndpointTest_UnauthorizedRequest_2_XLLdDN" --sandbox_directory="/mnt/mesos/sandbox"
--strict="true" --switch_user="true" --systemd_enable_support="true" --systemd_runtime_directory="/run/systemd/system"
--version="false" --work_dir="/tmp/Endpoint_SlaveEndpointTest_UnauthorizedRequest_2_cRQBmX"
I0704 04:07:59.018705 21570 credentials.hpp:86] Loading credential for authentication from
'/tmp/Endpoint_SlaveEndpointTest_UnauthorizedRequest_2_XLLdDN/credential'
I0704 04:07:59.018903 21570 slave.cpp:264] Agent using credential for: test-principal
I0704 04:07:59.018934 21570 credentials.hpp:37] Loading credentials for authentication from
'/tmp/Endpoint_SlaveEndpointTest_UnauthorizedRequest_2_XLLdDN/http_credentials'
I0704 04:07:59.019325 21570 http.cpp:975] Creating default 'basic' HTTP authenticator for
realm 'mesos-agent-executor'
I0704 04:07:59.019441 21570 http.cpp:996] Creating default 'jwt' HTTP authenticator for realm
'mesos-agent-executor'
I0704 04:07:59.019654 21570 http.cpp:975] Creating default 'basic' HTTP authenticator for
realm 'mesos-agent-readonly'
I0704 04:07:59.019812 21570 http.cpp:996] Creating default 'jwt' HTTP authenticator for realm
'mesos-agent-readonly'
I0704 04:07:59.020114 21570 http.cpp:975] Creating default 'basic' HTTP authenticator for
realm 'mesos-agent-readwrite'
I0704 04:07:59.020221 21570 http.cpp:996] Creating default 'jwt' HTTP authenticator for realm
'mesos-agent-readwrite'
I0704 04:07:59.021679 21570 slave.cpp:531] Agent resources: cpus(*):2; mem(*):1024; disk(*):1024;
ports(*):[31000-32000]
I0704 04:07:59.021765 21570 slave.cpp:539] Agent attributes: [  ]
I0704 04:07:59.021780 21570 slave.cpp:544] Agent hostname: c479a3a87b44
I0704 04:07:59.021903 21589 status_update_manager.cpp:177] Pausing sending status updates
I0704 04:07:59.023360 21575 state.cpp:62] Recovering state from '/tmp/Endpoint_SlaveEndpointTest_UnauthorizedRequest_2_cRQBmX/meta'
I0704 04:07:59.023617 21570 status_update_manager.cpp:203] Recovering status update manager
I0704 04:07:59.023807 21577 containerizer.cpp:608] Recovering containerizer
I0704 04:07:59.025141 21574 provisioner.cpp:410] Provisioner recovery complete
I0704 04:07:59.025552 21585 slave.cpp:6075] Finished recovery
I0704 04:07:59.025995 21585 slave.cpp:6257] Querying resource estimator for oversubscribable
resources
I0704 04:07:59.026276 21580 slave.cpp:6271] Received oversubscribable resources {} from the
resource estimator
I0704 04:07:59.027988 21585 process.cpp:3731] Handling HTTP event for process 'slave(746)'
with path: '/slave(746)/containers'
I0704 04:07:59.029546 21590 http.cpp:1115] HTTP GET for /slave(746)/containers from 172.17.0.7:55490
I0704 04:07:59.029626 21590 http.cpp:936] Authorizing principal 'test-principal' to GET the
'/containers' endpoint
I0704 04:07:59.031688 21581 slave.cpp:796] Agent terminating
[       OK ] Endpoint/SlaveEndpointTest.UnauthorizedRequest/2 (26 ms)
[ RUN      ] Endpoint/SlaveEndpointTest.NoAuthorizer/0
I0704 04:07:59.041419  2251 containerizer.cpp:221] Using isolation: posix/cpu,posix/mem,filesystem/posix,network/cni
W0704 04:07:59.041909  2251 backend.cpp:76] Failed to create 'aufs' backend: AufsBackend requires
root privileges
W0704 04:07:59.042009  2251 backend.cpp:76] Failed to create 'bind' backend: BindBackend requires
root privileges
I0704 04:07:59.042049  2251 provisioner.cpp:249] Using default backend 'copy'
I0704 04:07:59.043608  2251 cluster.cpp:448] Creating default 'local' authorizer
I0704 04:07:59.045208 21586 slave.cpp:231] Mesos agent started on (747)@172.17.0.7:42921
I0704 04:07:59.045228 21586 slave.cpp:232] Flags at startup: --acls="" --appc_simple_discovery_uri_prefix="http://"
--appc_store_dir="/tmp/mesos/store/appc" --authenticate_http_executors="true" --authenticate_http_readonly="true"
--authenticate_http_readwrite="true" --authenticatee="crammd5" --authentication_backoff_factor="1secs"
--authorizer="local" --cgroups_cpu_enable_pids_and_tids_count="false" --cgroups_enable_cfs="false"
--cgroups_hierarchy="/sys/fs/cgroup" --cgroups_limit_swap="false" --cgroups_root="mesos" --container_disk_watch_interval="15secs"
--containerizers="mesos" --credential="/tmp/Endpoint_SlaveEndpointTest_NoAuthorizer_0_nffgVa/credential"
--default_role="*" --disk_watch_interval="1mins" --docker="docker" --docker_kill_orphans="true"
--docker_registry="https://registry-1.docker.io" --docker_remove_delay="6hrs" --docker_socket="/var/run/docker.sock"
--docker_stop_timeout="0ns" --docker_store_dir="/tmp/mesos/store/docker" --docker_volume_checkpoint_dir="/var/run/mesos/isolators/docker/volume"
--enforce_container_disk_quota="false" --executor_registration_timeout="1mins" --executor_reregistration_timeout="2secs"
--executor_secret_key="/tmp/Endpoint_SlaveEndpointTest_NoAuthorizer_0_nffgVa/executor_secret_key"
--executor_shutdown_grace_period="5secs" --fetcher_cache_dir="/tmp/Endpoint_SlaveEndpointTest_NoAuthorizer_0_nffgVa/fetch"
--fetcher_cache_size="2GB" --frameworks_home="" --gc_delay="1weeks" --gc_disk_headroom="0.1"
--hadoop_home="" --help="false" --hostname_lookup="true" --http_command_executor="false" --http_credentials="/tmp/Endpoint_SlaveEndpointTest_NoAuthorizer_0_nffgVa/http_credentials"
--http_heartbeat_interval="30secs" --initialize_driver_logging="true" --isolation="posix/cpu,posix/mem"
--launcher="posix" --launcher_dir="/mesos/mesos-1.3.1/_build/src" --logbufsecs="0" --logging_level="INFO"
--max_completed_executors_per_framework="150" --oversubscribed_resources_interval="15secs"
--perf_duration="10secs" --perf_interval="1mins" --port="5051" --qos_correction_interval_min="0ns"
--quiet="false" --recover="reconnect" --recovery_timeout="15mins" --registration_backoff_factor="10ms"
--resources="cpus:2;gpus:0;mem:1024;disk:1024;ports:[31000-32000]" --revocable_cpu_low_priority="true"
--runtime_dir="/tmp/Endpoint_SlaveEndpointTest_NoAuthorizer_0_nffgVa" --sandbox_directory="/mnt/mesos/sandbox"
--strict="true" --switch_user="true" --systemd_enable_support="true" --systemd_runtime_directory="/run/systemd/system"
--version="false" --work_dir="/tmp/Endpoint_SlaveEndpointTest_NoAuthorizer_0_eA2GAk"
I0704 04:07:59.045630 21586 credentials.hpp:86] Loading credential for authentication from
'/tmp/Endpoint_SlaveEndpointTest_NoAuthorizer_0_nffgVa/credential'
I0704 04:07:59.045764 21586 slave.cpp:264] Agent using credential for: test-principal
I0704 04:07:59.045785 21586 credentials.hpp:37] Loading credentials for authentication from
'/tmp/Endpoint_SlaveEndpointTest_NoAuthorizer_0_nffgVa/http_credentials'
I0704 04:07:59.046041 21586 http.cpp:975] Creating default 'basic' HTTP authenticator for
realm 'mesos-agent-executor'
I0704 04:07:59.046142 21586 http.cpp:996] Creating default 'jwt' HTTP authenticator for realm
'mesos-agent-executor'
I0704 04:07:59.046370 21586 http.cpp:975] Creating default 'basic' HTTP authenticator for
realm 'mesos-agent-readonly'
I0704 04:07:59.046480 21586 http.cpp:996] Creating default 'jwt' HTTP authenticator for realm
'mesos-agent-readonly'
I0704 04:07:59.046728 21586 http.cpp:975] Creating default 'basic' HTTP authenticator for
realm 'mesos-agent-readwrite'
I0704 04:07:59.046839 21586 http.cpp:996] Creating default 'jwt' HTTP authenticator for realm
'mesos-agent-readwrite'
I0704 04:07:59.048177 21586 slave.cpp:531] Agent resources: cpus(*):2; mem(*):1024; disk(*):1024;
ports(*):[31000-32000]
I0704 04:07:59.048264 21586 slave.cpp:539] Agent attributes: [  ]
I0704 04:07:59.048277 21586 slave.cpp:544] Agent hostname: c479a3a87b44
I0704 04:07:59.048403 21573 status_update_manager.cpp:177] Pausing sending status updates
I0704 04:07:59.049665 21585 state.cpp:62] Recovering state from '/tmp/Endpoint_SlaveEndpointTest_NoAuthorizer_0_eA2GAk/meta'
I0704 04:07:59.050034 21571 status_update_manager.cpp:203] Recovering status update manager
I0704 04:07:59.050266 21584 containerizer.cpp:608] Recovering containerizer
I0704 04:07:59.051673 21571 provisioner.cpp:410] Provisioner recovery complete
I0704 04:07:59.052109 21573 slave.cpp:6075] Finished recovery
I0704 04:07:59.052573 21573 slave.cpp:6257] Querying resource estimator for oversubscribable
resources
I0704 04:07:59.054438 21584 slave.cpp:6271] Received oversubscribable resources {} from the
resource estimator
I0704 04:07:59.056149 21568 process.cpp:3731] Handling HTTP event for process 'slave(747)'
with path: '/slave(747)/monitor/statistics'
I0704 04:07:59.057739 21588 http.cpp:1115] HTTP GET for /slave(747)/monitor/statistics from
172.17.0.7:55492
I0704 04:07:59.057814 21588 http.cpp:936] Authorizing principal 'test-principal' to GET the
'/monitor/statistics' endpoint
I0704 04:07:59.060505 21568 slave.cpp:796] Agent terminating
[       OK ] Endpoint/SlaveEndpointTest.NoAuthorizer/0 (29 ms)
[ RUN      ] Endpoint/SlaveEndpointTest.NoAuthorizer/1
I0704 04:07:59.070621  2251 containerizer.cpp:221] Using isolation: posix/cpu,posix/mem,filesystem/posix,network/cni
W0704 04:07:59.071100  2251 backend.cpp:76] Failed to create 'aufs' backend: AufsBackend requires
root privileges
W0704 04:07:59.071203  2251 backend.cpp:76] Failed to create 'bind' backend: BindBackend requires
root privileges
I0704 04:07:59.071244  2251 provisioner.cpp:249] Using default backend 'copy'
I0704 04:07:59.072672  2251 cluster.cpp:448] Creating default 'local' authorizer
I0704 04:07:59.074255 21568 slave.cpp:231] Mesos agent started on (748)@172.17.0.7:42921
I0704 04:07:59.074285 21568 slave.cpp:232] Flags at startup: --acls="" --appc_simple_discovery_uri_prefix="http://"
--appc_store_dir="/tmp/mesos/store/appc" --authenticate_http_executors="true" --authenticate_http_readonly="true"
--authenticate_http_readwrite="true" --authenticatee="crammd5" --authentication_backoff_factor="1secs"
--authorizer="local" --cgroups_cpu_enable_pids_and_tids_count="false" --cgroups_enable_cfs="false"
--cgroups_hierarchy="/sys/fs/cgroup" --cgroups_limit_swap="false" --cgroups_root="mesos" --container_disk_watch_interval="15secs"
--containerizers="mesos" --credential="/tmp/Endpoint_SlaveEndpointTest_NoAuthorizer_1_b1Qeuy/credential"
--default_role="*" --disk_watch_interval="1mins" --docker="docker" --docker_kill_orphans="true"
--docker_registry="https://registry-1.docker.io" --docker_remove_delay="6hrs" --docker_socket="/var/run/docker.sock"
--docker_stop_timeout="0ns" --docker_store_dir="/tmp/mesos/store/docker" --docker_volume_checkpoint_dir="/var/run/mesos/isolators/docker/volume"
--enforce_container_disk_quota="false" --executor_registration_timeout="1mins" --executor_reregistration_timeout="2secs"
--executor_secret_key="/tmp/Endpoint_SlaveEndpointTest_NoAuthorizer_1_b1Qeuy/executor_secret_key"
--executor_shutdown_grace_period="5secs" --fetcher_cache_dir="/tmp/Endpoint_SlaveEndpointTest_NoAuthorizer_1_b1Qeuy/fetch"
--fetcher_cache_size="2GB" --frameworks_home="" --gc_delay="1weeks" --gc_disk_headroom="0.1"
--hadoop_home="" --help="false" --hostname_lookup="true" --http_command_executor="false" --http_credentials="/tmp/Endpoint_SlaveEndpointTest_NoAuthorizer_1_b1Qeuy/http_credentials"
--http_heartbeat_interval="30secs" --initialize_driver_logging="true" --isolation="posix/cpu,posix/mem"
--launcher="posix" --launcher_dir="/mesos/mesos-1.3.1/_build/src" --logbufsecs="0" --logging_level="INFO"
--max_completed_executors_per_framework="150" --oversubscribed_resources_interval="15secs"
--perf_duration="10secs" --perf_interval="1mins" --port="5051" --qos_correction_interval_min="0ns"
--quiet="false" --recover="reconnect" --recovery_timeout="15mins" --registration_backoff_factor="10ms"
--resources="cpus:2;gpus:0;mem:1024;disk:1024;ports:[31000-32000]" --revocable_cpu_low_priority="true"
--runtime_dir="/tmp/Endpoint_SlaveEndpointTest_NoAuthorizer_1_b1Qeuy" --sandbox_directory="/mnt/mesos/sandbox"
--strict="true" --switch_user="true" --systemd_enable_support="true" --systemd_runtime_directory="/run/systemd/system"
--version="false" --work_dir="/tmp/Endpoint_SlaveEndpointTest_NoAuthorizer_1_Ehel5H"
I0704 04:07:59.074690 21568 credentials.hpp:86] Loading credential for authentication from
'/tmp/Endpoint_SlaveEndpointTest_NoAuthorizer_1_b1Qeuy/credential'
I0704 04:07:59.074826 21568 slave.cpp:264] Agent using credential for: test-principal
I0704 04:07:59.074846 21568 credentials.hpp:37] Loading credentials for authentication from
'/tmp/Endpoint_SlaveEndpointTest_NoAuthorizer_1_b1Qeuy/http_credentials'
I0704 04:07:59.075104 21568 http.cpp:975] Creating default 'basic' HTTP authenticator for
realm 'mesos-agent-executor'
I0704 04:07:59.075211 21568 http.cpp:996] Creating default 'jwt' HTTP authenticator for realm
'mesos-agent-executor'
I0704 04:07:59.075414 21568 http.cpp:975] Creating default 'basic' HTTP authenticator for
realm 'mesos-agent-readonly'
I0704 04:07:59.075542 21568 http.cpp:996] Creating default 'jwt' HTTP authenticator for realm
'mesos-agent-readonly'
I0704 04:07:59.075780 21568 http.cpp:975] Creating default 'basic' HTTP authenticator for
realm 'mesos-agent-readwrite'
I0704 04:07:59.075896 21568 http.cpp:996] Creating default 'jwt' HTTP authenticator for realm
'mesos-agent-readwrite'
I0704 04:07:59.077172 21568 slave.cpp:531] Agent resources: cpus(*):2; mem(*):1024; disk(*):1024;
ports(*):[31000-32000]
I0704 04:07:59.077257 21568 slave.cpp:539] Agent attributes: [  ]
I0704 04:07:59.077271 21568 slave.cpp:544] Agent hostname: c479a3a87b44
I0704 04:07:59.077384 21569 status_update_manager.cpp:177] Pausing sending status updates
I0704 04:07:59.078712 21582 state.cpp:62] Recovering state from '/tmp/Endpoint_SlaveEndpointTest_NoAuthorizer_1_Ehel5H/meta'
I0704 04:07:59.079057 21591 status_update_manager.cpp:203] Recovering status update manager
I0704 04:07:59.079239 21589 containerizer.cpp:608] Recovering containerizer
I0704 04:07:59.080597 21576 provisioner.cpp:410] Provisioner recovery complete
I0704 04:07:59.081045 21589 slave.cpp:6075] Finished recovery
I0704 04:07:59.081517 21589 slave.cpp:6257] Querying resource estimator for oversubscribable
resources
I0704 04:07:59.081742 21569 slave.cpp:6271] Received oversubscribable resources {} from the
resource estimator
I0704 04:07:59.083534 21570 process.cpp:3731] Handling HTTP event for process 'slave(748)'
with path: '/slave(748)/monitor/statistics.json'
I0704 04:07:59.085186 21578 http.cpp:1115] HTTP GET for /slave(748)/monitor/statistics.json
from 172.17.0.7:55494
I0704 04:07:59.085260 21578 http.cpp:936] Authorizing principal 'test-principal' to GET the
'/monitor/statistics.json' endpoint
I0704 04:07:59.088186 21571 slave.cpp:796] Agent terminating
[       OK ] Endpoint/SlaveEndpointTest.NoAuthorizer/1 (27 ms)
[ RUN      ] Endpoint/SlaveEndpointTest.NoAuthorizer/2
I0704 04:07:59.097877  2251 containerizer.cpp:221] Using isolation: posix/cpu,posix/mem,filesystem/posix,network/cni
W0704 04:07:59.098381  2251 backend.cpp:76] Failed to create 'aufs' backend: AufsBackend requires
root privileges
W0704 04:07:59.098487  2251 backend.cpp:76] Failed to create 'bind' backend: BindBackend requires
root privileges
I0704 04:07:59.098526  2251 provisioner.cpp:249] Using default backend 'copy'
I0704 04:07:59.100050  2251 cluster.cpp:448] Creating default 'local' authorizer
I0704 04:07:59.101519 21583 slave.cpp:231] Mesos agent started on (749)@172.17.0.7:42921
I0704 04:07:59.101547 21583 slave.cpp:232] Flags at startup: --acls="" --appc_simple_discovery_uri_prefix="http://"
--appc_store_dir="/tmp/mesos/store/appc" --authenticate_http_executors="true" --authenticate_http_readonly="true"
--authenticate_http_readwrite="true" --authenticatee="crammd5" --authentication_backoff_factor="1secs"
--authorizer="local" --cgroups_cpu_enable_pids_and_tids_count="false" --cgroups_enable_cfs="false"
--cgroups_hierarchy="/sys/fs/cgroup" --cgroups_limit_swap="false" --cgroups_root="mesos" --container_disk_watch_interval="15secs"
--containerizers="mesos" --credential="/tmp/Endpoint_SlaveEndpointTest_NoAuthorizer_2_XpGJjW/credential"
--default_role="*" --disk_watch_interval="1mins" --docker="docker" --docker_kill_orphans="true"
--docker_registry="https://registry-1.docker.io" --docker_remove_delay="6hrs" --docker_socket="/var/run/docker.sock"
--docker_stop_timeout="0ns" --docker_store_dir="/tmp/mesos/store/docker" --docker_volume_checkpoint_dir="/var/run/mesos/isolators/docker/volume"
--enforce_container_disk_quota="false" --executor_registration_timeout="1mins" --executor_reregistration_timeout="2secs"
--executor_secret_key="/tmp/Endpoint_SlaveEndpointTest_NoAuthorizer_2_XpGJjW/executor_secret_key"
--executor_shutdown_grace_period="5secs" --fetcher_cache_dir="/tmp/Endpoint_SlaveEndpointTest_NoAuthorizer_2_XpGJjW/fetch"
--fetcher_cache_size="2GB" --frameworks_home="" --gc_delay="1weeks" --gc_disk_headroom="0.1"
--hadoop_home="" --help="false" --hostname_lookup="true" --http_command_executor="false" --http_credentials="/tmp/Endpoint_SlaveEndpointTest_NoAuthorizer_2_XpGJjW/http_credentials"
--http_heartbeat_interval="30secs" --initialize_driver_logging="true" --isolation="posix/cpu,posix/mem"
--launcher="posix" --launcher_dir="/mesos/mesos-1.3.1/_build/src" --logbufsecs="0" --logging_level="INFO"
--max_completed_executors_per_framework="150" --oversubscribed_resources_interval="15secs"
--perf_duration="10secs" --perf_interval="1mins" --port="5051" --qos_correction_interval_min="0ns"
--quiet="false" --recover="reconnect" --recovery_timeout="15mins" --registration_backoff_factor="10ms"
--resources="cpus:2;gpus:0;mem:1024;disk:1024;ports:[31000-32000]" --revocable_cpu_low_priority="true"
--runtime_dir="/tmp/Endpoint_SlaveEndpointTest_NoAuthorizer_2_XpGJjW" --sandbox_directory="/mnt/mesos/sandbox"
--strict="true" --switch_user="true" --systemd_enable_support="true" --systemd_runtime_directory="/run/systemd/system"
--version="false" --work_dir="/tmp/Endpoint_SlaveEndpointTest_NoAuthorizer_2_CEOLQ5"
I0704 04:07:59.101958 21583 credentials.hpp:86] Loading credential for authentication from
'/tmp/Endpoint_SlaveEndpointTest_NoAuthorizer_2_XpGJjW/credential'
I0704 04:07:59.102095 21583 slave.cpp:264] Agent using credential for: test-principal
I0704 04:07:59.102118 21583 credentials.hpp:37] Loading credentials for authentication from
'/tmp/Endpoint_SlaveEndpointTest_NoAuthorizer_2_XpGJjW/http_credentials'
I0704 04:07:59.102394 21583 http.cpp:975] Creating default 'basic' HTTP authenticator for
realm 'mesos-agent-executor'
I0704 04:07:59.102497 21583 http.cpp:996] Creating default 'jwt' HTTP authenticator for realm
'mesos-agent-executor'
I0704 04:07:59.102720 21583 http.cpp:975] Creating default 'basic' HTTP authenticator for
realm 'mesos-agent-readonly'
I0704 04:07:59.102815 21583 http.cpp:996] Creating default 'jwt' HTTP authenticator for realm
'mesos-agent-readonly'
I0704 04:07:59.102993 21583 http.cpp:975] Creating default 'basic' HTTP authenticator for
realm 'mesos-agent-readwrite'
I0704 04:07:59.103130 21583 http.cpp:996] Creating default 'jwt' HTTP authenticator for realm
'mesos-agent-readwrite'
I0704 04:07:59.104497 21583 slave.cpp:531] Agent resources: cpus(*):2; mem(*):1024; disk(*):1024;
ports(*):[31000-32000]
I0704 04:07:59.104583 21583 slave.cpp:539] Agent attributes: [  ]
I0704 04:07:59.104595 21583 slave.cpp:544] Agent hostname: c479a3a87b44
I0704 04:07:59.104735 21588 status_update_manager.cpp:177] Pausing sending status updates
I0704 04:07:59.105918 21582 state.cpp:62] Recovering state from '/tmp/Endpoint_SlaveEndpointTest_NoAuthorizer_2_CEOLQ5/meta'
I0704 04:07:59.106199 21579 status_update_manager.cpp:203] Recovering status update manager
I0704 04:07:59.106454 21573 containerizer.cpp:608] Recovering containerizer
I0704 04:07:59.107728 21587 provisioner.cpp:410] Provisioner recovery complete
I0704 04:07:59.108131 21570 slave.cpp:6075] Finished recovery
I0704 04:07:59.108626 21570 slave.cpp:6257] Querying resource estimator for oversubscribable
resources
I0704 04:07:59.108860 21570 slave.cpp:6271] Received oversubscribable resources {} from the
resource estimator
I0704 04:07:59.110643 21578 process.cpp:3731] Handling HTTP event for process 'slave(749)'
with path: '/slave(749)/containers'
I0704 04:07:59.112237 21582 http.cpp:1115] HTTP GET for /slave(749)/containers from 172.17.0.7:55496
I0704 04:07:59.112305 21582 http.cpp:936] Authorizing principal 'test-principal' to GET the
'/containers' endpoint
I0704 04:07:59.115866 21576 slave.cpp:796] Agent terminating
[       OK ] Endpoint/SlaveEndpointTest.NoAuthorizer/2 (27 ms)
[----------] 9 tests from Endpoint/SlaveEndpointTest (250 ms total)

[----------] Global test environment tear-down
[==========] 1575 tests from 177 test cases ran. (571822 ms total)
[  PASSED  ] 1572 tests.
[  FAILED  ] 3 tests, listed below:
[  FAILED  ] DefaultExecutorCheckTest.CommandCheckDeliveredAndReconciled
[  FAILED  ] DefaultExecutorCheckTest.CommandCheckStatusChange
[  FAILED  ] DefaultExecutorCheckTest.CommandCheckTimeout

 3 FAILED TESTS
  YOU HAVE 22 DISABLED TESTS

E0704 04:07:59.179541 21592 process.cpp:951] Failed to accept socket: future discarded
make[4]: *** [check-local] Error 1
make[4]: Leaving directory `/mesos/mesos-1.3.1/_build/src'
make[3]: *** [check-am] Error 2
make[3]: Leaving directory `/mesos/mesos-1.3.1/_build/src'
make[2]: *** [check] Error 2
make[2]: Leaving directory `/mesos/mesos-1.3.1/_build/src'
make[1]: *** [check-recursive] Error 1
make[1]: Leaving directory `/mesos/mesos-1.3.1/_build'
make: *** [distcheck] Error 1
+ docker rmi mesos-1499138788-1105
Untagged: mesos-1499138788-1105:latest
Deleted: sha256:42ad6dc06034541f57c3b2247dc4bffabf65817d5151e1d76058ded5420fb0c6
Deleted: sha256:e2eecef1f5c8a36293341d04f56fcc14915ec008a075986421f45ec67cb1a953
Deleted: sha256:17764d0b5ad2d849ebbf0e58a55708723d705ebfd4277fbdd227543a52f5304d
Deleted: sha256:0385ea2de89ac372e9a3cac16e7af050963a074825ed0d9dd0d12c6b511b903e
Deleted: sha256:fd81bb927e92e0da436c9e252788f4b9dbfbf3ecd0e60f0284ccc924aecfc3d7
Deleted: sha256:3c49d566e0e1171f6e03fdec8cc7292048737e3715ebca447ec99262920800f3
Deleted: sha256:aa591c9351b484444e5ad9103a7e763b56f68eaa0e2cc3d2bc0e40a92f82acf9
Deleted: sha256:56e83cc2e6bca90e12b3598db8d28fb66dbca9db1d31669e9cb56b6d16857788
Deleted: sha256:1bb6006d4c901e2a17a033e1805ebe14081d60f7636209b7ac12b4b226f5566c
Deleted: sha256:6712913c8711720274b83f1745a93ef9ebfe957b06bbc522a1274985fd75c9dc
Deleted: sha256:be28e21e66e176588f9074f993ed7051e838a6f53af64a06e98dddfdd42b551b
Deleted: sha256:1a5826e80eeeee6081360f167f8a17f0b087c1edae8bb2c3b249e77e374924bc
Deleted: sha256:9f5fd1f91be5555d6ccb06a7d98409b69036c6b0854287d44ea7613ba1b8f299
Deleted: sha256:b4f9305c7d06c33dc1f64ddaa248a46cfda3ea262a647d93889da7f771119a16
Deleted: sha256:6d4a286ac35e576fb4062ae9d0770b3d0c9eee00cd4f8d460dc2ab3a2c301691
Deleted: sha256:3d54744419e877323d161f6ca325c9b9285ac022b23e444add7863a088f5caf5
Deleted: sha256:479cd69a834d148993817e9b89747120e6b771949465735685d1a256be7ff3be
Deleted: sha256:f5ac5d0ff62ffd4593f8ca029aa518b46c951db6bde77e8a495cb0f5ab3b3415
Deleted: sha256:21892289b99d62ea6cbc5f4ccbe3583e880085e50c7a2a28b2d8f7e646c2c247
Deleted: sha256:e769619f95b3ed0eb63807da7f56660e73708ed71b14f4ec5f781a98e38e4d0a
Deleted: sha256:5feb158f026f28e9ec7b911a220b92e68743e73d7a94e0ae3b3a0546a06958a8
Deleted: sha256:2b1052757fb614a6e40cbbdbbf6acfe2f59a5b75cd01fe03d1f30c7f5cda74f4
Deleted: sha256:983bc6e043046259dadace2ed68de038a61eef881b0899a6878cb240e6f2c8da
Deleted: sha256:618f3736654b5f6d172fcbb8216917adf43f66d6b288ca0a048119907603414a
Deleted: sha256:d642106ca212b5f0a07735db0c0c3cee8f0cdb42619dd88a7f17074195aa6fa9
Build step 'Execute shell' marked build as failure
Not sending mail to unregistered user toenshoff@me.com

Mime
View raw message