mesos-builds mailing list archives

Site index · List index
Message view « Date » · « Thread »
Top « Date » · « Thread »
From Apache Jenkins Server <jenk...@builds.apache.org>
Subject Build failed in Jenkins: Mesos-Buildbot » autotools,gcc,--verbose --enable-libevent --enable-ssl,GLOG_v=1 MESOS_VERBOSE=1,centos:7,(ubuntu)&&(!ubuntu-us1)&&(!ubuntu-eu2) #4024
Date Mon, 31 Jul 2017 18:42:38 GMT
See <https://builds.apache.org/job/Mesos-Buildbot/BUILDTOOL=autotools,COMPILER=gcc,CONFIGURATION=--verbose%20--enable-libevent%20--enable-ssl,ENVIRONMENT=GLOG_v=1%20MESOS_VERBOSE=1,OS=centos%3A7,label_exp=(ubuntu)&&(!ubuntu-us1)&&(!ubuntu-eu2)/4024/display/redirect?page=changes>

Changes:

[yujie.jay] Add Verizon Labs to list of organizations using Mesos.

------------------------------------------
[...truncated 31.73 MB...]
[ RUN      ] Endpoint/SlaveEndpointTest.UnauthorizedRequest/0
I0731 18:42:28.849251  9347 containerizer.cpp:230] Using isolation: posix/cpu,posix/mem,filesystem/posix,network/cni,environment_secret
W0731 18:42:28.849735  9347 backend.cpp:76] Failed to create 'aufs' backend: AufsBackend requires
root privileges
W0731 18:42:28.849846  9347 backend.cpp:76] Failed to create 'bind' backend: BindBackend requires
root privileges
I0731 18:42:28.849895  9347 provisioner.cpp:255] Using default backend 'copy'
I0731 18:42:28.853642 30178 slave.cpp:250] Mesos agent started on (799)@172.17.0.6:43622
I0731 18:42:28.853673 30178 slave.cpp:251] Flags at startup: --acls="" --appc_simple_discovery_uri_prefix="http://"
--appc_store_dir="/tmp/Endpoint_SlaveEndpointTest_UnauthorizedRequest_0_bkqrho/store/appc"
--authenticate_http_executors="true" --authenticate_http_readonly="true" --authenticate_http_readwrite="true"
--authenticatee="crammd5" --authentication_backoff_factor="1secs" --authorizer="local" --cgroups_cpu_enable_pids_and_tids_count="false"
--cgroups_enable_cfs="false" --cgroups_hierarchy="/sys/fs/cgroup" --cgroups_limit_swap="false"
--cgroups_root="mesos" --container_disk_watch_interval="15secs" --containerizers="mesos" --credential="/tmp/Endpoint_SlaveEndpointTest_UnauthorizedRequest_0_bkqrho/credential"
--default_role="*" --disk_watch_interval="1mins" --docker="docker" --docker_kill_orphans="true"
--docker_registry="https://registry-1.docker.io" --docker_remove_delay="6hrs" --docker_socket="/var/run/docker.sock"
--docker_stop_timeout="0ns" --docker_store_dir="/tmp/Endpoint_SlaveEndpointTest_UnauthorizedRequest_0_bkqrho/store/docker"
--docker_volume_checkpoint_dir="/var/run/mesos/isolators/docker/volume" --enforce_container_disk_quota="false"
--executor_registration_timeout="1mins" --executor_reregistration_timeout="2secs" --executor_secret_key="/tmp/Endpoint_SlaveEndpointTest_UnauthorizedRequest_0_bkqrho/executor_secret_key"
--executor_shutdown_grace_period="5secs" --fetcher_cache_dir="/tmp/Endpoint_SlaveEndpointTest_UnauthorizedRequest_0_bkqrho/fetch"
--fetcher_cache_size="2GB" --frameworks_home="" --gc_delay="1weeks" --gc_disk_headroom="0.1"
--hadoop_home="" --help="false" --hostname_lookup="true" --http_command_executor="false" --http_credentials="/tmp/Endpoint_SlaveEndpointTest_UnauthorizedRequest_0_bkqrho/http_credentials"
--http_heartbeat_interval="30secs" --initialize_driver_logging="true" --isolation="posix/cpu,posix/mem"
--launcher="posix" --launcher_dir="/mesos/mesos-1.4.0/_build/src" --logbufsecs="0" --logging_level="INFO"
--max_completed_executors_per_framework="150" --oversubscribed_resources_interval="15secs"
--perf_duration="10secs" --perf_interval="1mins" --port="5051" --qos_correction_interval_min="0ns"
--quiet="false" --recover="reconnect" --recovery_timeout="15mins" --registration_backoff_factor="10ms"
--resources="cpus:2;gpus:0;mem:1024;disk:1024;ports:[31000-32000]" --revocable_cpu_low_priority="true"
--runtime_dir="/tmp/Endpoint_SlaveEndpointTest_UnauthorizedRequest_0_bkqrho" --sandbox_directory="/mnt/mesos/sandbox"
--strict="true" --switch_user="true" --systemd_enable_support="true" --systemd_runtime_directory="/run/systemd/system"
--version="false" --work_dir="/tmp/Endpoint_SlaveEndpointTest_UnauthorizedRequest_0_Hb6Kd5"
I0731 18:42:28.854245 30178 credentials.hpp:86] Loading credential for authentication from
'/tmp/Endpoint_SlaveEndpointTest_UnauthorizedRequest_0_bkqrho/credential'
I0731 18:42:28.854491 30178 slave.cpp:283] Agent using credential for: test-principal
I0731 18:42:28.854523 30178 credentials.hpp:37] Loading credentials for authentication from
'/tmp/Endpoint_SlaveEndpointTest_UnauthorizedRequest_0_bkqrho/http_credentials'
I0731 18:42:28.854936 30178 http.cpp:993] Creating default 'basic' HTTP authenticator for
realm 'mesos-agent-executor'
I0731 18:42:28.855079 30178 http.cpp:1014] Creating default 'jwt' HTTP authenticator for realm
'mesos-agent-executor'
I0731 18:42:28.855324 30178 http.cpp:993] Creating default 'basic' HTTP authenticator for
realm 'mesos-agent-readonly'
I0731 18:42:28.855422 30178 http.cpp:1014] Creating default 'jwt' HTTP authenticator for realm
'mesos-agent-readonly'
I0731 18:42:28.855602 30178 http.cpp:993] Creating default 'basic' HTTP authenticator for
realm 'mesos-agent-readwrite'
I0731 18:42:28.855707 30178 http.cpp:1014] Creating default 'jwt' HTTP authenticator for realm
'mesos-agent-readwrite'
I0731 18:42:28.857096 30178 slave.cpp:565] Agent resources: [{"name":"cpus","scalar":{"value":2.0},"type":"SCALAR"},{"name":"mem","scalar":{"value":1024.0},"type":"SCALAR"},{"name":"disk","scalar":{"value":1024.0},"type":"SCALAR"},{"name":"ports","ranges":{"range":[{"begin":31000,"end":32000}]},"type":"RANGES"}]
I0731 18:42:28.857323 30178 slave.cpp:573] Agent attributes: [  ]
I0731 18:42:28.857349 30178 slave.cpp:582] Agent hostname: e215e91f41f7
I0731 18:42:28.857480 30166 status_update_manager.cpp:177] Pausing sending status updates
I0731 18:42:28.858950 30175 state.cpp:64] Recovering state from '/tmp/Endpoint_SlaveEndpointTest_UnauthorizedRequest_0_Hb6Kd5/meta'
I0731 18:42:28.859302 30179 status_update_manager.cpp:203] Recovering status update manager
I0731 18:42:28.859495 30170 containerizer.cpp:582] Recovering containerizer
I0731 18:42:28.860810 30174 provisioner.cpp:416] Provisioner recovery complete
I0731 18:42:28.861107 30164 slave.cpp:6207] Finished recovery
I0731 18:42:28.861670 30164 slave.cpp:6389] Querying resource estimator for oversubscribable
resources
I0731 18:42:28.861927 30182 slave.cpp:6403] Received oversubscribable resources {} from the
resource estimator
I0731 18:42:28.864472 30176 process.cpp:3836] Handling HTTP event for process 'slave(799)'
with path: '/slave(799)/monitor/statistics'
I0731 18:42:28.866158 30183 http.cpp:1133] HTTP GET for /slave(799)/monitor/statistics from
172.17.0.6:37504
I0731 18:42:28.866261 30183 http.cpp:957] Authorizing principal 'test-principal' to GET the
'/monitor/statistics' endpoint
I0731 18:42:28.868160 30182 slave.cpp:843] Agent terminating
[       OK ] Endpoint/SlaveEndpointTest.UnauthorizedRequest/0 (30 ms)
[ RUN      ] Endpoint/SlaveEndpointTest.UnauthorizedRequest/1
I0731 18:42:28.878666  9347 containerizer.cpp:230] Using isolation: posix/cpu,posix/mem,filesystem/posix,network/cni,environment_secret
W0731 18:42:28.879187  9347 backend.cpp:76] Failed to create 'aufs' backend: AufsBackend requires
root privileges
W0731 18:42:28.879302  9347 backend.cpp:76] Failed to create 'bind' backend: BindBackend requires
root privileges
I0731 18:42:28.879341  9347 provisioner.cpp:255] Using default backend 'copy'
I0731 18:42:28.882375 30169 slave.cpp:250] Mesos agent started on (800)@172.17.0.6:43622
I0731 18:42:28.882402 30169 slave.cpp:251] Flags at startup: --acls="" --appc_simple_discovery_uri_prefix="http://"
--appc_store_dir="/tmp/Endpoint_SlaveEndpointTest_UnauthorizedRequest_1_IwfDLC/store/appc"
--authenticate_http_executors="true" --authenticate_http_readonly="true" --authenticate_http_readwrite="true"
--authenticatee="crammd5" --authentication_backoff_factor="1secs" --authorizer="local" --cgroups_cpu_enable_pids_and_tids_count="false"
--cgroups_enable_cfs="false" --cgroups_hierarchy="/sys/fs/cgroup" --cgroups_limit_swap="false"
--cgroups_root="mesos" --container_disk_watch_interval="15secs" --containerizers="mesos" --credential="/tmp/Endpoint_SlaveEndpointTest_UnauthorizedRequest_1_IwfDLC/credential"
--default_role="*" --disk_watch_interval="1mins" --docker="docker" --docker_kill_orphans="true"
--docker_registry="https://registry-1.docker.io" --docker_remove_delay="6hrs" --docker_socket="/var/run/docker.sock"
--docker_stop_timeout="0ns" --docker_store_dir="/tmp/Endpoint_SlaveEndpointTest_UnauthorizedRequest_1_IwfDLC/store/docker"
--docker_volume_checkpoint_dir="/var/run/mesos/isolators/docker/volume" --enforce_container_disk_quota="false"
--executor_registration_timeout="1mins" --executor_reregistration_timeout="2secs" --executor_secret_key="/tmp/Endpoint_SlaveEndpointTest_UnauthorizedRequest_1_IwfDLC/executor_secret_key"
--executor_shutdown_grace_period="5secs" --fetcher_cache_dir="/tmp/Endpoint_SlaveEndpointTest_UnauthorizedRequest_1_IwfDLC/fetch"
--fetcher_cache_size="2GB" --frameworks_home="" --gc_delay="1weeks" --gc_disk_headroom="0.1"
--hadoop_home="" --help="false" --hostname_lookup="true" --http_command_executor="false" --http_credentials="/tmp/Endpoint_SlaveEndpointTest_UnauthorizedRequest_1_IwfDLC/http_credentials"
--http_heartbeat_interval="30secs" --initialize_driver_logging="true" --isolation="posix/cpu,posix/mem"
--launcher="posix" --launcher_dir="/mesos/mesos-1.4.0/_build/src" --logbufsecs="0" --logging_level="INFO"
--max_completed_executors_per_framework="150" --oversubscribed_resources_interval="15secs"
--perf_duration="10secs" --perf_interval="1mins" --port="5051" --qos_correction_interval_min="0ns"
--quiet="false" --recover="reconnect" --recovery_timeout="15mins" --registration_backoff_factor="10ms"
--resources="cpus:2;gpus:0;mem:1024;disk:1024;ports:[31000-32000]" --revocable_cpu_low_priority="true"
--runtime_dir="/tmp/Endpoint_SlaveEndpointTest_UnauthorizedRequest_1_IwfDLC" --sandbox_directory="/mnt/mesos/sandbox"
--strict="true" --switch_user="true" --systemd_enable_support="true" --systemd_runtime_directory="/run/systemd/system"
--version="false" --work_dir="/tmp/Endpoint_SlaveEndpointTest_UnauthorizedRequest_1_ekmsDj"
I0731 18:42:28.882930 30169 credentials.hpp:86] Loading credential for authentication from
'/tmp/Endpoint_SlaveEndpointTest_UnauthorizedRequest_1_IwfDLC/credential'
I0731 18:42:28.883131 30169 slave.cpp:283] Agent using credential for: test-principal
I0731 18:42:28.883160 30169 credentials.hpp:37] Loading credentials for authentication from
'/tmp/Endpoint_SlaveEndpointTest_UnauthorizedRequest_1_IwfDLC/http_credentials'
I0731 18:42:28.883499 30169 http.cpp:993] Creating default 'basic' HTTP authenticator for
realm 'mesos-agent-executor'
I0731 18:42:28.883641 30169 http.cpp:1014] Creating default 'jwt' HTTP authenticator for realm
'mesos-agent-executor'
I0731 18:42:28.883850 30169 http.cpp:993] Creating default 'basic' HTTP authenticator for
realm 'mesos-agent-readonly'
I0731 18:42:28.883944 30169 http.cpp:1014] Creating default 'jwt' HTTP authenticator for realm
'mesos-agent-readonly'
I0731 18:42:28.884125 30169 http.cpp:993] Creating default 'basic' HTTP authenticator for
realm 'mesos-agent-readwrite'
I0731 18:42:28.884218 30169 http.cpp:1014] Creating default 'jwt' HTTP authenticator for realm
'mesos-agent-readwrite'
I0731 18:42:28.885640 30169 slave.cpp:565] Agent resources: [{"name":"cpus","scalar":{"value":2.0},"type":"SCALAR"},{"name":"mem","scalar":{"value":1024.0},"type":"SCALAR"},{"name":"disk","scalar":{"value":1024.0},"type":"SCALAR"},{"name":"ports","ranges":{"range":[{"begin":31000,"end":32000}]},"type":"RANGES"}]
I0731 18:42:28.885893 30169 slave.cpp:573] Agent attributes: [  ]
I0731 18:42:28.885908 30169 slave.cpp:582] Agent hostname: e215e91f41f7
I0731 18:42:28.886036 30177 status_update_manager.cpp:177] Pausing sending status updates
I0731 18:42:28.887580 30165 state.cpp:64] Recovering state from '/tmp/Endpoint_SlaveEndpointTest_UnauthorizedRequest_1_ekmsDj/meta'
I0731 18:42:28.887863 30180 status_update_manager.cpp:203] Recovering status update manager
I0731 18:42:28.888062 30166 containerizer.cpp:582] Recovering containerizer
I0731 18:42:28.889348 30168 provisioner.cpp:416] Provisioner recovery complete
I0731 18:42:28.889693 30164 slave.cpp:6207] Finished recovery
I0731 18:42:28.890311 30164 slave.cpp:6389] Querying resource estimator for oversubscribable
resources
I0731 18:42:28.890583 30173 slave.cpp:6403] Received oversubscribable resources {} from the
resource estimator
I0731 18:42:28.892992 30185 process.cpp:3836] Handling HTTP event for process 'slave(800)'
with path: '/slave(800)/monitor/statistics.json'
I0731 18:42:28.894680 30180 http.cpp:1133] HTTP GET for /slave(800)/monitor/statistics.json
from 172.17.0.6:37510
I0731 18:42:28.894773 30180 http.cpp:957] Authorizing principal 'test-principal' to GET the
'/monitor/statistics.json' endpoint
I0731 18:42:28.896411 30174 slave.cpp:843] Agent terminating
[       OK ] Endpoint/SlaveEndpointTest.UnauthorizedRequest/1 (29 ms)
[ RUN      ] Endpoint/SlaveEndpointTest.UnauthorizedRequest/2
I0731 18:42:28.907646  9347 containerizer.cpp:230] Using isolation: posix/cpu,posix/mem,filesystem/posix,network/cni,environment_secret
W0731 18:42:28.908154  9347 backend.cpp:76] Failed to create 'aufs' backend: AufsBackend requires
root privileges
W0731 18:42:28.908251  9347 backend.cpp:76] Failed to create 'bind' backend: BindBackend requires
root privileges
I0731 18:42:28.908284  9347 provisioner.cpp:255] Using default backend 'copy'
I0731 18:42:28.911258 30165 slave.cpp:250] Mesos agent started on (801)@172.17.0.6:43622
I0731 18:42:28.911278 30165 slave.cpp:251] Flags at startup: --acls="" --appc_simple_discovery_uri_prefix="http://"
--appc_store_dir="/tmp/Endpoint_SlaveEndpointTest_UnauthorizedRequest_2_WIEYwR/store/appc"
--authenticate_http_executors="true" --authenticate_http_readonly="true" --authenticate_http_readwrite="true"
--authenticatee="crammd5" --authentication_backoff_factor="1secs" --authorizer="local" --cgroups_cpu_enable_pids_and_tids_count="false"
--cgroups_enable_cfs="false" --cgroups_hierarchy="/sys/fs/cgroup" --cgroups_limit_swap="false"
--cgroups_root="mesos" --container_disk_watch_interval="15secs" --containerizers="mesos" --credential="/tmp/Endpoint_SlaveEndpointTest_UnauthorizedRequest_2_WIEYwR/credential"
--default_role="*" --disk_watch_interval="1mins" --docker="docker" --docker_kill_orphans="true"
--docker_registry="https://registry-1.docker.io" --docker_remove_delay="6hrs" --docker_socket="/var/run/docker.sock"
--docker_stop_timeout="0ns" --docker_store_dir="/tmp/Endpoint_SlaveEndpointTest_UnauthorizedRequest_2_WIEYwR/store/docker"
--docker_volume_checkpoint_dir="/var/run/mesos/isolators/docker/volume" --enforce_container_disk_quota="false"
--executor_registration_timeout="1mins" --executor_reregistration_timeout="2secs" --executor_secret_key="/tmp/Endpoint_SlaveEndpointTest_UnauthorizedRequest_2_WIEYwR/executor_secret_key"
--executor_shutdown_grace_period="5secs" --fetcher_cache_dir="/tmp/Endpoint_SlaveEndpointTest_UnauthorizedRequest_2_WIEYwR/fetch"
--fetcher_cache_size="2GB" --frameworks_home="" --gc_delay="1weeks" --gc_disk_headroom="0.1"
--hadoop_home="" --help="false" --hostname_lookup="true" --http_command_executor="false" --http_credentials="/tmp/Endpoint_SlaveEndpointTest_UnauthorizedRequest_2_WIEYwR/http_credentials"
--http_heartbeat_interval="30secs" --initialize_driver_logging="true" --isolation="posix/cpu,posix/mem"
--launcher="posix" --launcher_dir="/mesos/mesos-1.4.0/_build/src" --logbufsecs="0" --logging_level="INFO"
--max_completed_executors_per_framework="150" --oversubscribed_resources_interval="15secs"
--perf_duration="10secs" --perf_interval="1mins" --port="5051" --qos_correction_interval_min="0ns"
--quiet="false" --recover="reconnect" --recovery_timeout="15mins" --registration_backoff_factor="10ms"
--resources="cpus:2;gpus:0;mem:1024;disk:1024;ports:[31000-32000]" --revocable_cpu_low_priority="true"
--runtime_dir="/tmp/Endpoint_SlaveEndpointTest_UnauthorizedRequest_2_WIEYwR" --sandbox_directory="/mnt/mesos/sandbox"
--strict="true" --switch_user="true" --systemd_enable_support="true" --systemd_runtime_directory="/run/systemd/system"
--version="false" --work_dir="/tmp/Endpoint_SlaveEndpointTest_UnauthorizedRequest_2_bXZuky"
I0731 18:42:28.911669 30165 credentials.hpp:86] Loading credential for authentication from
'/tmp/Endpoint_SlaveEndpointTest_UnauthorizedRequest_2_WIEYwR/credential'
I0731 18:42:28.911867 30165 slave.cpp:283] Agent using credential for: test-principal
I0731 18:42:28.911890 30165 credentials.hpp:37] Loading credentials for authentication from
'/tmp/Endpoint_SlaveEndpointTest_UnauthorizedRequest_2_WIEYwR/http_credentials'
I0731 18:42:28.912184 30165 http.cpp:993] Creating default 'basic' HTTP authenticator for
realm 'mesos-agent-executor'
I0731 18:42:28.912310 30165 http.cpp:1014] Creating default 'jwt' HTTP authenticator for realm
'mesos-agent-executor'
I0731 18:42:28.912478 30165 http.cpp:993] Creating default 'basic' HTTP authenticator for
realm 'mesos-agent-readonly'
I0731 18:42:28.912559 30165 http.cpp:1014] Creating default 'jwt' HTTP authenticator for realm
'mesos-agent-readonly'
I0731 18:42:28.912698 30165 http.cpp:993] Creating default 'basic' HTTP authenticator for
realm 'mesos-agent-readwrite'
I0731 18:42:28.912771 30165 http.cpp:1014] Creating default 'jwt' HTTP authenticator for realm
'mesos-agent-readwrite'
I0731 18:42:28.914055 30165 slave.cpp:565] Agent resources: [{"name":"cpus","scalar":{"value":2.0},"type":"SCALAR"},{"name":"mem","scalar":{"value":1024.0},"type":"SCALAR"},{"name":"disk","scalar":{"value":1024.0},"type":"SCALAR"},{"name":"ports","ranges":{"range":[{"begin":31000,"end":32000}]},"type":"RANGES"}]
I0731 18:42:28.914305 30165 slave.cpp:573] Agent attributes: [  ]
I0731 18:42:28.914326 30165 slave.cpp:582] Agent hostname: e215e91f41f7
I0731 18:42:28.914448 30179 status_update_manager.cpp:177] Pausing sending status updates
I0731 18:42:28.916008 30181 state.cpp:64] Recovering state from '/tmp/Endpoint_SlaveEndpointTest_UnauthorizedRequest_2_bXZuky/meta'
I0731 18:42:28.916287 30173 status_update_manager.cpp:203] Recovering status update manager
I0731 18:42:28.916440 30171 containerizer.cpp:582] Recovering containerizer
I0731 18:42:28.917747 30164 provisioner.cpp:416] Provisioner recovery complete
I0731 18:42:28.918073 30174 slave.cpp:6207] Finished recovery
I0731 18:42:28.918634 30174 slave.cpp:6389] Querying resource estimator for oversubscribable
resources
I0731 18:42:28.918926 30169 slave.cpp:6403] Received oversubscribable resources {} from the
resource estimator
I0731 18:42:28.921682 30171 process.cpp:3836] Handling HTTP event for process 'slave(801)'
with path: '/slave(801)/containers'
I0731 18:42:28.923509 30184 http.cpp:1133] HTTP GET for /slave(801)/containers from 172.17.0.6:37512
I0731 18:42:28.923610 30184 http.cpp:957] Authorizing principal 'test-principal' to GET the
'/containers' endpoint
I0731 18:42:28.925400 30167 slave.cpp:843] Agent terminating
[       OK ] Endpoint/SlaveEndpointTest.UnauthorizedRequest/2 (28 ms)
[ RUN      ] Endpoint/SlaveEndpointTest.NoAuthorizer/0
I0731 18:42:28.936239  9347 containerizer.cpp:230] Using isolation: posix/cpu,posix/mem,filesystem/posix,network/cni,environment_secret
W0731 18:42:28.936760  9347 backend.cpp:76] Failed to create 'aufs' backend: AufsBackend requires
root privileges
W0731 18:42:28.936875  9347 backend.cpp:76] Failed to create 'bind' backend: BindBackend requires
root privileges
I0731 18:42:28.936908  9347 provisioner.cpp:255] Using default backend 'copy'
I0731 18:42:28.938452  9347 cluster.cpp:448] Creating default 'local' authorizer
I0731 18:42:28.941009 30163 slave.cpp:250] Mesos agent started on (802)@172.17.0.6:43622
I0731 18:42:28.941069 30163 slave.cpp:251] Flags at startup: --acls="" --appc_simple_discovery_uri_prefix="http://"
--appc_store_dir="/tmp/Endpoint_SlaveEndpointTest_NoAuthorizer_0_D4O9y6/store/appc" --authenticate_http_executors="true"
--authenticate_http_readonly="true" --authenticate_http_readwrite="true" --authenticatee="crammd5"
--authentication_backoff_factor="1secs" --authorizer="local" --cgroups_cpu_enable_pids_and_tids_count="false"
--cgroups_enable_cfs="false" --cgroups_hierarchy="/sys/fs/cgroup" --cgroups_limit_swap="false"
--cgroups_root="mesos" --container_disk_watch_interval="15secs" --containerizers="mesos" --credential="/tmp/Endpoint_SlaveEndpointTest_NoAuthorizer_0_D4O9y6/credential"
--default_role="*" --disk_watch_interval="1mins" --docker="docker" --docker_kill_orphans="true"
--docker_registry="https://registry-1.docker.io" --docker_remove_delay="6hrs" --docker_socket="/var/run/docker.sock"
--docker_stop_timeout="0ns" --docker_store_dir="/tmp/Endpoint_SlaveEndpointTest_NoAuthorizer_0_D4O9y6/store/docker"
--docker_volume_checkpoint_dir="/var/run/mesos/isolators/docker/volume" --enforce_container_disk_quota="false"
--executor_registration_timeout="1mins" --executor_reregistration_timeout="2secs" --executor_secret_key="/tmp/Endpoint_SlaveEndpointTest_NoAuthorizer_0_D4O9y6/executor_secret_key"
--executor_shutdown_grace_period="5secs" --fetcher_cache_dir="/tmp/Endpoint_SlaveEndpointTest_NoAuthorizer_0_D4O9y6/fetch"
--fetcher_cache_size="2GB" --frameworks_home="" --gc_delay="1weeks" --gc_disk_headroom="0.1"
--hadoop_home="" --help="false" --hostname_lookup="true" --http_command_executor="false" --http_credentials="/tmp/Endpoint_SlaveEndpointTest_NoAuthorizer_0_D4O9y6/http_credentials"
--http_heartbeat_interval="30secs" --initialize_driver_logging="true" --isolation="posix/cpu,posix/mem"
--launcher="posix" --launcher_dir="/mesos/mesos-1.4.0/_build/src" --logbufsecs="0" --logging_level="INFO"
--max_completed_executors_per_framework="150" --oversubscribed_resources_interval="15secs"
--perf_duration="10secs" --perf_interval="1mins" --port="5051" --qos_correction_interval_min="0ns"
--quiet="false" --recover="reconnect" --recovery_timeout="15mins" --registration_backoff_factor="10ms"
--resources="cpus:2;gpus:0;mem:1024;disk:1024;ports:[31000-32000]" --revocable_cpu_low_priority="true"
--runtime_dir="/tmp/Endpoint_SlaveEndpointTest_NoAuthorizer_0_D4O9y6" --sandbox_directory="/mnt/mesos/sandbox"
--strict="true" --switch_user="true" --systemd_enable_support="true" --systemd_runtime_directory="/run/systemd/system"
--version="false" --work_dir="/tmp/Endpoint_SlaveEndpointTest_NoAuthorizer_0_FQWtiN"
I0731 18:42:28.941711 30163 credentials.hpp:86] Loading credential for authentication from
'/tmp/Endpoint_SlaveEndpointTest_NoAuthorizer_0_D4O9y6/credential'
I0731 18:42:28.941995 30163 slave.cpp:283] Agent using credential for: test-principal
I0731 18:42:28.942025 30163 credentials.hpp:37] Loading credentials for authentication from
'/tmp/Endpoint_SlaveEndpointTest_NoAuthorizer_0_D4O9y6/http_credentials'
I0731 18:42:28.942497 30163 http.cpp:993] Creating default 'basic' HTTP authenticator for
realm 'mesos-agent-executor'
I0731 18:42:28.942657 30163 http.cpp:1014] Creating default 'jwt' HTTP authenticator for realm
'mesos-agent-executor'
I0731 18:42:28.942906 30163 http.cpp:993] Creating default 'basic' HTTP authenticator for
realm 'mesos-agent-readonly'
I0731 18:42:28.943022 30163 http.cpp:1014] Creating default 'jwt' HTTP authenticator for realm
'mesos-agent-readonly'
I0731 18:42:28.943226 30163 http.cpp:993] Creating default 'basic' HTTP authenticator for
realm 'mesos-agent-readwrite'
I0731 18:42:28.943331 30163 http.cpp:1014] Creating default 'jwt' HTTP authenticator for realm
'mesos-agent-readwrite'
I0731 18:42:28.945159 30163 slave.cpp:565] Agent resources: [{"name":"cpus","scalar":{"value":2.0},"type":"SCALAR"},{"name":"mem","scalar":{"value":1024.0},"type":"SCALAR"},{"name":"disk","scalar":{"value":1024.0},"type":"SCALAR"},{"name":"ports","ranges":{"range":[{"begin":31000,"end":32000}]},"type":"RANGES"}]
I0731 18:42:28.945468 30163 slave.cpp:573] Agent attributes: [  ]
I0731 18:42:28.945488 30163 slave.cpp:582] Agent hostname: e215e91f41f7
I0731 18:42:28.945703 30165 status_update_manager.cpp:177] Pausing sending status updates
I0731 18:42:28.947528 30170 state.cpp:64] Recovering state from '/tmp/Endpoint_SlaveEndpointTest_NoAuthorizer_0_FQWtiN/meta'
I0731 18:42:28.948042 30177 status_update_manager.cpp:203] Recovering status update manager
I0731 18:42:28.948304 30183 containerizer.cpp:582] Recovering containerizer
I0731 18:42:28.949862 30168 provisioner.cpp:416] Provisioner recovery complete
I0731 18:42:28.950430 30170 slave.cpp:6207] Finished recovery
I0731 18:42:28.951028 30170 slave.cpp:6389] Querying resource estimator for oversubscribable
resources
I0731 18:42:28.951349 30173 slave.cpp:6403] Received oversubscribable resources {} from the
resource estimator
I0731 18:42:28.954536 30167 process.cpp:3836] Handling HTTP event for process 'slave(802)'
with path: '/slave(802)/monitor/statistics'
I0731 18:42:28.956842 30177 http.cpp:1133] HTTP GET for /slave(802)/monitor/statistics from
172.17.0.6:37514
I0731 18:42:28.956930 30177 http.cpp:957] Authorizing principal 'test-principal' to GET the
'/monitor/statistics' endpoint
I0731 18:42:28.961308 30166 slave.cpp:843] Agent terminating
[       OK ] Endpoint/SlaveEndpointTest.NoAuthorizer/0 (37 ms)
[ RUN      ] Endpoint/SlaveEndpointTest.NoAuthorizer/1
I0731 18:42:28.973489  9347 containerizer.cpp:230] Using isolation: posix/cpu,posix/mem,filesystem/posix,network/cni,environment_secret
W0731 18:42:28.974117  9347 backend.cpp:76] Failed to create 'aufs' backend: AufsBackend requires
root privileges
W0731 18:42:28.974247  9347 backend.cpp:76] Failed to create 'bind' backend: BindBackend requires
root privileges
I0731 18:42:28.974298  9347 provisioner.cpp:255] Using default backend 'copy'
I0731 18:42:28.976135  9347 cluster.cpp:448] Creating default 'local' authorizer
I0731 18:42:28.977946 30175 slave.cpp:250] Mesos agent started on (803)@172.17.0.6:43622
I0731 18:42:28.977977 30175 slave.cpp:251] Flags at startup: --acls="" --appc_simple_discovery_uri_prefix="http://"
--appc_store_dir="/tmp/Endpoint_SlaveEndpointTest_NoAuthorizer_1_316zWl/store/appc" --authenticate_http_executors="true"
--authenticate_http_readonly="true" --authenticate_http_readwrite="true" --authenticatee="crammd5"
--authentication_backoff_factor="1secs" --authorizer="local" --cgroups_cpu_enable_pids_and_tids_count="false"
--cgroups_enable_cfs="false" --cgroups_hierarchy="/sys/fs/cgroup" --cgroups_limit_swap="false"
--cgroups_root="mesos" --container_disk_watch_interval="15secs" --containerizers="mesos" --credential="/tmp/Endpoint_SlaveEndpointTest_NoAuthorizer_1_316zWl/credential"
--default_role="*" --disk_watch_interval="1mins" --docker="docker" --docker_kill_orphans="true"
--docker_registry="https://registry-1.docker.io" --docker_remove_delay="6hrs" --docker_socket="/var/run/docker.sock"
--docker_stop_timeout="0ns" --docker_store_dir="/tmp/Endpoint_SlaveEndpointTest_NoAuthorizer_1_316zWl/store/docker"
--docker_volume_checkpoint_dir="/var/run/mesos/isolators/docker/volume" --enforce_container_disk_quota="false"
--executor_registration_timeout="1mins" --executor_reregistration_timeout="2secs" --executor_secret_key="/tmp/Endpoint_SlaveEndpointTest_NoAuthorizer_1_316zWl/executor_secret_key"
--executor_shutdown_grace_period="5secs" --fetcher_cache_dir="/tmp/Endpoint_SlaveEndpointTest_NoAuthorizer_1_316zWl/fetch"
--fetcher_cache_size="2GB" --frameworks_home="" --gc_delay="1weeks" --gc_disk_headroom="0.1"
--hadoop_home="" --help="false" --hostname_lookup="true" --http_command_executor="false" --http_credentials="/tmp/Endpoint_SlaveEndpointTest_NoAuthorizer_1_316zWl/http_credentials"
--http_heartbeat_interval="30secs" --initialize_driver_logging="true" --isolation="posix/cpu,posix/mem"
--launcher="posix" --launcher_dir="/mesos/mesos-1.4.0/_build/src" --logbufsecs="0" --logging_level="INFO"
--max_completed_executors_per_framework="150" --oversubscribed_resources_interval="15secs"
--perf_duration="10secs" --perf_interval="1mins" --port="5051" --qos_correction_interval_min="0ns"
--quiet="false" --recover="reconnect" --recovery_timeout="15mins" --registration_backoff_factor="10ms"
--resources="cpus:2;gpus:0;mem:1024;disk:1024;ports:[31000-32000]" --revocable_cpu_low_priority="true"
--runtime_dir="/tmp/Endpoint_SlaveEndpointTest_NoAuthorizer_1_316zWl" --sandbox_directory="/mnt/mesos/sandbox"
--strict="true" --switch_user="true" --systemd_enable_support="true" --systemd_runtime_directory="/run/systemd/system"
--version="false" --work_dir="/tmp/Endpoint_SlaveEndpointTest_NoAuthorizer_1_0q0pA2"
I0731 18:42:28.978652 30175 credentials.hpp:86] Loading credential for authentication from
'/tmp/Endpoint_SlaveEndpointTest_NoAuthorizer_1_316zWl/credential'
I0731 18:42:28.978868 30175 slave.cpp:283] Agent using credential for: test-principal
I0731 18:42:28.978899 30175 credentials.hpp:37] Loading credentials for authentication from
'/tmp/Endpoint_SlaveEndpointTest_NoAuthorizer_1_316zWl/http_credentials'
I0731 18:42:28.979362 30175 http.cpp:993] Creating default 'basic' HTTP authenticator for
realm 'mesos-agent-executor'
I0731 18:42:28.979534 30175 http.cpp:1014] Creating default 'jwt' HTTP authenticator for realm
'mesos-agent-executor'
I0731 18:42:28.979742 30175 http.cpp:993] Creating default 'basic' HTTP authenticator for
realm 'mesos-agent-readonly'
I0731 18:42:28.979874 30175 http.cpp:1014] Creating default 'jwt' HTTP authenticator for realm
'mesos-agent-readonly'
I0731 18:42:28.980108 30175 http.cpp:993] Creating default 'basic' HTTP authenticator for
realm 'mesos-agent-readwrite'
I0731 18:42:28.980239 30175 http.cpp:1014] Creating default 'jwt' HTTP authenticator for realm
'mesos-agent-readwrite'
I0731 18:42:28.982372 30175 slave.cpp:565] Agent resources: [{"name":"cpus","scalar":{"value":2.0},"type":"SCALAR"},{"name":"mem","scalar":{"value":1024.0},"type":"SCALAR"},{"name":"disk","scalar":{"value":1024.0},"type":"SCALAR"},{"name":"ports","ranges":{"range":[{"begin":31000,"end":32000}]},"type":"RANGES"}]
I0731 18:42:28.982810 30175 slave.cpp:573] Agent attributes: [  ]
I0731 18:42:28.982839 30175 slave.cpp:582] Agent hostname: e215e91f41f7
I0731 18:42:28.982971 30169 status_update_manager.cpp:177] Pausing sending status updates
I0731 18:42:28.984488 30182 state.cpp:64] Recovering state from '/tmp/Endpoint_SlaveEndpointTest_NoAuthorizer_1_0q0pA2/meta'
I0731 18:42:28.984805 30183 status_update_manager.cpp:203] Recovering status update manager
I0731 18:42:28.984985 30181 containerizer.cpp:582] Recovering containerizer
I0731 18:42:28.986502 30180 provisioner.cpp:416] Provisioner recovery complete
I0731 18:42:28.986840 30173 slave.cpp:6207] Finished recovery
I0731 18:42:28.987273 30173 slave.cpp:6389] Querying resource estimator for oversubscribable
resources
I0731 18:42:28.987512 30167 slave.cpp:6403] Received oversubscribable resources {} from the
resource estimator
I0731 18:42:28.990020 30172 process.cpp:3836] Handling HTTP event for process 'slave(803)'
with path: '/slave(803)/monitor/statistics.json'
I0731 18:42:28.992229 30183 http.cpp:1133] HTTP GET for /slave(803)/monitor/statistics.json
from 172.17.0.6:37516
I0731 18:42:28.992326 30183 http.cpp:957] Authorizing principal 'test-principal' to GET the
'/monitor/statistics.json' endpoint
I0731 18:42:28.995424 30173 slave.cpp:843] Agent terminating
[       OK ] Endpoint/SlaveEndpointTest.NoAuthorizer/1 (34 ms)
[ RUN      ] Endpoint/SlaveEndpointTest.NoAuthorizer/2
I0731 18:42:29.007176  9347 containerizer.cpp:230] Using isolation: posix/cpu,posix/mem,filesystem/posix,network/cni,environment_secret
W0731 18:42:29.007686  9347 backend.cpp:76] Failed to create 'aufs' backend: AufsBackend requires
root privileges
W0731 18:42:29.007788  9347 backend.cpp:76] Failed to create 'bind' backend: BindBackend requires
root privileges
I0731 18:42:29.007823  9347 provisioner.cpp:255] Using default backend 'copy'
I0731 18:42:29.009483  9347 cluster.cpp:448] Creating default 'local' authorizer
I0731 18:42:29.011097 30164 slave.cpp:250] Mesos agent started on (804)@172.17.0.6:43622
I0731 18:42:29.011126 30164 slave.cpp:251] Flags at startup: --acls="" --appc_simple_discovery_uri_prefix="http://"
--appc_store_dir="/tmp/Endpoint_SlaveEndpointTest_NoAuthorizer_2_F48DEB/store/appc" --authenticate_http_executors="true"
--authenticate_http_readonly="true" --authenticate_http_readwrite="true" --authenticatee="crammd5"
--authentication_backoff_factor="1secs" --authorizer="local" --cgroups_cpu_enable_pids_and_tids_count="false"
--cgroups_enable_cfs="false" --cgroups_hierarchy="/sys/fs/cgroup" --cgroups_limit_swap="false"
--cgroups_root="mesos" --container_disk_watch_interval="15secs" --containerizers="mesos" --credential="/tmp/Endpoint_SlaveEndpointTest_NoAuthorizer_2_F48DEB/credential"
--default_role="*" --disk_watch_interval="1mins" --docker="docker" --docker_kill_orphans="true"
--docker_registry="https://registry-1.docker.io" --docker_remove_delay="6hrs" --docker_socket="/var/run/docker.sock"
--docker_stop_timeout="0ns" --docker_store_dir="/tmp/Endpoint_SlaveEndpointTest_NoAuthorizer_2_F48DEB/store/docker"
--docker_volume_checkpoint_dir="/var/run/mesos/isolators/docker/volume" --enforce_container_disk_quota="false"
--executor_registration_timeout="1mins" --executor_reregistration_timeout="2secs" --executor_secret_key="/tmp/Endpoint_SlaveEndpointTest_NoAuthorizer_2_F48DEB/executor_secret_key"
--executor_shutdown_grace_period="5secs" --fetcher_cache_dir="/tmp/Endpoint_SlaveEndpointTest_NoAuthorizer_2_F48DEB/fetch"
--fetcher_cache_size="2GB" --frameworks_home="" --gc_delay="1weeks" --gc_disk_headroom="0.1"
--hadoop_home="" --help="false" --hostname_lookup="true" --http_command_executor="false" --http_credentials="/tmp/Endpoint_SlaveEndpointTest_NoAuthorizer_2_F48DEB/http_credentials"
--http_heartbeat_interval="30secs" --initialize_driver_logging="true" --isolation="posix/cpu,posix/mem"
--launcher="posix" --launcher_dir="/mesos/mesos-1.4.0/_build/src" --logbufsecs="0" --logging_level="INFO"
--max_completed_executors_per_framework="150" --oversubscribed_resources_interval="15secs"
--perf_duration="10secs" --perf_interval="1mins" --port="5051" --qos_correction_interval_min="0ns"
--quiet="false" --recover="reconnect" --recovery_timeout="15mins" --registration_backoff_factor="10ms"
--resources="cpus:2;gpus:0;mem:1024;disk:1024;ports:[31000-32000]" --revocable_cpu_low_priority="true"
--runtime_dir="/tmp/Endpoint_SlaveEndpointTest_NoAuthorizer_2_F48DEB" --sandbox_directory="/mnt/mesos/sandbox"
--strict="true" --switch_user="true" --systemd_enable_support="true" --systemd_runtime_directory="/run/systemd/system"
--version="false" --work_dir="/tmp/Endpoint_SlaveEndpointTest_NoAuthorizer_2_uFLpdi"
I0731 18:42:29.011620 30164 credentials.hpp:86] Loading credential for authentication from
'/tmp/Endpoint_SlaveEndpointTest_NoAuthorizer_2_F48DEB/credential'
I0731 18:42:29.011847 30164 slave.cpp:283] Agent using credential for: test-principal
I0731 18:42:29.011868 30164 credentials.hpp:37] Loading credentials for authentication from
'/tmp/Endpoint_SlaveEndpointTest_NoAuthorizer_2_F48DEB/http_credentials'
I0731 18:42:29.012189 30164 http.cpp:993] Creating default 'basic' HTTP authenticator for
realm 'mesos-agent-executor'
I0731 18:42:29.012326 30164 http.cpp:1014] Creating default 'jwt' HTTP authenticator for realm
'mesos-agent-executor'
I0731 18:42:29.012503 30164 http.cpp:993] Creating default 'basic' HTTP authenticator for
realm 'mesos-agent-readonly'
I0731 18:42:29.012578 30164 http.cpp:1014] Creating default 'jwt' HTTP authenticator for realm
'mesos-agent-readonly'
I0731 18:42:29.012724 30164 http.cpp:993] Creating default 'basic' HTTP authenticator for
realm 'mesos-agent-readwrite'
I0731 18:42:29.012807 30164 http.cpp:1014] Creating default 'jwt' HTTP authenticator for realm
'mesos-agent-readwrite'
I0731 18:42:29.014169 30164 slave.cpp:565] Agent resources: [{"name":"cpus","scalar":{"value":2.0},"type":"SCALAR"},{"name":"mem","scalar":{"value":1024.0},"type":"SCALAR"},{"name":"disk","scalar":{"value":1024.0},"type":"SCALAR"},{"name":"ports","ranges":{"range":[{"begin":31000,"end":32000}]},"type":"RANGES"}]
I0731 18:42:29.014425 30164 slave.cpp:573] Agent attributes: [  ]
I0731 18:42:29.014441 30164 slave.cpp:582] Agent hostname: e215e91f41f7
I0731 18:42:29.014606 30166 status_update_manager.cpp:177] Pausing sending status updates
I0731 18:42:29.016172 30179 state.cpp:64] Recovering state from '/tmp/Endpoint_SlaveEndpointTest_NoAuthorizer_2_uFLpdi/meta'
I0731 18:42:29.016496 30181 status_update_manager.cpp:203] Recovering status update manager
I0731 18:42:29.016674 30184 containerizer.cpp:582] Recovering containerizer
I0731 18:42:29.018143 30171 provisioner.cpp:416] Provisioner recovery complete
I0731 18:42:29.018487 30164 slave.cpp:6207] Finished recovery
I0731 18:42:29.018996 30164 slave.cpp:6389] Querying resource estimator for oversubscribable
resources
I0731 18:42:29.019244 30185 slave.cpp:6403] Received oversubscribable resources {} from the
resource estimator
I0731 18:42:29.021554 30172 process.cpp:3836] Handling HTTP event for process 'slave(804)'
with path: '/slave(804)/containers'
I0731 18:42:29.023352 30176 http.cpp:1133] HTTP GET for /slave(804)/containers from 172.17.0.6:37518
I0731 18:42:29.023442 30176 http.cpp:957] Authorizing principal 'test-principal' to GET the
'/containers' endpoint
I0731 18:42:29.027303 30170 slave.cpp:843] Agent terminating
[       OK ] Endpoint/SlaveEndpointTest.NoAuthorizer/2 (32 ms)
[----------] 9 tests from Endpoint/SlaveEndpointTest (281 ms total)

[----------] Global test environment tear-down
[==========] 1654 tests from 183 test cases ran. (651928 ms total)
[  PASSED  ] 1649 tests.
[  FAILED  ] 5 tests, listed below:
[  FAILED  ] CommandExecutorCheckTest.CommandCheckDeliveredAndReconciled
[  FAILED  ] DefaultExecutorCheckTest.CommandCheckDeliveredAndReconciled
[  FAILED  ] DefaultExecutorCheckTest.CommandCheckStatusChange
[  FAILED  ] DefaultExecutorCheckTest.CommandCheckSeesParentsEnv
[  FAILED  ] DefaultExecutorCheckTest.CommandCheckSharesWorkDirWithTask

 5 FAILED TESTS
  YOU HAVE 20 DISABLED TESTS

I0731 18:42:29.099102 30186 process.cpp:1006] Failed to accept socket: future discarded
make[4]: *** [check-local] Error 1
make[4]: Leaving directory `/mesos/mesos-1.4.0/_build/src'
make[3]: *** [check-am] Error 2
make[3]: Leaving directory `/mesos/mesos-1.4.0/_build/src'
make[2]: *** [check] Error 2
make[2]: Leaving directory `/mesos/mesos-1.4.0/_build/src'
make[1]: *** [check-recursive] Error 1
make[1]: Leaving directory `/mesos/mesos-1.4.0/_build'
make: *** [distcheck] Error 1
+ docker rmi mesos-1501523793-4876
Untagged: mesos-1501523793-4876:latest
Deleted: sha256:728cc7168fb9b7e00eac6c420936d9aa9ba032e1115e71af30bf7589d97b151f
Deleted: sha256:8980af4a40e4a505b4055c4d0764e797ae00ab50ab33036b85769001d20003f6
Deleted: sha256:e966e04f0daf365a73f8182fc249fcac34b00a917bbced3b24a06c80a99a03d0
Deleted: sha256:ef3eb127782dbf7c5a0c2d79f4c8946be383a9df9920aef3c7bed08b62f01aa4
Deleted: sha256:72704099a59d269264f07f6e33e7c7e49920f54df7542e5940076f3de1cb4212
Deleted: sha256:363937c40e84cdbfb27a2f6418c0c17ac1a83369ca785608266e9a9baf3b0b33
Deleted: sha256:cefc09ae920b6637bf1672037f42347f0cf02814f291fc729917ad6ee14ac47a
Deleted: sha256:4750130297a33e5f0e76dd8267e090b8b6bc37673e114d3f06cc37e556a162a9
Deleted: sha256:0345fed56a9f334dbcc607e76001047bed91561a60a78ba755099affabaf748f
Deleted: sha256:d49748d7c783eeae0984f73ebbd800bb3455117aea6907378fa99c774e59a30f
Deleted: sha256:1a0a8cba4b50143e5e191d703e574d28b5ffe1809768efaa122240339d7f4ec9
Deleted: sha256:1612a2e04026bcd228c5a9907c9fcb9956f3daf3b4ebac1ac4b1755f0de53ce6
Deleted: sha256:d678f89de1de6b2834b84fa31605cde0e84977d891bed35e56d6056721ef1cfd
Deleted: sha256:15dfe33c028b734e8027f6967638c0a778a6a50eadb8a13c68ba18d0602e5987
Deleted: sha256:a8100ee38b51794f913d629f4ff4feeef5d7d472a93a14c2f00b4035f6cfbbd8
Deleted: sha256:08385e8f91777bc84f37d30593dc719c8762e2eda80bf436a7ba70d1c06f9b93
Deleted: sha256:87bb1dde6b7dfbbf1e744ba0a5b60fcb6b43dffe82061000f21b5142b1525f87
Deleted: sha256:2b0e0e6826a8969ccb069d8db640069a048374e17c684d8666f16d3747d715b9
Deleted: sha256:992ac9b25b3c083e12cb865e082739c910a2ea61bb710303817f9fb4a294eea4
Deleted: sha256:0453023823c0a039c625d0df0e27a695b3fd577a2eecaeef6a0c789b36fb5970
Deleted: sha256:11633f7161631b7185d3f6d5765718689f97dbcfe6d631b0a643d60534a3db6f
Deleted: sha256:92ade7386a52b025c328b5ca3c58792a786ae1ccbd6c59a57818bac2fc419c41
Deleted: sha256:ec9cfe0aa90bddcd0312d6844ee28d167b4695b15fd2096fe226eb4378cf272d
Deleted: sha256:0da427d5da9f322e512509b84cea477e6d6ffe278d0d3b632d1b6824860f521a
Deleted: sha256:ebe20bcc87e83178e6bebdf2bb3d0f0e7bad5734f9c1bbb209db441a10bf8b46
Build step 'Execute shell' marked build as failure
Not sending mail to unregistered user yujie.jay@gmail.com

Mime
View raw message