mesos-builds mailing list archives

Site index · List index
Message view « Date » · « Thread »
Top « Date » · « Thread »
From Apache Jenkins Server <jenk...@builds.apache.org>
Subject Build failed in Jenkins: Mesos-Reviewbot #18573
Date Sat, 22 Jul 2017 03:48:33 GMT
See <https://builds.apache.org/job/Mesos-Reviewbot/18573/display/redirect>

------------------------------------------
[...truncated 30.12 MB...]
I0722 03:48:26.291452  5024 containerizer.cpp:230] Using isolation: posix/cpu,posix/mem,filesystem/posix,network/cni,environment_secret
W0722 03:48:26.292255  5024 backend.cpp:76] Failed to create 'overlay' backend: OverlayBackend
requires root privileges
W0722 03:48:26.292435  5024 backend.cpp:76] Failed to create 'bind' backend: BindBackend requires
root privileges
I0722 03:48:26.292482  5024 provisioner.cpp:255] Using default backend 'copy'
I0722 03:48:26.297708  5049 slave.cpp:250] Mesos agent started on (792)@172.17.0.2:33719
I0722 03:48:26.297777  5049 slave.cpp:251] Flags at startup: --acls="" --appc_simple_discovery_uri_prefix="http://"
--appc_store_dir="/tmp/Endpoint_SlaveEndpointTest_AuthorizedRequest_2_TOw5ng/store/appc" --authenticate_http_readonly="true"
--authenticate_http_readwrite="true" --authenticatee="crammd5" --authentication_backoff_factor="1secs"
--authorizer="local" --cgroups_cpu_enable_pids_and_tids_count="false" --cgroups_enable_cfs="false"
--cgroups_hierarchy="/sys/fs/cgroup" --cgroups_limit_swap="false" --cgroups_root="mesos" --container_disk_watch_interval="15secs"
--containerizers="mesos" --credential="/tmp/Endpoint_SlaveEndpointTest_AuthorizedRequest_2_TOw5ng/credential"
--default_role="*" --disk_watch_interval="1mins" --docker="docker" --docker_kill_orphans="true"
--docker_registry="https://registry-1.docker.io" --docker_remove_delay="6hrs" --docker_socket="/var/run/docker.sock"
--docker_stop_timeout="0ns" --docker_store_dir="/tmp/Endpoint_SlaveEndpointTest_AuthorizedRequest_2_TOw5ng/store/docker"
--docker_volume_checkpoint_dir="/var/run/mesos/isolators/docker/volume" --enforce_container_disk_quota="false"
--executor_registration_timeout="1mins" --executor_reregistration_timeout="2secs" --executor_shutdown_grace_period="5secs"
--fetcher_cache_dir="/tmp/Endpoint_SlaveEndpointTest_AuthorizedRequest_2_TOw5ng/fetch" --fetcher_cache_size="2GB"
--frameworks_home="" --gc_delay="1weeks" --gc_disk_headroom="0.1" --hadoop_home="" --help="false"
--hostname_lookup="true" --http_command_executor="false" --http_credentials="/tmp/Endpoint_SlaveEndpointTest_AuthorizedRequest_2_TOw5ng/http_credentials"
--http_heartbeat_interval="30secs" --initialize_driver_logging="true" --isolation="posix/cpu,posix/mem"
--launcher="posix" --launcher_dir="/mesos/mesos-1.4.0/_build/src" --logbufsecs="0" --logging_level="INFO"
--max_completed_executors_per_framework="150" --oversubscribed_resources_interval="15secs"
--perf_duration="10secs" --perf_interval="1mins" --port="5051" --qos_correction_interval_min="0ns"
--quiet="false" --recover="reconnect" --recovery_timeout="15mins" --registration_backoff_factor="10ms"
--resources="cpus:2;gpus:0;mem:1024;disk:1024;ports:[31000-32000]" --revocable_cpu_low_priority="true"
--runtime_dir="/tmp/Endpoint_SlaveEndpointTest_AuthorizedRequest_2_TOw5ng" --sandbox_directory="/mnt/mesos/sandbox"
--strict="true" --switch_user="true" --systemd_enable_support="true" --systemd_runtime_directory="/run/systemd/system"
--version="false" --work_dir="/tmp/Endpoint_SlaveEndpointTest_AuthorizedRequest_2_NJpoid"
I0722 03:48:26.298528  5049 credentials.hpp:86] Loading credential for authentication from
'/tmp/Endpoint_SlaveEndpointTest_AuthorizedRequest_2_TOw5ng/credential'
I0722 03:48:26.298806  5049 slave.cpp:283] Agent using credential for: test-principal
I0722 03:48:26.298858  5049 credentials.hpp:37] Loading credentials for authentication from
'/tmp/Endpoint_SlaveEndpointTest_AuthorizedRequest_2_TOw5ng/http_credentials'
I0722 03:48:26.299244  5049 http.cpp:993] Creating default 'basic' HTTP authenticator for
realm 'mesos-agent-readonly'
I0722 03:48:26.299497  5049 http.cpp:993] Creating default 'basic' HTTP authenticator for
realm 'mesos-agent-readwrite'
I0722 03:48:26.301720  5049 slave.cpp:565] Agent resources: [{"name":"cpus","scalar":{"value":2.0},"type":"SCALAR"},{"name":"mem","scalar":{"value":1024.0},"type":"SCALAR"},{"name":"disk","scalar":{"value":1024.0},"type":"SCALAR"},{"name":"ports","ranges":{"range":[{"begin":31000,"end":32000}]},"type":"RANGES"}]
I0722 03:48:26.302212  5049 slave.cpp:573] Agent attributes: [  ]
I0722 03:48:26.302266  5049 slave.cpp:582] Agent hostname: 025381de44db
I0722 03:48:26.302520  5046 status_update_manager.cpp:177] Pausing sending status updates
I0722 03:48:26.304630  5045 state.cpp:64] Recovering state from '/tmp/Endpoint_SlaveEndpointTest_AuthorizedRequest_2_NJpoid/meta'
I0722 03:48:26.305124  5045 status_update_manager.cpp:203] Recovering status update manager
I0722 03:48:26.305362  5045 containerizer.cpp:582] Recovering containerizer
I0722 03:48:26.307335  5045 provisioner.cpp:416] Provisioner recovery complete
I0722 03:48:26.307848  5046 slave.cpp:6207] Finished recovery
I0722 03:48:26.308501  5046 slave.cpp:6389] Querying resource estimator for oversubscribable
resources
I0722 03:48:26.308862  5045 slave.cpp:6403] Received oversubscribable resources {} from the
resource estimator
I0722 03:48:26.312940  5049 process.cpp:3837] Handling HTTP event for process 'slave(792)'
with path: '/slave(792)/containers'
I0722 03:48:26.315117  5046 http.cpp:1133] HTTP GET for /slave(792)/containers from 172.17.0.2:46326
I0722 03:48:26.315250  5046 http.cpp:957] Authorizing principal 'test-principal' to GET the
'/containers' endpoint
I0722 03:48:26.320847  5044 slave.cpp:843] Agent terminating
[       OK ] Endpoint/SlaveEndpointTest.AuthorizedRequest/2 (45 ms)
[ RUN      ] Endpoint/SlaveEndpointTest.UnauthorizedRequest/0
I0722 03:48:26.337039  5024 containerizer.cpp:230] Using isolation: posix/cpu,posix/mem,filesystem/posix,network/cni,environment_secret
W0722 03:48:26.337822  5024 backend.cpp:76] Failed to create 'overlay' backend: OverlayBackend
requires root privileges
W0722 03:48:26.337988  5024 backend.cpp:76] Failed to create 'bind' backend: BindBackend requires
root privileges
I0722 03:48:26.338030  5024 provisioner.cpp:255] Using default backend 'copy'
I0722 03:48:26.343284  5047 slave.cpp:250] Mesos agent started on (793)@172.17.0.2:33719
I0722 03:48:26.343325  5047 slave.cpp:251] Flags at startup: --acls="" --appc_simple_discovery_uri_prefix="http://"
--appc_store_dir="/tmp/Endpoint_SlaveEndpointTest_UnauthorizedRequest_0_BBQU9s/store/appc"
--authenticate_http_readonly="true" --authenticate_http_readwrite="true" --authenticatee="crammd5"
--authentication_backoff_factor="1secs" --authorizer="local" --cgroups_cpu_enable_pids_and_tids_count="false"
--cgroups_enable_cfs="false" --cgroups_hierarchy="/sys/fs/cgroup" --cgroups_limit_swap="false"
--cgroups_root="mesos" --container_disk_watch_interval="15secs" --containerizers="mesos" --credential="/tmp/Endpoint_SlaveEndpointTest_UnauthorizedRequest_0_BBQU9s/credential"
--default_role="*" --disk_watch_interval="1mins" --docker="docker" --docker_kill_orphans="true"
--docker_registry="https://registry-1.docker.io" --docker_remove_delay="6hrs" --docker_socket="/var/run/docker.sock"
--docker_stop_timeout="0ns" --docker_store_dir="/tmp/Endpoint_SlaveEndpointTest_UnauthorizedRequest_0_BBQU9s/store/docker"
--docker_volume_checkpoint_dir="/var/run/mesos/isolators/docker/volume" --enforce_container_disk_quota="false"
--executor_registration_timeout="1mins" --executor_reregistration_timeout="2secs" --executor_shutdown_grace_period="5secs"
--fetcher_cache_dir="/tmp/Endpoint_SlaveEndpointTest_UnauthorizedRequest_0_BBQU9s/fetch" --fetcher_cache_size="2GB"
--frameworks_home="" --gc_delay="1weeks" --gc_disk_headroom="0.1" --hadoop_home="" --help="false"
--hostname_lookup="true" --http_command_executor="false" --http_credentials="/tmp/Endpoint_SlaveEndpointTest_UnauthorizedRequest_0_BBQU9s/http_credentials"
--http_heartbeat_interval="30secs" --initialize_driver_logging="true" --isolation="posix/cpu,posix/mem"
--launcher="posix" --launcher_dir="/mesos/mesos-1.4.0/_build/src" --logbufsecs="0" --logging_level="INFO"
--max_completed_executors_per_framework="150" --oversubscribed_resources_interval="15secs"
--perf_duration="10secs" --perf_interval="1mins" --port="5051" --qos_correction_interval_min="0ns"
--quiet="false" --recover="reconnect" --recovery_timeout="15mins" --registration_backoff_factor="10ms"
--resources="cpus:2;gpus:0;mem:1024;disk:1024;ports:[31000-32000]" --revocable_cpu_low_priority="true"
--runtime_dir="/tmp/Endpoint_SlaveEndpointTest_UnauthorizedRequest_0_BBQU9s" --sandbox_directory="/mnt/mesos/sandbox"
--strict="true" --switch_user="true" --systemd_enable_support="true" --systemd_runtime_directory="/run/systemd/system"
--version="false" --work_dir="/tmp/Endpoint_SlaveEndpointTest_UnauthorizedRequest_0_TKGQWp"
I0722 03:48:26.344162  5047 credentials.hpp:86] Loading credential for authentication from
'/tmp/Endpoint_SlaveEndpointTest_UnauthorizedRequest_0_BBQU9s/credential'
I0722 03:48:26.344491  5047 slave.cpp:283] Agent using credential for: test-principal
I0722 03:48:26.344527  5047 credentials.hpp:37] Loading credentials for authentication from
'/tmp/Endpoint_SlaveEndpointTest_UnauthorizedRequest_0_BBQU9s/http_credentials'
I0722 03:48:26.345002  5047 http.cpp:993] Creating default 'basic' HTTP authenticator for
realm 'mesos-agent-readonly'
I0722 03:48:26.345306  5047 http.cpp:993] Creating default 'basic' HTTP authenticator for
realm 'mesos-agent-readwrite'
I0722 03:48:26.347550  5047 slave.cpp:565] Agent resources: [{"name":"cpus","scalar":{"value":2.0},"type":"SCALAR"},{"name":"mem","scalar":{"value":1024.0},"type":"SCALAR"},{"name":"disk","scalar":{"value":1024.0},"type":"SCALAR"},{"name":"ports","ranges":{"range":[{"begin":31000,"end":32000}]},"type":"RANGES"}]
I0722 03:48:26.347997  5047 slave.cpp:573] Agent attributes: [  ]
I0722 03:48:26.348022  5047 slave.cpp:582] Agent hostname: 025381de44db
I0722 03:48:26.348253  5050 status_update_manager.cpp:177] Pausing sending status updates
I0722 03:48:26.350495  5044 state.cpp:64] Recovering state from '/tmp/Endpoint_SlaveEndpointTest_UnauthorizedRequest_0_TKGQWp/meta'
I0722 03:48:26.350956  5050 status_update_manager.cpp:203] Recovering status update manager
I0722 03:48:26.351299  5045 containerizer.cpp:582] Recovering containerizer
I0722 03:48:26.353528  5048 provisioner.cpp:416] Provisioner recovery complete
I0722 03:48:26.354218  5043 slave.cpp:6207] Finished recovery
I0722 03:48:26.354904  5043 slave.cpp:6389] Querying resource estimator for oversubscribable
resources
I0722 03:48:26.355355  5047 slave.cpp:6403] Received oversubscribable resources {} from the
resource estimator
I0722 03:48:26.359589  5049 process.cpp:3837] Handling HTTP event for process 'slave(793)'
with path: '/slave(793)/monitor/statistics'
I0722 03:48:26.361770  5047 http.cpp:1133] HTTP GET for /slave(793)/monitor/statistics from
172.17.0.2:46328
I0722 03:48:26.361907  5047 http.cpp:957] Authorizing principal 'test-principal' to GET the
'/monitor/statistics' endpoint
I0722 03:48:26.365833  5045 slave.cpp:843] Agent terminating
[       OK ] Endpoint/SlaveEndpointTest.UnauthorizedRequest/0 (53 ms)
[ RUN      ] Endpoint/SlaveEndpointTest.UnauthorizedRequest/1
I0722 03:48:26.391073  5024 containerizer.cpp:230] Using isolation: posix/cpu,posix/mem,filesystem/posix,network/cni,environment_secret
W0722 03:48:26.391860  5024 backend.cpp:76] Failed to create 'overlay' backend: OverlayBackend
requires root privileges
W0722 03:48:26.392021  5024 backend.cpp:76] Failed to create 'bind' backend: BindBackend requires
root privileges
I0722 03:48:26.392063  5024 provisioner.cpp:255] Using default backend 'copy'
I0722 03:48:26.397279  5043 slave.cpp:250] Mesos agent started on (794)@172.17.0.2:33719
I0722 03:48:26.397320  5043 slave.cpp:251] Flags at startup: --acls="" --appc_simple_discovery_uri_prefix="http://"
--appc_store_dir="/tmp/Endpoint_SlaveEndpointTest_UnauthorizedRequest_1_1INxtG/store/appc"
--authenticate_http_readonly="true" --authenticate_http_readwrite="true" --authenticatee="crammd5"
--authentication_backoff_factor="1secs" --authorizer="local" --cgroups_cpu_enable_pids_and_tids_count="false"
--cgroups_enable_cfs="false" --cgroups_hierarchy="/sys/fs/cgroup" --cgroups_limit_swap="false"
--cgroups_root="mesos" --container_disk_watch_interval="15secs" --containerizers="mesos" --credential="/tmp/Endpoint_SlaveEndpointTest_UnauthorizedRequest_1_1INxtG/credential"
--default_role="*" --disk_watch_interval="1mins" --docker="docker" --docker_kill_orphans="true"
--docker_registry="https://registry-1.docker.io" --docker_remove_delay="6hrs" --docker_socket="/var/run/docker.sock"
--docker_stop_timeout="0ns" --docker_store_dir="/tmp/Endpoint_SlaveEndpointTest_UnauthorizedRequest_1_1INxtG/store/docker"
--docker_volume_checkpoint_dir="/var/run/mesos/isolators/docker/volume" --enforce_container_disk_quota="false"
--executor_registration_timeout="1mins" --executor_reregistration_timeout="2secs" --executor_shutdown_grace_period="5secs"
--fetcher_cache_dir="/tmp/Endpoint_SlaveEndpointTest_UnauthorizedRequest_1_1INxtG/fetch" --fetcher_cache_size="2GB"
--frameworks_home="" --gc_delay="1weeks" --gc_disk_headroom="0.1" --hadoop_home="" --help="false"
--hostname_lookup="true" --http_command_executor="false" --http_credentials="/tmp/Endpoint_SlaveEndpointTest_UnauthorizedRequest_1_1INxtG/http_credentials"
--http_heartbeat_interval="30secs" --initialize_driver_logging="true" --isolation="posix/cpu,posix/mem"
--launcher="posix" --launcher_dir="/mesos/mesos-1.4.0/_build/src" --logbufsecs="0" --logging_level="INFO"
--max_completed_executors_per_framework="150" --oversubscribed_resources_interval="15secs"
--perf_duration="10secs" --perf_interval="1mins" --port="5051" --qos_correction_interval_min="0ns"
--quiet="false" --recover="reconnect" --recovery_timeout="15mins" --registration_backoff_factor="10ms"
--resources="cpus:2;gpus:0;mem:1024;disk:1024;ports:[31000-32000]" --revocable_cpu_low_priority="true"
--runtime_dir="/tmp/Endpoint_SlaveEndpointTest_UnauthorizedRequest_1_1INxtG" --sandbox_directory="/mnt/mesos/sandbox"
--strict="true" --switch_user="true" --systemd_enable_support="true" --systemd_runtime_directory="/run/systemd/system"
--version="false" --work_dir="/tmp/Endpoint_SlaveEndpointTest_UnauthorizedRequest_1_HuhI7C"
I0722 03:48:26.398102  5043 credentials.hpp:86] Loading credential for authentication from
'/tmp/Endpoint_SlaveEndpointTest_UnauthorizedRequest_1_1INxtG/credential'
I0722 03:48:26.398416  5043 slave.cpp:283] Agent using credential for: test-principal
I0722 03:48:26.398440  5043 credentials.hpp:37] Loading credentials for authentication from
'/tmp/Endpoint_SlaveEndpointTest_UnauthorizedRequest_1_1INxtG/http_credentials'
I0722 03:48:26.398861  5043 http.cpp:993] Creating default 'basic' HTTP authenticator for
realm 'mesos-agent-readonly'
I0722 03:48:26.399137  5043 http.cpp:993] Creating default 'basic' HTTP authenticator for
realm 'mesos-agent-readwrite'
I0722 03:48:26.401338  5043 slave.cpp:565] Agent resources: [{"name":"cpus","scalar":{"value":2.0},"type":"SCALAR"},{"name":"mem","scalar":{"value":1024.0},"type":"SCALAR"},{"name":"disk","scalar":{"value":1024.0},"type":"SCALAR"},{"name":"ports","ranges":{"range":[{"begin":31000,"end":32000}]},"type":"RANGES"}]
I0722 03:48:26.401782  5043 slave.cpp:573] Agent attributes: [  ]
I0722 03:48:26.401803  5043 slave.cpp:582] Agent hostname: 025381de44db
I0722 03:48:26.402134  5050 status_update_manager.cpp:177] Pausing sending status updates
I0722 03:48:26.404141  5046 state.cpp:64] Recovering state from '/tmp/Endpoint_SlaveEndpointTest_UnauthorizedRequest_1_HuhI7C/meta'
I0722 03:48:26.404646  5050 status_update_manager.cpp:203] Recovering status update manager
I0722 03:48:26.405185  5045 containerizer.cpp:582] Recovering containerizer
I0722 03:48:26.407536  5050 provisioner.cpp:416] Provisioner recovery complete
I0722 03:48:26.408248  5046 slave.cpp:6207] Finished recovery
I0722 03:48:26.409047  5046 slave.cpp:6389] Querying resource estimator for oversubscribable
resources
I0722 03:48:26.409404  5044 slave.cpp:6403] Received oversubscribable resources {} from the
resource estimator
I0722 03:48:26.413645  5044 process.cpp:3837] Handling HTTP event for process 'slave(794)'
with path: '/slave(794)/monitor/statistics.json'
I0722 03:48:26.415648  5049 http.cpp:1133] HTTP GET for /slave(794)/monitor/statistics.json
from 172.17.0.2:46330
I0722 03:48:26.415782  5049 http.cpp:957] Authorizing principal 'test-principal' to GET the
'/monitor/statistics.json' endpoint
I0722 03:48:26.424489  5024 slave.cpp:843] Agent terminating
[       OK ] Endpoint/SlaveEndpointTest.UnauthorizedRequest/1 (48 ms)
[ RUN      ] Endpoint/SlaveEndpointTest.UnauthorizedRequest/2
I0722 03:48:26.440161  5024 containerizer.cpp:230] Using isolation: posix/cpu,posix/mem,filesystem/posix,network/cni,environment_secret
W0722 03:48:26.440937  5024 backend.cpp:76] Failed to create 'overlay' backend: OverlayBackend
requires root privileges
W0722 03:48:26.441099  5024 backend.cpp:76] Failed to create 'bind' backend: BindBackend requires
root privileges
I0722 03:48:26.441143  5024 provisioner.cpp:255] Using default backend 'copy'
I0722 03:48:26.446310  5045 slave.cpp:250] Mesos agent started on (795)@172.17.0.2:33719
I0722 03:48:26.446353  5045 slave.cpp:251] Flags at startup: --acls="" --appc_simple_discovery_uri_prefix="http://"
--appc_store_dir="/tmp/Endpoint_SlaveEndpointTest_UnauthorizedRequest_2_z2ONjU/store/appc"
--authenticate_http_readonly="true" --authenticate_http_readwrite="true" --authenticatee="crammd5"
--authentication_backoff_factor="1secs" --authorizer="local" --cgroups_cpu_enable_pids_and_tids_count="false"
--cgroups_enable_cfs="false" --cgroups_hierarchy="/sys/fs/cgroup" --cgroups_limit_swap="false"
--cgroups_root="mesos" --container_disk_watch_interval="15secs" --containerizers="mesos" --credential="/tmp/Endpoint_SlaveEndpointTest_UnauthorizedRequest_2_z2ONjU/credential"
--default_role="*" --disk_watch_interval="1mins" --docker="docker" --docker_kill_orphans="true"
--docker_registry="https://registry-1.docker.io" --docker_remove_delay="6hrs" --docker_socket="/var/run/docker.sock"
--docker_stop_timeout="0ns" --docker_store_dir="/tmp/Endpoint_SlaveEndpointTest_UnauthorizedRequest_2_z2ONjU/store/docker"
--docker_volume_checkpoint_dir="/var/run/mesos/isolators/docker/volume" --enforce_container_disk_quota="false"
--executor_registration_timeout="1mins" --executor_reregistration_timeout="2secs" --executor_shutdown_grace_period="5secs"
--fetcher_cache_dir="/tmp/Endpoint_SlaveEndpointTest_UnauthorizedRequest_2_z2ONjU/fetch" --fetcher_cache_size="2GB"
--frameworks_home="" --gc_delay="1weeks" --gc_disk_headroom="0.1" --hadoop_home="" --help="false"
--hostname_lookup="true" --http_command_executor="false" --http_credentials="/tmp/Endpoint_SlaveEndpointTest_UnauthorizedRequest_2_z2ONjU/http_credentials"
--http_heartbeat_interval="30secs" --initialize_driver_logging="true" --isolation="posix/cpu,posix/mem"
--launcher="posix" --launcher_dir="/mesos/mesos-1.4.0/_build/src" --logbufsecs="0" --logging_level="INFO"
--max_completed_executors_per_framework="150" --oversubscribed_resources_interval="15secs"
--perf_duration="10secs" --perf_interval="1mins" --port="5051" --qos_correction_interval_min="0ns"
--quiet="false" --recover="reconnect" --recovery_timeout="15mins" --registration_backoff_factor="10ms"
--resources="cpus:2;gpus:0;mem:1024;disk:1024;ports:[31000-32000]" --revocable_cpu_low_priority="true"
--runtime_dir="/tmp/Endpoint_SlaveEndpointTest_UnauthorizedRequest_2_z2ONjU" --sandbox_directory="/mnt/mesos/sandbox"
--strict="true" --switch_user="true" --systemd_enable_support="true" --systemd_runtime_directory="/run/systemd/system"
--version="false" --work_dir="/tmp/Endpoint_SlaveEndpointTest_UnauthorizedRequest_2_3pt1PQ"
I0722 03:48:26.447089  5045 credentials.hpp:86] Loading credential for authentication from
'/tmp/Endpoint_SlaveEndpointTest_UnauthorizedRequest_2_z2ONjU/credential'
I0722 03:48:26.447350  5045 slave.cpp:283] Agent using credential for: test-principal
I0722 03:48:26.447373  5045 credentials.hpp:37] Loading credentials for authentication from
'/tmp/Endpoint_SlaveEndpointTest_UnauthorizedRequest_2_z2ONjU/http_credentials'
I0722 03:48:26.447733  5045 http.cpp:993] Creating default 'basic' HTTP authenticator for
realm 'mesos-agent-readonly'
I0722 03:48:26.447944  5045 http.cpp:993] Creating default 'basic' HTTP authenticator for
realm 'mesos-agent-readwrite'
I0722 03:48:26.450084  5045 slave.cpp:565] Agent resources: [{"name":"cpus","scalar":{"value":2.0},"type":"SCALAR"},{"name":"mem","scalar":{"value":1024.0},"type":"SCALAR"},{"name":"disk","scalar":{"value":1024.0},"type":"SCALAR"},{"name":"ports","ranges":{"range":[{"begin":31000,"end":32000}]},"type":"RANGES"}]
I0722 03:48:26.450529  5045 slave.cpp:573] Agent attributes: [  ]
I0722 03:48:26.450551  5045 slave.cpp:582] Agent hostname: 025381de44db
I0722 03:48:26.450759  5050 status_update_manager.cpp:177] Pausing sending status updates
I0722 03:48:26.452781  5046 state.cpp:64] Recovering state from '/tmp/Endpoint_SlaveEndpointTest_UnauthorizedRequest_2_3pt1PQ/meta'
I0722 03:48:26.453342  5044 status_update_manager.cpp:203] Recovering status update manager
I0722 03:48:26.453702  5048 containerizer.cpp:582] Recovering containerizer
I0722 03:48:26.456244  5045 provisioner.cpp:416] Provisioner recovery complete
I0722 03:48:26.457028  5046 slave.cpp:6207] Finished recovery
I0722 03:48:26.457942  5046 slave.cpp:6389] Querying resource estimator for oversubscribable
resources
I0722 03:48:26.458305  5050 slave.cpp:6403] Received oversubscribable resources {} from the
resource estimator
I0722 03:48:26.462450  5050 process.cpp:3837] Handling HTTP event for process 'slave(795)'
with path: '/slave(795)/containers'
I0722 03:48:26.464480  5045 http.cpp:1133] HTTP GET for /slave(795)/containers from 172.17.0.2:46332
I0722 03:48:26.464615  5045 http.cpp:957] Authorizing principal 'test-principal' to GET the
'/containers' endpoint
I0722 03:48:26.469419  5044 slave.cpp:843] Agent terminating
[       OK ] Endpoint/SlaveEndpointTest.UnauthorizedRequest/2 (44 ms)
[ RUN      ] Endpoint/SlaveEndpointTest.NoAuthorizer/0
I0722 03:48:26.485684  5024 containerizer.cpp:230] Using isolation: posix/cpu,posix/mem,filesystem/posix,network/cni,environment_secret
W0722 03:48:26.486460  5024 backend.cpp:76] Failed to create 'overlay' backend: OverlayBackend
requires root privileges
W0722 03:48:26.486621  5024 backend.cpp:76] Failed to create 'bind' backend: BindBackend requires
root privileges
I0722 03:48:26.486665  5024 provisioner.cpp:255] Using default backend 'copy'
I0722 03:48:26.489316  5024 cluster.cpp:448] Creating default 'local' authorizer
I0722 03:48:26.492059  5049 slave.cpp:250] Mesos agent started on (796)@172.17.0.2:33719
I0722 03:48:26.492099  5049 slave.cpp:251] Flags at startup: --acls="" --appc_simple_discovery_uri_prefix="http://"
--appc_store_dir="/tmp/Endpoint_SlaveEndpointTest_NoAuthorizer_0_T4sOD8/store/appc" --authenticate_http_readonly="true"
--authenticate_http_readwrite="true" --authenticatee="crammd5" --authentication_backoff_factor="1secs"
--authorizer="local" --cgroups_cpu_enable_pids_and_tids_count="false" --cgroups_enable_cfs="false"
--cgroups_hierarchy="/sys/fs/cgroup" --cgroups_limit_swap="false" --cgroups_root="mesos" --container_disk_watch_interval="15secs"
--containerizers="mesos" --credential="/tmp/Endpoint_SlaveEndpointTest_NoAuthorizer_0_T4sOD8/credential"
--default_role="*" --disk_watch_interval="1mins" --docker="docker" --docker_kill_orphans="true"
--docker_registry="https://registry-1.docker.io" --docker_remove_delay="6hrs" --docker_socket="/var/run/docker.sock"
--docker_stop_timeout="0ns" --docker_store_dir="/tmp/Endpoint_SlaveEndpointTest_NoAuthorizer_0_T4sOD8/store/docker"
--docker_volume_checkpoint_dir="/var/run/mesos/isolators/docker/volume" --enforce_container_disk_quota="false"
--executor_registration_timeout="1mins" --executor_reregistration_timeout="2secs" --executor_shutdown_grace_period="5secs"
--fetcher_cache_dir="/tmp/Endpoint_SlaveEndpointTest_NoAuthorizer_0_T4sOD8/fetch" --fetcher_cache_size="2GB"
--frameworks_home="" --gc_delay="1weeks" --gc_disk_headroom="0.1" --hadoop_home="" --help="false"
--hostname_lookup="true" --http_command_executor="false" --http_credentials="/tmp/Endpoint_SlaveEndpointTest_NoAuthorizer_0_T4sOD8/http_credentials"
--http_heartbeat_interval="30secs" --initialize_driver_logging="true" --isolation="posix/cpu,posix/mem"
--launcher="posix" --launcher_dir="/mesos/mesos-1.4.0/_build/src" --logbufsecs="0" --logging_level="INFO"
--max_completed_executors_per_framework="150" --oversubscribed_resources_interval="15secs"
--perf_duration="10secs" --perf_interval="1mins" --port="5051" --qos_correction_interval_min="0ns"
--quiet="false" --recover="reconnect" --recovery_timeout="15mins" --registration_backoff_factor="10ms"
--resources="cpus:2;gpus:0;mem:1024;disk:1024;ports:[31000-32000]" --revocable_cpu_low_priority="true"
--runtime_dir="/tmp/Endpoint_SlaveEndpointTest_NoAuthorizer_0_T4sOD8" --sandbox_directory="/mnt/mesos/sandbox"
--strict="true" --switch_user="true" --systemd_enable_support="true" --systemd_runtime_directory="/run/systemd/system"
--version="false" --work_dir="/tmp/Endpoint_SlaveEndpointTest_NoAuthorizer_0_ZrxK24"
I0722 03:48:26.492928  5049 credentials.hpp:86] Loading credential for authentication from
'/tmp/Endpoint_SlaveEndpointTest_NoAuthorizer_0_T4sOD8/credential'
I0722 03:48:26.493249  5049 slave.cpp:283] Agent using credential for: test-principal
I0722 03:48:26.493273  5049 credentials.hpp:37] Loading credentials for authentication from
'/tmp/Endpoint_SlaveEndpointTest_NoAuthorizer_0_T4sOD8/http_credentials'
I0722 03:48:26.493683  5049 http.cpp:993] Creating default 'basic' HTTP authenticator for
realm 'mesos-agent-readonly'
I0722 03:48:26.493978  5049 http.cpp:993] Creating default 'basic' HTTP authenticator for
realm 'mesos-agent-readwrite'
I0722 03:48:26.496234  5049 slave.cpp:565] Agent resources: [{"name":"cpus","scalar":{"value":2.0},"type":"SCALAR"},{"name":"mem","scalar":{"value":1024.0},"type":"SCALAR"},{"name":"disk","scalar":{"value":1024.0},"type":"SCALAR"},{"name":"ports","ranges":{"range":[{"begin":31000,"end":32000}]},"type":"RANGES"}]
I0722 03:48:26.496682  5049 slave.cpp:573] Agent attributes: [  ]
I0722 03:48:26.496702  5049 slave.cpp:582] Agent hostname: 025381de44db
I0722 03:48:26.497009  5047 status_update_manager.cpp:177] Pausing sending status updates
I0722 03:48:26.499012  5050 state.cpp:64] Recovering state from '/tmp/Endpoint_SlaveEndpointTest_NoAuthorizer_0_ZrxK24/meta'
I0722 03:48:26.499508  5044 status_update_manager.cpp:203] Recovering status update manager
I0722 03:48:26.499778  5044 containerizer.cpp:582] Recovering containerizer
I0722 03:48:26.501855  5050 provisioner.cpp:416] Provisioner recovery complete
I0722 03:48:26.502466  5048 slave.cpp:6207] Finished recovery
I0722 03:48:26.503175  5048 slave.cpp:6389] Querying resource estimator for oversubscribable
resources
I0722 03:48:26.503535  5046 slave.cpp:6403] Received oversubscribable resources {} from the
resource estimator
I0722 03:48:26.507645  5044 process.cpp:3837] Handling HTTP event for process 'slave(796)'
with path: '/slave(796)/monitor/statistics'
I0722 03:48:26.509672  5049 http.cpp:1133] HTTP GET for /slave(796)/monitor/statistics from
172.17.0.2:46334
I0722 03:48:26.509806  5049 http.cpp:957] Authorizing principal 'test-principal' to GET the
'/monitor/statistics' endpoint
I0722 03:48:26.515194  5043 slave.cpp:843] Agent terminating
[       OK ] Endpoint/SlaveEndpointTest.NoAuthorizer/0 (45 ms)
[ RUN      ] Endpoint/SlaveEndpointTest.NoAuthorizer/1
I0722 03:48:26.531272  5024 containerizer.cpp:230] Using isolation: posix/cpu,posix/mem,filesystem/posix,network/cni,environment_secret
W0722 03:48:26.532052  5024 backend.cpp:76] Failed to create 'overlay' backend: OverlayBackend
requires root privileges
W0722 03:48:26.532217  5024 backend.cpp:76] Failed to create 'bind' backend: BindBackend requires
root privileges
I0722 03:48:26.532263  5024 provisioner.cpp:255] Using default backend 'copy'
I0722 03:48:26.534894  5024 cluster.cpp:448] Creating default 'local' authorizer
I0722 03:48:26.537714  5043 slave.cpp:250] Mesos agent started on (797)@172.17.0.2:33719
I0722 03:48:26.537755  5043 slave.cpp:251] Flags at startup: --acls="" --appc_simple_discovery_uri_prefix="http://"
--appc_store_dir="/tmp/Endpoint_SlaveEndpointTest_NoAuthorizer_1_F9Qprn/store/appc" --authenticate_http_readonly="true"
--authenticate_http_readwrite="true" --authenticatee="crammd5" --authentication_backoff_factor="1secs"
--authorizer="local" --cgroups_cpu_enable_pids_and_tids_count="false" --cgroups_enable_cfs="false"
--cgroups_hierarchy="/sys/fs/cgroup" --cgroups_limit_swap="false" --cgroups_root="mesos" --container_disk_watch_interval="15secs"
--containerizers="mesos" --credential="/tmp/Endpoint_SlaveEndpointTest_NoAuthorizer_1_F9Qprn/credential"
--default_role="*" --disk_watch_interval="1mins" --docker="docker" --docker_kill_orphans="true"
--docker_registry="https://registry-1.docker.io" --docker_remove_delay="6hrs" --docker_socket="/var/run/docker.sock"
--docker_stop_timeout="0ns" --docker_store_dir="/tmp/Endpoint_SlaveEndpointTest_NoAuthorizer_1_F9Qprn/store/docker"
--docker_volume_checkpoint_dir="/var/run/mesos/isolators/docker/volume" --enforce_container_disk_quota="false"
--executor_registration_timeout="1mins" --executor_reregistration_timeout="2secs" --executor_shutdown_grace_period="5secs"
--fetcher_cache_dir="/tmp/Endpoint_SlaveEndpointTest_NoAuthorizer_1_F9Qprn/fetch" --fetcher_cache_size="2GB"
--frameworks_home="" --gc_delay="1weeks" --gc_disk_headroom="0.1" --hadoop_home="" --help="false"
--hostname_lookup="true" --http_command_executor="false" --http_credentials="/tmp/Endpoint_SlaveEndpointTest_NoAuthorizer_1_F9Qprn/http_credentials"
--http_heartbeat_interval="30secs" --initialize_driver_logging="true" --isolation="posix/cpu,posix/mem"
--launcher="posix" --launcher_dir="/mesos/mesos-1.4.0/_build/src" --logbufsecs="0" --logging_level="INFO"
--max_completed_executors_per_framework="150" --oversubscribed_resources_interval="15secs"
--perf_duration="10secs" --perf_interval="1mins" --port="5051" --qos_correction_interval_min="0ns"
--quiet="false" --recover="reconnect" --recovery_timeout="15mins" --registration_backoff_factor="10ms"
--resources="cpus:2;gpus:0;mem:1024;disk:1024;ports:[31000-32000]" --revocable_cpu_low_priority="true"
--runtime_dir="/tmp/Endpoint_SlaveEndpointTest_NoAuthorizer_1_F9Qprn" --sandbox_directory="/mnt/mesos/sandbox"
--strict="true" --switch_user="true" --systemd_enable_support="true" --systemd_runtime_directory="/run/systemd/system"
--version="false" --work_dir="/tmp/Endpoint_SlaveEndpointTest_NoAuthorizer_1_bIqWIj"
I0722 03:48:26.538501  5043 credentials.hpp:86] Loading credential for authentication from
'/tmp/Endpoint_SlaveEndpointTest_NoAuthorizer_1_F9Qprn/credential'
I0722 03:48:26.538760  5043 slave.cpp:283] Agent using credential for: test-principal
I0722 03:48:26.538784  5043 credentials.hpp:37] Loading credentials for authentication from
'/tmp/Endpoint_SlaveEndpointTest_NoAuthorizer_1_F9Qprn/http_credentials'
I0722 03:48:26.539141  5043 http.cpp:993] Creating default 'basic' HTTP authenticator for
realm 'mesos-agent-readonly'
I0722 03:48:26.539366  5043 http.cpp:993] Creating default 'basic' HTTP authenticator for
realm 'mesos-agent-readwrite'
I0722 03:48:26.541528  5043 slave.cpp:565] Agent resources: [{"name":"cpus","scalar":{"value":2.0},"type":"SCALAR"},{"name":"mem","scalar":{"value":1024.0},"type":"SCALAR"},{"name":"disk","scalar":{"value":1024.0},"type":"SCALAR"},{"name":"ports","ranges":{"range":[{"begin":31000,"end":32000}]},"type":"RANGES"}]
I0722 03:48:26.541970  5043 slave.cpp:573] Agent attributes: [  ]
I0722 03:48:26.541990  5043 slave.cpp:582] Agent hostname: 025381de44db
I0722 03:48:26.542392  5046 status_update_manager.cpp:177] Pausing sending status updates
I0722 03:48:26.544248  5047 state.cpp:64] Recovering state from '/tmp/Endpoint_SlaveEndpointTest_NoAuthorizer_1_bIqWIj/meta'
I0722 03:48:26.544822  5049 status_update_manager.cpp:203] Recovering status update manager
I0722 03:48:26.545068  5043 containerizer.cpp:582] Recovering containerizer
I0722 03:48:26.547061  5045 provisioner.cpp:416] Provisioner recovery complete
I0722 03:48:26.547657  5043 slave.cpp:6207] Finished recovery
I0722 03:48:26.548259  5043 slave.cpp:6389] Querying resource estimator for oversubscribable
resources
I0722 03:48:26.548638  5045 slave.cpp:6403] Received oversubscribable resources {} from the
resource estimator
I0722 03:48:26.552577  5043 process.cpp:3837] Handling HTTP event for process 'slave(797)'
with path: '/slave(797)/monitor/statistics.json'
I0722 03:48:26.554488  5043 http.cpp:1133] HTTP GET for /slave(797)/monitor/statistics.json
from 172.17.0.2:46336
I0722 03:48:26.554616  5043 http.cpp:957] Authorizing principal 'test-principal' to GET the
'/monitor/statistics.json' endpoint
I0722 03:48:26.559840  5043 slave.cpp:843] Agent terminating
[       OK ] Endpoint/SlaveEndpointTest.NoAuthorizer/1 (45 ms)
[ RUN      ] Endpoint/SlaveEndpointTest.NoAuthorizer/2
I0722 03:48:26.576191  5024 containerizer.cpp:230] Using isolation: posix/cpu,posix/mem,filesystem/posix,network/cni,environment_secret
W0722 03:48:26.576984  5024 backend.cpp:76] Failed to create 'overlay' backend: OverlayBackend
requires root privileges
W0722 03:48:26.577150  5024 backend.cpp:76] Failed to create 'bind' backend: BindBackend requires
root privileges
I0722 03:48:26.577193  5024 provisioner.cpp:255] Using default backend 'copy'
I0722 03:48:26.579658  5024 cluster.cpp:448] Creating default 'local' authorizer
I0722 03:48:26.582444  5050 slave.cpp:250] Mesos agent started on (798)@172.17.0.2:33719
I0722 03:48:26.582482  5050 slave.cpp:251] Flags at startup: --acls="" --appc_simple_discovery_uri_prefix="http://"
--appc_store_dir="/tmp/Endpoint_SlaveEndpointTest_NoAuthorizer_2_fG68HC/store/appc" --authenticate_http_readonly="true"
--authenticate_http_readwrite="true" --authenticatee="crammd5" --authentication_backoff_factor="1secs"
--authorizer="local" --cgroups_cpu_enable_pids_and_tids_count="false" --cgroups_enable_cfs="false"
--cgroups_hierarchy="/sys/fs/cgroup" --cgroups_limit_swap="false" --cgroups_root="mesos" --container_disk_watch_interval="15secs"
--containerizers="mesos" --credential="/tmp/Endpoint_SlaveEndpointTest_NoAuthorizer_2_fG68HC/credential"
--default_role="*" --disk_watch_interval="1mins" --docker="docker" --docker_kill_orphans="true"
--docker_registry="https://registry-1.docker.io" --docker_remove_delay="6hrs" --docker_socket="/var/run/docker.sock"
--docker_stop_timeout="0ns" --docker_store_dir="/tmp/Endpoint_SlaveEndpointTest_NoAuthorizer_2_fG68HC/store/docker"
--docker_volume_checkpoint_dir="/var/run/mesos/isolators/docker/volume" --enforce_container_disk_quota="false"
--executor_registration_timeout="1mins" --executor_reregistration_timeout="2secs" --executor_shutdown_grace_period="5secs"
--fetcher_cache_dir="/tmp/Endpoint_SlaveEndpointTest_NoAuthorizer_2_fG68HC/fetch" --fetcher_cache_size="2GB"
--frameworks_home="" --gc_delay="1weeks" --gc_disk_headroom="0.1" --hadoop_home="" --help="false"
--hostname_lookup="true" --http_command_executor="false" --http_credentials="/tmp/Endpoint_SlaveEndpointTest_NoAuthorizer_2_fG68HC/http_credentials"
--http_heartbeat_interval="30secs" --initialize_driver_logging="true" --isolation="posix/cpu,posix/mem"
--launcher="posix" --launcher_dir="/mesos/mesos-1.4.0/_build/src" --logbufsecs="0" --logging_level="INFO"
--max_completed_executors_per_framework="150" --oversubscribed_resources_interval="15secs"
--perf_duration="10secs" --perf_interval="1mins" --port="5051" --qos_correction_interval_min="0ns"
--quiet="false" --recover="reconnect" --recovery_timeout="15mins" --registration_backoff_factor="10ms"
--resources="cpus:2;gpus:0;mem:1024;disk:1024;ports:[31000-32000]" --revocable_cpu_low_priority="true"
--runtime_dir="/tmp/Endpoint_SlaveEndpointTest_NoAuthorizer_2_fG68HC" --sandbox_directory="/mnt/mesos/sandbox"
--strict="true" --switch_user="true" --systemd_enable_support="true" --systemd_runtime_directory="/run/systemd/system"
--version="false" --work_dir="/tmp/Endpoint_SlaveEndpointTest_NoAuthorizer_2_zIUoSy"
I0722 03:48:26.583216  5050 credentials.hpp:86] Loading credential for authentication from
'/tmp/Endpoint_SlaveEndpointTest_NoAuthorizer_2_fG68HC/credential'
I0722 03:48:26.583474  5050 slave.cpp:283] Agent using credential for: test-principal
I0722 03:48:26.583499  5050 credentials.hpp:37] Loading credentials for authentication from
'/tmp/Endpoint_SlaveEndpointTest_NoAuthorizer_2_fG68HC/http_credentials'
I0722 03:48:26.583897  5050 http.cpp:993] Creating default 'basic' HTTP authenticator for
realm 'mesos-agent-readonly'
I0722 03:48:26.584139  5050 http.cpp:993] Creating default 'basic' HTTP authenticator for
realm 'mesos-agent-readwrite'
I0722 03:48:26.586321  5050 slave.cpp:565] Agent resources: [{"name":"cpus","scalar":{"value":2.0},"type":"SCALAR"},{"name":"mem","scalar":{"value":1024.0},"type":"SCALAR"},{"name":"disk","scalar":{"value":1024.0},"type":"SCALAR"},{"name":"ports","ranges":{"range":[{"begin":31000,"end":32000}]},"type":"RANGES"}]
I0722 03:48:26.586768  5050 slave.cpp:573] Agent attributes: [  ]
I0722 03:48:26.586793  5050 slave.cpp:582] Agent hostname: 025381de44db
I0722 03:48:26.586999  5044 status_update_manager.cpp:177] Pausing sending status updates
I0722 03:48:26.588927  5048 state.cpp:64] Recovering state from '/tmp/Endpoint_SlaveEndpointTest_NoAuthorizer_2_zIUoSy/meta'
I0722 03:48:26.589392  5043 status_update_manager.cpp:203] Recovering status update manager
I0722 03:48:26.589802  5047 containerizer.cpp:582] Recovering containerizer
I0722 03:48:26.591914  5049 provisioner.cpp:416] Provisioner recovery complete
I0722 03:48:26.592593  5046 slave.cpp:6207] Finished recovery
I0722 03:48:26.593329  5046 slave.cpp:6389] Querying resource estimator for oversubscribable
resources
I0722 03:48:26.593683  5049 slave.cpp:6403] Received oversubscribable resources {} from the
resource estimator
I0722 03:48:26.597811  5049 process.cpp:3837] Handling HTTP event for process 'slave(798)'
with path: '/slave(798)/containers'
I0722 03:48:26.599915  5048 http.cpp:1133] HTTP GET for /slave(798)/containers from 172.17.0.2:46338
I0722 03:48:26.600041  5048 http.cpp:957] Authorizing principal 'test-principal' to GET the
'/containers' endpoint
I0722 03:48:26.606518  5043 slave.cpp:843] Agent terminating
[       OK ] Endpoint/SlaveEndpointTest.NoAuthorizer/2 (46 ms)
[----------] 9 tests from Endpoint/SlaveEndpointTest (422 ms total)

[----------] Global test environment tear-down
[==========] 1637 tests from 179 test cases ran. (716884 ms total)
[  PASSED  ] 1633 tests.
[  FAILED  ] 4 tests, listed below:
[  FAILED  ] DefaultExecutorCheckTest.CommandCheckDeliveredAndReconciled
[  FAILED  ] DefaultExecutorCheckTest.CommandCheckStatusChange
[  FAILED  ] DefaultExecutorCheckTest.CommandCheckSeesParentsEnv
[  FAILED  ] DefaultExecutorCheckTest.CommandCheckSharesWorkDirWithTask

 4 FAILED TESTS
  YOU HAVE 20 DISABLED TESTS

I0722 03:48:26.755671  5051 process.cpp:1006] Failed to accept socket: future discarded
make[4]: *** [check-local] Error 1
make[4]: Leaving directory `/mesos/mesos-1.4.0/_build/src'
make[3]: *** [check-am] Error 2
make[3]: Leaving directory `/mesos/mesos-1.4.0/_build/src'
make[2]: *** [check] Error 2
make[2]: Leaving directory `/mesos/mesos-1.4.0/_build/src'
make[1]: *** [check-recursive] Error 1
make[1]: Leaving directory `/mesos/mesos-1.4.0/_build'
make: *** [distcheck] Error 1
+ docker rmi mesos-1500689671-3412
Untagged: mesos-1500689671-3412:latest
Deleted: sha256:9d6e6250250a12c6b607ff8391feeef7cf894d34386e8bb79f0359a26ccbed0a
Deleted: sha256:a6917e0033eaf21fd3d2717a8b74f3e7b84607dbc72b33998dc13be564e9e7b9
Deleted: sha256:f5560cc46dbdaff530d5cceb1ff315bb0f2473b9f0e2a76c2bda4c0e2070440c
Deleted: sha256:e551ece58ed3f68942ec9a2844e3301ba5190100dcdbdd68ff217b16a63624dd
Deleted: sha256:9428f6f918a0b5b3c369e09a1f5f0f565b281d2bd1138befb2df4bc6032a2215
Deleted: sha256:516a7fb47840dd40910d4d40437378ce7f96df90b9daed4750bfce72ae7c6cb6
Deleted: sha256:69e1adfdab328abc9d8e2cc3ac5d2a40323cccccc43e347cb550391ac24b5f65
Deleted: sha256:4c5f413a1566eac425533902de0ecdcbb95dc2f06d3b8c8546d47a0accbdd768
Deleted: sha256:6d9560712a1a9ff9e64b5d7e1ffafa93a433aeda09ee92ae7797e9e10eb69d0c
Deleted: sha256:1d1af14af55437d801344bf197136dc28575081a93c351acd9023c428acef39d
Deleted: sha256:9db14bb32bcbdda71c7bf8cb533ac9e932a899a1a217cf82a354d6b992dbfaf8
Deleted: sha256:c95e6329dd32128d402b84cd013e9a4bc2168f289f98e80d4c74ef5fa6e52055
Deleted: sha256:e6455409dcc3c73f69834549c8b59add2928fc244597a6f97814384ed924351a
Deleted: sha256:d8ce9ba062fce28b6119341951ea364d41cee80fb193eeeb5691d65a002b2762
Deleted: sha256:a8f536075229b6d92eb1444c68d2429f9185cb6480072ed18a926fa6de839248
Deleted: sha256:c82d1847475586552748fa036ae6724bbd140b73ee25f2fd2e59de9c4c61839c
Deleted: sha256:1a76e825147f441d5e7c41726a8fbcef42d67f99592d0b2fe99a84078a2a0b83
Deleted: sha256:b99ba82e774719e8ab393ba4495ca7ac1fce96a22b5d885b7464c5885e0f5fd2
Deleted: sha256:b0ea331a10abe12f0274d7df51ef1bcba92caa4b329f550b44c6937594223257
Deleted: sha256:9320f9689172b0c9682d5c52620a668b4fed68b3ffd152b93c2acb18b8125d63
Deleted: sha256:a47487c9cea830af95cd10cafada814e0d0426abee254895bb422dce128c206a
Deleted: sha256:128956b8ce5e13637622b0f0a7a076ab2bbb17bbe50198f286337931e0971247
Deleted: sha256:12610ca533058928348b0ac453a20487869be4b08026ba500e23cb8b2a8f72c2
Deleted: sha256:f17b658a901e0c6791f6e321fd374a9baaee7ca316517166f31f1475d0cd1c9f
Build step 'Execute shell' marked build as failure

Mime
View raw message