mesos-builds mailing list archives

Site index · List index
Message view « Date » · « Thread »
Top « Date » · « Thread »
From Apache Jenkins Server <jenk...@builds.apache.org>
Subject Build failed in Jenkins: Mesos-Reviewbot #18452
Date Tue, 04 Jul 2017 15:06:25 GMT
See <https://builds.apache.org/job/Mesos-Reviewbot/18452/display/redirect?page=changes>

Changes:

[alexr] Cleaned up logging around subscribers in master.

------------------------------------------
[...truncated 29.64 MB...]
I0704 15:06:13.267889  4970 containerizer.cpp:230] Using isolation: posix/cpu,posix/mem,filesystem/posix,network/cni,environment_secret
W0704 15:06:13.271342  4970 backend.cpp:76] Failed to create 'overlay' backend: OverlayBackend
requires root privileges
W0704 15:06:13.271600  4970 backend.cpp:76] Failed to create 'bind' backend: BindBackend requires
root privileges
I0704 15:06:13.271673  4970 provisioner.cpp:255] Using default backend 'copy'
I0704 15:06:13.277139  4994 slave.cpp:250] Mesos agent started on (772)@172.17.0.4:38481
I0704 15:06:13.277190  4994 slave.cpp:251] Flags at startup: --acls="" --appc_simple_discovery_uri_prefix="http://"
--appc_store_dir="/tmp/Endpoint_SlaveEndpointTest_AuthorizedRequest_2_QmdgNI/store/appc" --authenticate_http_readonly="true"
--authenticate_http_readwrite="true" --authenticatee="crammd5" --authentication_backoff_factor="1secs"
--authorizer="local" --cgroups_cpu_enable_pids_and_tids_count="false" --cgroups_enable_cfs="false"
--cgroups_hierarchy="/sys/fs/cgroup" --cgroups_limit_swap="false" --cgroups_root="mesos" --container_disk_watch_interval="15secs"
--containerizers="mesos" --credential="/tmp/Endpoint_SlaveEndpointTest_AuthorizedRequest_2_QmdgNI/credential"
--default_role="*" --disk_watch_interval="1mins" --docker="docker" --docker_kill_orphans="true"
--docker_registry="https://registry-1.docker.io" --docker_remove_delay="6hrs" --docker_socket="/var/run/docker.sock"
--docker_stop_timeout="0ns" --docker_store_dir="/tmp/Endpoint_SlaveEndpointTest_AuthorizedRequest_2_QmdgNI/store/docker"
--docker_volume_checkpoint_dir="/var/run/mesos/isolators/docker/volume" --enforce_container_disk_quota="false"
--executor_registration_timeout="1mins" --executor_reregistration_timeout="2secs" --executor_shutdown_grace_period="5secs"
--fetcher_cache_dir="/tmp/Endpoint_SlaveEndpointTest_AuthorizedRequest_2_QmdgNI/fetch" --fetcher_cache_size="2GB"
--frameworks_home="" --gc_delay="1weeks" --gc_disk_headroom="0.1" --hadoop_home="" --help="false"
--hostname_lookup="true" --http_command_executor="false" --http_credentials="/tmp/Endpoint_SlaveEndpointTest_AuthorizedRequest_2_QmdgNI/http_credentials"
--http_heartbeat_interval="30secs" --initialize_driver_logging="true" --isolation="posix/cpu,posix/mem"
--launcher="posix" --launcher_dir="/mesos/mesos-1.4.0/_build/src" --logbufsecs="0" --logging_level="INFO"
--max_completed_executors_per_framework="150" --oversubscribed_resources_interval="15secs"
--perf_duration="10secs" --perf_interval="1mins" --port="5051" --qos_correction_interval_min="0ns"
--quiet="false" --recover="reconnect" --recovery_timeout="15mins" --registration_backoff_factor="10ms"
--resources="cpus:2;gpus:0;mem:1024;disk:1024;ports:[31000-32000]" --revocable_cpu_low_priority="true"
--runtime_dir="/tmp/Endpoint_SlaveEndpointTest_AuthorizedRequest_2_QmdgNI" --sandbox_directory="/mnt/mesos/sandbox"
--strict="true" --switch_user="true" --systemd_enable_support="true" --systemd_runtime_directory="/run/systemd/system"
--version="false" --work_dir="/tmp/Endpoint_SlaveEndpointTest_AuthorizedRequest_2_GQ0ZSu"
I0704 15:06:13.278192  4994 credentials.hpp:86] Loading credential for authentication from
'/tmp/Endpoint_SlaveEndpointTest_AuthorizedRequest_2_QmdgNI/credential'
I0704 15:06:13.278484  4994 slave.cpp:283] Agent using credential for: test-principal
I0704 15:06:13.278514  4994 credentials.hpp:37] Loading credentials for authentication from
'/tmp/Endpoint_SlaveEndpointTest_AuthorizedRequest_2_QmdgNI/http_credentials'
I0704 15:06:13.279084  4994 http.cpp:976] Creating default 'basic' HTTP authenticator for
realm 'mesos-agent-readonly'
I0704 15:06:13.279573  4994 http.cpp:976] Creating default 'basic' HTTP authenticator for
realm 'mesos-agent-readwrite'
I0704 15:06:13.282235  4994 slave.cpp:565] Agent resources: [{"name":"cpus","scalar":{"value":2.0},"type":"SCALAR"},{"name":"mem","scalar":{"value":1024.0},"type":"SCALAR"},{"name":"disk","scalar":{"value":1024.0},"type":"SCALAR"},{"name":"ports","ranges":{"range":[{"begin":31000,"end":32000}]},"type":"RANGES"}]
I0704 15:06:13.282707  4994 slave.cpp:573] Agent attributes: [  ]
I0704 15:06:13.282735  4994 slave.cpp:578] Agent hostname: e468e375a166
I0704 15:06:13.283136  4992 status_update_manager.cpp:177] Pausing sending status updates
I0704 15:06:13.287195  4994 state.cpp:64] Recovering state from '/tmp/Endpoint_SlaveEndpointTest_AuthorizedRequest_2_GQ0ZSu/meta'
I0704 15:06:13.287770  4989 status_update_manager.cpp:203] Recovering status update manager
I0704 15:06:13.304183  4992 containerizer.cpp:582] Recovering containerizer
I0704 15:06:13.307996  4996 provisioner.cpp:416] Provisioner recovery complete
I0704 15:06:13.309485  4989 slave.cpp:6189] Finished recovery
I0704 15:06:13.310526  4989 slave.cpp:6371] Querying resource estimator for oversubscribable
resources
I0704 15:06:13.311372  4995 slave.cpp:6385] Received oversubscribable resources {} from the
resource estimator
I0704 15:06:13.317611  4996 process.cpp:3779] Handling HTTP event for process 'slave(772)'
with path: '/slave(772)/containers'
I0704 15:06:13.320127  4996 http.cpp:1116] HTTP GET for /slave(772)/containers from 172.17.0.4:35890
I0704 15:06:13.324074  4996 http.cpp:937] Authorizing principal 'test-principal' to GET the
'/containers' endpoint
I0704 15:06:13.339896  4970 slave.cpp:839] Agent terminating
[       OK ] Endpoint/SlaveEndpointTest.AuthorizedRequest/2 (99 ms)
[ RUN      ] Endpoint/SlaveEndpointTest.UnauthorizedRequest/0
I0704 15:06:13.366791  4970 containerizer.cpp:230] Using isolation: posix/cpu,posix/mem,filesystem/posix,network/cni,environment_secret
W0704 15:06:13.374689  4970 backend.cpp:76] Failed to create 'overlay' backend: OverlayBackend
requires root privileges
W0704 15:06:13.375277  4970 backend.cpp:76] Failed to create 'bind' backend: BindBackend requires
root privileges
I0704 15:06:13.375401  4970 provisioner.cpp:255] Using default backend 'copy'
I0704 15:06:13.382706  4995 slave.cpp:250] Mesos agent started on (773)@172.17.0.4:38481
I0704 15:06:13.382753  4995 slave.cpp:251] Flags at startup: --acls="" --appc_simple_discovery_uri_prefix="http://"
--appc_store_dir="/tmp/Endpoint_SlaveEndpointTest_UnauthorizedRequest_0_OTQrjD/store/appc"
--authenticate_http_readonly="true" --authenticate_http_readwrite="true" --authenticatee="crammd5"
--authentication_backoff_factor="1secs" --authorizer="local" --cgroups_cpu_enable_pids_and_tids_count="false"
--cgroups_enable_cfs="false" --cgroups_hierarchy="/sys/fs/cgroup" --cgroups_limit_swap="false"
--cgroups_root="mesos" --container_disk_watch_interval="15secs" --containerizers="mesos" --credential="/tmp/Endpoint_SlaveEndpointTest_UnauthorizedRequest_0_OTQrjD/credential"
--default_role="*" --disk_watch_interval="1mins" --docker="docker" --docker_kill_orphans="true"
--docker_registry="https://registry-1.docker.io" --docker_remove_delay="6hrs" --docker_socket="/var/run/docker.sock"
--docker_stop_timeout="0ns" --docker_store_dir="/tmp/Endpoint_SlaveEndpointTest_UnauthorizedRequest_0_OTQrjD/store/docker"
--docker_volume_checkpoint_dir="/var/run/mesos/isolators/docker/volume" --enforce_container_disk_quota="false"
--executor_registration_timeout="1mins" --executor_reregistration_timeout="2secs" --executor_shutdown_grace_period="5secs"
--fetcher_cache_dir="/tmp/Endpoint_SlaveEndpointTest_UnauthorizedRequest_0_OTQrjD/fetch" --fetcher_cache_size="2GB"
--frameworks_home="" --gc_delay="1weeks" --gc_disk_headroom="0.1" --hadoop_home="" --help="false"
--hostname_lookup="true" --http_command_executor="false" --http_credentials="/tmp/Endpoint_SlaveEndpointTest_UnauthorizedRequest_0_OTQrjD/http_credentials"
--http_heartbeat_interval="30secs" --initialize_driver_logging="true" --isolation="posix/cpu,posix/mem"
--launcher="posix" --launcher_dir="/mesos/mesos-1.4.0/_build/src" --logbufsecs="0" --logging_level="INFO"
--max_completed_executors_per_framework="150" --oversubscribed_resources_interval="15secs"
--perf_duration="10secs" --perf_interval="1mins" --port="5051" --qos_correction_interval_min="0ns"
--quiet="false" --recover="reconnect" --recovery_timeout="15mins" --registration_backoff_factor="10ms"
--resources="cpus:2;gpus:0;mem:1024;disk:1024;ports:[31000-32000]" --revocable_cpu_low_priority="true"
--runtime_dir="/tmp/Endpoint_SlaveEndpointTest_UnauthorizedRequest_0_OTQrjD" --sandbox_directory="/mnt/mesos/sandbox"
--strict="true" --switch_user="true" --systemd_enable_support="true" --systemd_runtime_directory="/run/systemd/system"
--version="false" --work_dir="/tmp/Endpoint_SlaveEndpointTest_UnauthorizedRequest_0_iIK88o"
I0704 15:06:13.383647  4995 credentials.hpp:86] Loading credential for authentication from
'/tmp/Endpoint_SlaveEndpointTest_UnauthorizedRequest_0_OTQrjD/credential'
I0704 15:06:13.384093  4995 slave.cpp:283] Agent using credential for: test-principal
I0704 15:06:13.384137  4995 credentials.hpp:37] Loading credentials for authentication from
'/tmp/Endpoint_SlaveEndpointTest_UnauthorizedRequest_0_OTQrjD/http_credentials'
I0704 15:06:13.384739  4995 http.cpp:976] Creating default 'basic' HTTP authenticator for
realm 'mesos-agent-readonly'
I0704 15:06:13.385201  4995 http.cpp:976] Creating default 'basic' HTTP authenticator for
realm 'mesos-agent-readwrite'
I0704 15:06:13.387773  4995 slave.cpp:565] Agent resources: [{"name":"cpus","scalar":{"value":2.0},"type":"SCALAR"},{"name":"mem","scalar":{"value":1024.0},"type":"SCALAR"},{"name":"disk","scalar":{"value":1024.0},"type":"SCALAR"},{"name":"ports","ranges":{"range":[{"begin":31000,"end":32000}]},"type":"RANGES"}]
I0704 15:06:13.388319  4995 slave.cpp:573] Agent attributes: [  ]
I0704 15:06:13.388346  4995 slave.cpp:578] Agent hostname: e468e375a166
I0704 15:06:13.388746  4990 status_update_manager.cpp:177] Pausing sending status updates
I0704 15:06:13.390988  4990 state.cpp:64] Recovering state from '/tmp/Endpoint_SlaveEndpointTest_UnauthorizedRequest_0_iIK88o/meta'
I0704 15:06:13.392073  4990 status_update_manager.cpp:203] Recovering status update manager
I0704 15:06:13.392602  4993 containerizer.cpp:582] Recovering containerizer
I0704 15:06:13.398464  4993 provisioner.cpp:416] Provisioner recovery complete
I0704 15:06:13.399204  4992 slave.cpp:6189] Finished recovery
I0704 15:06:13.400017  4992 slave.cpp:6371] Querying resource estimator for oversubscribable
resources
I0704 15:06:13.400764  4992 slave.cpp:6385] Received oversubscribable resources {} from the
resource estimator
I0704 15:06:13.408440  4993 process.cpp:3779] Handling HTTP event for process 'slave(773)'
with path: '/slave(773)/monitor/statistics'
I0704 15:06:13.411401  4993 http.cpp:1116] HTTP GET for /slave(773)/monitor/statistics from
172.17.0.4:35894
I0704 15:06:13.411540  4993 http.cpp:937] Authorizing principal 'test-principal' to GET the
'/monitor/statistics' endpoint
I0704 15:06:13.428514  4970 slave.cpp:839] Agent terminating
[       OK ] Endpoint/SlaveEndpointTest.UnauthorizedRequest/0 (76 ms)
[ RUN      ] Endpoint/SlaveEndpointTest.UnauthorizedRequest/1
I0704 15:06:13.449517  4970 containerizer.cpp:230] Using isolation: posix/cpu,posix/mem,filesystem/posix,network/cni,environment_secret
W0704 15:06:13.454684  4970 backend.cpp:76] Failed to create 'overlay' backend: OverlayBackend
requires root privileges
W0704 15:06:13.454947  4970 backend.cpp:76] Failed to create 'bind' backend: BindBackend requires
root privileges
I0704 15:06:13.455019  4970 provisioner.cpp:255] Using default backend 'copy'
I0704 15:06:13.460767  4991 slave.cpp:250] Mesos agent started on (774)@172.17.0.4:38481
I0704 15:06:13.460816  4991 slave.cpp:251] Flags at startup: --acls="" --appc_simple_discovery_uri_prefix="http://"
--appc_store_dir="/tmp/Endpoint_SlaveEndpointTest_UnauthorizedRequest_1_6mpkIy/store/appc"
--authenticate_http_readonly="true" --authenticate_http_readwrite="true" --authenticatee="crammd5"
--authentication_backoff_factor="1secs" --authorizer="local" --cgroups_cpu_enable_pids_and_tids_count="false"
--cgroups_enable_cfs="false" --cgroups_hierarchy="/sys/fs/cgroup" --cgroups_limit_swap="false"
--cgroups_root="mesos" --container_disk_watch_interval="15secs" --containerizers="mesos" --credential="/tmp/Endpoint_SlaveEndpointTest_UnauthorizedRequest_1_6mpkIy/credential"
--default_role="*" --disk_watch_interval="1mins" --docker="docker" --docker_kill_orphans="true"
--docker_registry="https://registry-1.docker.io" --docker_remove_delay="6hrs" --docker_socket="/var/run/docker.sock"
--docker_stop_timeout="0ns" --docker_store_dir="/tmp/Endpoint_SlaveEndpointTest_UnauthorizedRequest_1_6mpkIy/store/docker"
--docker_volume_checkpoint_dir="/var/run/mesos/isolators/docker/volume" --enforce_container_disk_quota="false"
--executor_registration_timeout="1mins" --executor_reregistration_timeout="2secs" --executor_shutdown_grace_period="5secs"
--fetcher_cache_dir="/tmp/Endpoint_SlaveEndpointTest_UnauthorizedRequest_1_6mpkIy/fetch" --fetcher_cache_size="2GB"
--frameworks_home="" --gc_delay="1weeks" --gc_disk_headroom="0.1" --hadoop_home="" --help="false"
--hostname_lookup="true" --http_command_executor="false" --http_credentials="/tmp/Endpoint_SlaveEndpointTest_UnauthorizedRequest_1_6mpkIy/http_credentials"
--http_heartbeat_interval="30secs" --initialize_driver_logging="true" --isolation="posix/cpu,posix/mem"
--launcher="posix" --launcher_dir="/mesos/mesos-1.4.0/_build/src" --logbufsecs="0" --logging_level="INFO"
--max_completed_executors_per_framework="150" --oversubscribed_resources_interval="15secs"
--perf_duration="10secs" --perf_interval="1mins" --port="5051" --qos_correction_interval_min="0ns"
--quiet="false" --recover="reconnect" --recovery_timeout="15mins" --registration_backoff_factor="10ms"
--resources="cpus:2;gpus:0;mem:1024;disk:1024;ports:[31000-32000]" --revocable_cpu_low_priority="true"
--runtime_dir="/tmp/Endpoint_SlaveEndpointTest_UnauthorizedRequest_1_6mpkIy" --sandbox_directory="/mnt/mesos/sandbox"
--strict="true" --switch_user="true" --systemd_enable_support="true" --systemd_runtime_directory="/run/systemd/system"
--version="false" --work_dir="/tmp/Endpoint_SlaveEndpointTest_UnauthorizedRequest_1_UzwDkk"
I0704 15:06:13.461617  4991 credentials.hpp:86] Loading credential for authentication from
'/tmp/Endpoint_SlaveEndpointTest_UnauthorizedRequest_1_6mpkIy/credential'
I0704 15:06:13.461925  4991 slave.cpp:283] Agent using credential for: test-principal
I0704 15:06:13.461962  4991 credentials.hpp:37] Loading credentials for authentication from
'/tmp/Endpoint_SlaveEndpointTest_UnauthorizedRequest_1_6mpkIy/http_credentials'
I0704 15:06:13.462488  4991 http.cpp:976] Creating default 'basic' HTTP authenticator for
realm 'mesos-agent-readonly'
I0704 15:06:13.462779  4991 http.cpp:976] Creating default 'basic' HTTP authenticator for
realm 'mesos-agent-readwrite'
I0704 15:06:13.465255  4991 slave.cpp:565] Agent resources: [{"name":"cpus","scalar":{"value":2.0},"type":"SCALAR"},{"name":"mem","scalar":{"value":1024.0},"type":"SCALAR"},{"name":"disk","scalar":{"value":1024.0},"type":"SCALAR"},{"name":"ports","ranges":{"range":[{"begin":31000,"end":32000}]},"type":"RANGES"}]
I0704 15:06:13.465739  4991 slave.cpp:573] Agent attributes: [  ]
I0704 15:06:13.465770  4991 slave.cpp:578] Agent hostname: e468e375a166
I0704 15:06:13.466123  4989 status_update_manager.cpp:177] Pausing sending status updates
I0704 15:06:13.469481  4992 state.cpp:64] Recovering state from '/tmp/Endpoint_SlaveEndpointTest_UnauthorizedRequest_1_UzwDkk/meta'
I0704 15:06:13.470109  4994 status_update_manager.cpp:203] Recovering status update manager
I0704 15:06:13.470660  4994 containerizer.cpp:582] Recovering containerizer
I0704 15:06:13.473934  4990 provisioner.cpp:416] Provisioner recovery complete
I0704 15:06:13.476464  4994 slave.cpp:6189] Finished recovery
I0704 15:06:13.477262  4994 slave.cpp:6371] Querying resource estimator for oversubscribable
resources
I0704 15:06:13.477828  4994 slave.cpp:6385] Received oversubscribable resources {} from the
resource estimator
I0704 15:06:13.486326  4996 process.cpp:3779] Handling HTTP event for process 'slave(774)'
with path: '/slave(774)/monitor/statistics.json'
I0704 15:06:13.488883  4996 http.cpp:1116] HTTP GET for /slave(774)/monitor/statistics.json
from 172.17.0.4:35898
I0704 15:06:13.493957  4996 http.cpp:937] Authorizing principal 'test-principal' to GET the
'/monitor/statistics.json' endpoint
I0704 15:06:13.512114  4991 slave.cpp:839] Agent terminating
[       OK ] Endpoint/SlaveEndpointTest.UnauthorizedRequest/1 (88 ms)
[ RUN      ] Endpoint/SlaveEndpointTest.UnauthorizedRequest/2
I0704 15:06:13.537443  4970 containerizer.cpp:230] Using isolation: posix/cpu,posix/mem,filesystem/posix,network/cni,environment_secret
W0704 15:06:13.539523  4970 backend.cpp:76] Failed to create 'overlay' backend: OverlayBackend
requires root privileges
W0704 15:06:13.540107  4970 backend.cpp:76] Failed to create 'bind' backend: BindBackend requires
root privileges
I0704 15:06:13.540289  4970 provisioner.cpp:255] Using default backend 'copy'
I0704 15:06:13.554467  4991 slave.cpp:250] Mesos agent started on (775)@172.17.0.4:38481
I0704 15:06:13.554515  4991 slave.cpp:251] Flags at startup: --acls="" --appc_simple_discovery_uri_prefix="http://"
--appc_store_dir="/tmp/Endpoint_SlaveEndpointTest_UnauthorizedRequest_2_4PsFZu/store/appc"
--authenticate_http_readonly="true" --authenticate_http_readwrite="true" --authenticatee="crammd5"
--authentication_backoff_factor="1secs" --authorizer="local" --cgroups_cpu_enable_pids_and_tids_count="false"
--cgroups_enable_cfs="false" --cgroups_hierarchy="/sys/fs/cgroup" --cgroups_limit_swap="false"
--cgroups_root="mesos" --container_disk_watch_interval="15secs" --containerizers="mesos" --credential="/tmp/Endpoint_SlaveEndpointTest_UnauthorizedRequest_2_4PsFZu/credential"
--default_role="*" --disk_watch_interval="1mins" --docker="docker" --docker_kill_orphans="true"
--docker_registry="https://registry-1.docker.io" --docker_remove_delay="6hrs" --docker_socket="/var/run/docker.sock"
--docker_stop_timeout="0ns" --docker_store_dir="/tmp/Endpoint_SlaveEndpointTest_UnauthorizedRequest_2_4PsFZu/store/docker"
--docker_volume_checkpoint_dir="/var/run/mesos/isolators/docker/volume" --enforce_container_disk_quota="false"
--executor_registration_timeout="1mins" --executor_reregistration_timeout="2secs" --executor_shutdown_grace_period="5secs"
--fetcher_cache_dir="/tmp/Endpoint_SlaveEndpointTest_UnauthorizedRequest_2_4PsFZu/fetch" --fetcher_cache_size="2GB"
--frameworks_home="" --gc_delay="1weeks" --gc_disk_headroom="0.1" --hadoop_home="" --help="false"
--hostname_lookup="true" --http_command_executor="false" --http_credentials="/tmp/Endpoint_SlaveEndpointTest_UnauthorizedRequest_2_4PsFZu/http_credentials"
--http_heartbeat_interval="30secs" --initialize_driver_logging="true" --isolation="posix/cpu,posix/mem"
--launcher="posix" --launcher_dir="/mesos/mesos-1.4.0/_build/src" --logbufsecs="0" --logging_level="INFO"
--max_completed_executors_per_framework="150" --oversubscribed_resources_interval="15secs"
--perf_duration="10secs" --perf_interval="1mins" --port="5051" --qos_correction_interval_min="0ns"
--quiet="false" --recover="reconnect" --recovery_timeout="15mins" --registration_backoff_factor="10ms"
--resources="cpus:2;gpus:0;mem:1024;disk:1024;ports:[31000-32000]" --revocable_cpu_low_priority="true"
--runtime_dir="/tmp/Endpoint_SlaveEndpointTest_UnauthorizedRequest_2_4PsFZu" --sandbox_directory="/mnt/mesos/sandbox"
--strict="true" --switch_user="true" --systemd_enable_support="true" --systemd_runtime_directory="/run/systemd/system"
--version="false" --work_dir="/tmp/Endpoint_SlaveEndpointTest_UnauthorizedRequest_2_myeJng"
I0704 15:06:13.555281  4991 credentials.hpp:86] Loading credential for authentication from
'/tmp/Endpoint_SlaveEndpointTest_UnauthorizedRequest_2_4PsFZu/credential'
I0704 15:06:13.555586  4991 slave.cpp:283] Agent using credential for: test-principal
I0704 15:06:13.555642  4991 credentials.hpp:37] Loading credentials for authentication from
'/tmp/Endpoint_SlaveEndpointTest_UnauthorizedRequest_2_4PsFZu/http_credentials'
I0704 15:06:13.556082  4991 http.cpp:976] Creating default 'basic' HTTP authenticator for
realm 'mesos-agent-readonly'
I0704 15:06:13.556409  4991 http.cpp:976] Creating default 'basic' HTTP authenticator for
realm 'mesos-agent-readwrite'
I0704 15:06:13.559077  4991 slave.cpp:565] Agent resources: [{"name":"cpus","scalar":{"value":2.0},"type":"SCALAR"},{"name":"mem","scalar":{"value":1024.0},"type":"SCALAR"},{"name":"disk","scalar":{"value":1024.0},"type":"SCALAR"},{"name":"ports","ranges":{"range":[{"begin":31000,"end":32000}]},"type":"RANGES"}]
I0704 15:06:13.559568  4991 slave.cpp:573] Agent attributes: [  ]
I0704 15:06:13.559597  4991 slave.cpp:578] Agent hostname: e468e375a166
I0704 15:06:13.559945  4989 status_update_manager.cpp:177] Pausing sending status updates
I0704 15:06:13.565194  4993 state.cpp:64] Recovering state from '/tmp/Endpoint_SlaveEndpointTest_UnauthorizedRequest_2_myeJng/meta'
I0704 15:06:13.565980  4993 status_update_manager.cpp:203] Recovering status update manager
I0704 15:06:13.566231  4993 containerizer.cpp:582] Recovering containerizer
I0704 15:06:13.569809  4993 provisioner.cpp:416] Provisioner recovery complete
I0704 15:06:13.571019  4995 slave.cpp:6189] Finished recovery
I0704 15:06:13.571713  4995 slave.cpp:6371] Querying resource estimator for oversubscribable
resources
I0704 15:06:13.575083  4995 slave.cpp:6385] Received oversubscribable resources {} from the
resource estimator
I0704 15:06:13.584744  4989 process.cpp:3779] Handling HTTP event for process 'slave(775)'
with path: '/slave(775)/containers'
I0704 15:06:13.587671  4989 http.cpp:1116] HTTP GET for /slave(775)/containers from 172.17.0.4:35900
I0704 15:06:13.587808  4989 http.cpp:937] Authorizing principal 'test-principal' to GET the
'/containers' endpoint
I0704 15:06:13.610641  4970 slave.cpp:839] Agent terminating
[       OK ] Endpoint/SlaveEndpointTest.UnauthorizedRequest/2 (99 ms)
[ RUN      ] Endpoint/SlaveEndpointTest.NoAuthorizer/0
I0704 15:06:13.637550  4970 containerizer.cpp:230] Using isolation: posix/cpu,posix/mem,filesystem/posix,network/cni,environment_secret
W0704 15:06:13.638756  4970 backend.cpp:76] Failed to create 'overlay' backend: OverlayBackend
requires root privileges
W0704 15:06:13.639256  4970 backend.cpp:76] Failed to create 'bind' backend: BindBackend requires
root privileges
I0704 15:06:13.639380  4970 provisioner.cpp:255] Using default backend 'copy'
I0704 15:06:13.644644  4970 cluster.cpp:448] Creating default 'local' authorizer
I0704 15:06:13.656832  4996 slave.cpp:250] Mesos agent started on (776)@172.17.0.4:38481
I0704 15:06:13.656884  4996 slave.cpp:251] Flags at startup: --acls="" --appc_simple_discovery_uri_prefix="http://"
--appc_store_dir="/tmp/Endpoint_SlaveEndpointTest_NoAuthorizer_0_0NImhs/store/appc" --authenticate_http_readonly="true"
--authenticate_http_readwrite="true" --authenticatee="crammd5" --authentication_backoff_factor="1secs"
--authorizer="local" --cgroups_cpu_enable_pids_and_tids_count="false" --cgroups_enable_cfs="false"
--cgroups_hierarchy="/sys/fs/cgroup" --cgroups_limit_swap="false" --cgroups_root="mesos" --container_disk_watch_interval="15secs"
--containerizers="mesos" --credential="/tmp/Endpoint_SlaveEndpointTest_NoAuthorizer_0_0NImhs/credential"
--default_role="*" --disk_watch_interval="1mins" --docker="docker" --docker_kill_orphans="true"
--docker_registry="https://registry-1.docker.io" --docker_remove_delay="6hrs" --docker_socket="/var/run/docker.sock"
--docker_stop_timeout="0ns" --docker_store_dir="/tmp/Endpoint_SlaveEndpointTest_NoAuthorizer_0_0NImhs/store/docker"
--docker_volume_checkpoint_dir="/var/run/mesos/isolators/docker/volume" --enforce_container_disk_quota="false"
--executor_registration_timeout="1mins" --executor_reregistration_timeout="2secs" --executor_shutdown_grace_period="5secs"
--fetcher_cache_dir="/tmp/Endpoint_SlaveEndpointTest_NoAuthorizer_0_0NImhs/fetch" --fetcher_cache_size="2GB"
--frameworks_home="" --gc_delay="1weeks" --gc_disk_headroom="0.1" --hadoop_home="" --help="false"
--hostname_lookup="true" --http_command_executor="false" --http_credentials="/tmp/Endpoint_SlaveEndpointTest_NoAuthorizer_0_0NImhs/http_credentials"
--http_heartbeat_interval="30secs" --initialize_driver_logging="true" --isolation="posix/cpu,posix/mem"
--launcher="posix" --launcher_dir="/mesos/mesos-1.4.0/_build/src" --logbufsecs="0" --logging_level="INFO"
--max_completed_executors_per_framework="150" --oversubscribed_resources_interval="15secs"
--perf_duration="10secs" --perf_interval="1mins" --port="5051" --qos_correction_interval_min="0ns"
--quiet="false" --recover="reconnect" --recovery_timeout="15mins" --registration_backoff_factor="10ms"
--resources="cpus:2;gpus:0;mem:1024;disk:1024;ports:[31000-32000]" --revocable_cpu_low_priority="true"
--runtime_dir="/tmp/Endpoint_SlaveEndpointTest_NoAuthorizer_0_0NImhs" --sandbox_directory="/mnt/mesos/sandbox"
--strict="true" --switch_user="true" --systemd_enable_support="true" --systemd_runtime_directory="/run/systemd/system"
--version="false" --work_dir="/tmp/Endpoint_SlaveEndpointTest_NoAuthorizer_0_0CWZpd"
I0704 15:06:13.657663  4996 credentials.hpp:86] Loading credential for authentication from
'/tmp/Endpoint_SlaveEndpointTest_NoAuthorizer_0_0NImhs/credential'
I0704 15:06:13.657966  4996 slave.cpp:283] Agent using credential for: test-principal
I0704 15:06:13.658011  4996 credentials.hpp:37] Loading credentials for authentication from
'/tmp/Endpoint_SlaveEndpointTest_NoAuthorizer_0_0NImhs/http_credentials'
I0704 15:06:13.658486  4996 http.cpp:976] Creating default 'basic' HTTP authenticator for
realm 'mesos-agent-readonly'
I0704 15:06:13.660127  4996 http.cpp:976] Creating default 'basic' HTTP authenticator for
realm 'mesos-agent-readwrite'
I0704 15:06:13.662776  4996 slave.cpp:565] Agent resources: [{"name":"cpus","scalar":{"value":2.0},"type":"SCALAR"},{"name":"mem","scalar":{"value":1024.0},"type":"SCALAR"},{"name":"disk","scalar":{"value":1024.0},"type":"SCALAR"},{"name":"ports","ranges":{"range":[{"begin":31000,"end":32000}]},"type":"RANGES"}]
I0704 15:06:13.663259  4996 slave.cpp:573] Agent attributes: [  ]
I0704 15:06:13.663290  4996 slave.cpp:578] Agent hostname: e468e375a166
I0704 15:06:13.663632  4990 status_update_manager.cpp:177] Pausing sending status updates
I0704 15:06:13.670111  4990 state.cpp:64] Recovering state from '/tmp/Endpoint_SlaveEndpointTest_NoAuthorizer_0_0CWZpd/meta'
I0704 15:06:13.671105  4990 status_update_manager.cpp:203] Recovering status update manager
I0704 15:06:13.672484  4995 containerizer.cpp:582] Recovering containerizer
I0704 15:06:13.676231  4995 provisioner.cpp:416] Provisioner recovery complete
I0704 15:06:13.677083  4994 slave.cpp:6189] Finished recovery
I0704 15:06:13.677865  4994 slave.cpp:6371] Querying resource estimator for oversubscribable
resources
I0704 15:06:13.678373  4994 slave.cpp:6385] Received oversubscribable resources {} from the
resource estimator
I0704 15:06:13.684260  4990 process.cpp:3779] Handling HTTP event for process 'slave(776)'
with path: '/slave(776)/monitor/statistics'
I0704 15:06:13.687409  4990 http.cpp:1116] HTTP GET for /slave(776)/monitor/statistics from
172.17.0.4:35902
I0704 15:06:13.687546  4990 http.cpp:937] Authorizing principal 'test-principal' to GET the
'/monitor/statistics' endpoint
I0704 15:06:13.710088  4970 slave.cpp:839] Agent terminating
[       OK ] Endpoint/SlaveEndpointTest.NoAuthorizer/0 (105 ms)
[ RUN      ] Endpoint/SlaveEndpointTest.NoAuthorizer/1
I0704 15:06:13.751101  4970 containerizer.cpp:230] Using isolation: posix/cpu,posix/mem,filesystem/posix,network/cni,environment_secret
W0704 15:06:13.752308  4970 backend.cpp:76] Failed to create 'overlay' backend: OverlayBackend
requires root privileges
W0704 15:06:13.752833  4970 backend.cpp:76] Failed to create 'bind' backend: BindBackend requires
root privileges
I0704 15:06:13.752957  4970 provisioner.cpp:255] Using default backend 'copy'
I0704 15:06:13.755878  4970 cluster.cpp:448] Creating default 'local' authorizer
I0704 15:06:13.761214  4994 slave.cpp:250] Mesos agent started on (777)@172.17.0.4:38481
I0704 15:06:13.761265  4994 slave.cpp:251] Flags at startup: --acls="" --appc_simple_discovery_uri_prefix="http://"
--appc_store_dir="/tmp/Endpoint_SlaveEndpointTest_NoAuthorizer_1_ECGKGq/store/appc" --authenticate_http_readonly="true"
--authenticate_http_readwrite="true" --authenticatee="crammd5" --authentication_backoff_factor="1secs"
--authorizer="local" --cgroups_cpu_enable_pids_and_tids_count="false" --cgroups_enable_cfs="false"
--cgroups_hierarchy="/sys/fs/cgroup" --cgroups_limit_swap="false" --cgroups_root="mesos" --container_disk_watch_interval="15secs"
--containerizers="mesos" --credential="/tmp/Endpoint_SlaveEndpointTest_NoAuthorizer_1_ECGKGq/credential"
--default_role="*" --disk_watch_interval="1mins" --docker="docker" --docker_kill_orphans="true"
--docker_registry="https://registry-1.docker.io" --docker_remove_delay="6hrs" --docker_socket="/var/run/docker.sock"
--docker_stop_timeout="0ns" --docker_store_dir="/tmp/Endpoint_SlaveEndpointTest_NoAuthorizer_1_ECGKGq/store/docker"
--docker_volume_checkpoint_dir="/var/run/mesos/isolators/docker/volume" --enforce_container_disk_quota="false"
--executor_registration_timeout="1mins" --executor_reregistration_timeout="2secs" --executor_shutdown_grace_period="5secs"
--fetcher_cache_dir="/tmp/Endpoint_SlaveEndpointTest_NoAuthorizer_1_ECGKGq/fetch" --fetcher_cache_size="2GB"
--frameworks_home="" --gc_delay="1weeks" --gc_disk_headroom="0.1" --hadoop_home="" --help="false"
--hostname_lookup="true" --http_command_executor="false" --http_credentials="/tmp/Endpoint_SlaveEndpointTest_NoAuthorizer_1_ECGKGq/http_credentials"
--http_heartbeat_interval="30secs" --initialize_driver_logging="true" --isolation="posix/cpu,posix/mem"
--launcher="posix" --launcher_dir="/mesos/mesos-1.4.0/_build/src" --logbufsecs="0" --logging_level="INFO"
--max_completed_executors_per_framework="150" --oversubscribed_resources_interval="15secs"
--perf_duration="10secs" --perf_interval="1mins" --port="5051" --qos_correction_interval_min="0ns"
--quiet="false" --recover="reconnect" --recovery_timeout="15mins" --registration_backoff_factor="10ms"
--resources="cpus:2;gpus:0;mem:1024;disk:1024;ports:[31000-32000]" --revocable_cpu_low_priority="true"
--runtime_dir="/tmp/Endpoint_SlaveEndpointTest_NoAuthorizer_1_ECGKGq" --sandbox_directory="/mnt/mesos/sandbox"
--strict="true" --switch_user="true" --systemd_enable_support="true" --systemd_runtime_directory="/run/systemd/system"
--version="false" --work_dir="/tmp/Endpoint_SlaveEndpointTest_NoAuthorizer_1_SMJHxb"
I0704 15:06:13.762264  4994 credentials.hpp:86] Loading credential for authentication from
'/tmp/Endpoint_SlaveEndpointTest_NoAuthorizer_1_ECGKGq/credential'
I0704 15:06:13.762742  4994 slave.cpp:283] Agent using credential for: test-principal
I0704 15:06:13.762794  4994 credentials.hpp:37] Loading credentials for authentication from
'/tmp/Endpoint_SlaveEndpointTest_NoAuthorizer_1_ECGKGq/http_credentials'
I0704 15:06:13.763449  4994 http.cpp:976] Creating default 'basic' HTTP authenticator for
realm 'mesos-agent-readonly'
I0704 15:06:13.764003  4994 http.cpp:976] Creating default 'basic' HTTP authenticator for
realm 'mesos-agent-readwrite'
I0704 15:06:13.767101  4994 slave.cpp:565] Agent resources: [{"name":"cpus","scalar":{"value":2.0},"type":"SCALAR"},{"name":"mem","scalar":{"value":1024.0},"type":"SCALAR"},{"name":"disk","scalar":{"value":1024.0},"type":"SCALAR"},{"name":"ports","ranges":{"range":[{"begin":31000,"end":32000}]},"type":"RANGES"}]
I0704 15:06:13.767601  4994 slave.cpp:573] Agent attributes: [  ]
I0704 15:06:13.767635  4994 slave.cpp:578] Agent hostname: e468e375a166
I0704 15:06:13.771242  4992 status_update_manager.cpp:177] Pausing sending status updates
I0704 15:06:13.774094  4996 state.cpp:64] Recovering state from '/tmp/Endpoint_SlaveEndpointTest_NoAuthorizer_1_SMJHxb/meta'
I0704 15:06:13.775763  4993 status_update_manager.cpp:203] Recovering status update manager
I0704 15:06:13.776284  4989 containerizer.cpp:582] Recovering containerizer
I0704 15:06:13.779757  4990 provisioner.cpp:416] Provisioner recovery complete
I0704 15:06:13.780601  4991 slave.cpp:6189] Finished recovery
I0704 15:06:13.781812  4991 slave.cpp:6371] Querying resource estimator for oversubscribable
resources
I0704 15:06:13.785331  4990 slave.cpp:6385] Received oversubscribable resources {} from the
resource estimator
I0704 15:06:13.792397  4989 process.cpp:3779] Handling HTTP event for process 'slave(777)'
with path: '/slave(777)/monitor/statistics.json'
I0704 15:06:13.798485  4995 http.cpp:1116] HTTP GET for /slave(777)/monitor/statistics.json
from 172.17.0.4:35904
I0704 15:06:13.798774  4995 http.cpp:937] Authorizing principal 'test-principal' to GET the
'/monitor/statistics.json' endpoint
I0704 15:06:13.824198  4970 slave.cpp:839] Agent terminating
[       OK ] Endpoint/SlaveEndpointTest.NoAuthorizer/1 (106 ms)
[ RUN      ] Endpoint/SlaveEndpointTest.NoAuthorizer/2
I0704 15:06:13.846382  4970 containerizer.cpp:230] Using isolation: posix/cpu,posix/mem,filesystem/posix,network/cni,environment_secret
W0704 15:06:13.849963  4970 backend.cpp:76] Failed to create 'overlay' backend: OverlayBackend
requires root privileges
W0704 15:06:13.850492  4970 backend.cpp:76] Failed to create 'bind' backend: BindBackend requires
root privileges
I0704 15:06:13.850599  4970 provisioner.cpp:255] Using default backend 'copy'
I0704 15:06:13.853531  4970 cluster.cpp:448] Creating default 'local' authorizer
I0704 15:06:13.856809  4995 slave.cpp:250] Mesos agent started on (778)@172.17.0.4:38481
I0704 15:06:13.856897  4995 slave.cpp:251] Flags at startup: --acls="" --appc_simple_discovery_uri_prefix="http://"
--appc_store_dir="/tmp/Endpoint_SlaveEndpointTest_NoAuthorizer_2_s8NBbq/store/appc" --authenticate_http_readonly="true"
--authenticate_http_readwrite="true" --authenticatee="crammd5" --authentication_backoff_factor="1secs"
--authorizer="local" --cgroups_cpu_enable_pids_and_tids_count="false" --cgroups_enable_cfs="false"
--cgroups_hierarchy="/sys/fs/cgroup" --cgroups_limit_swap="false" --cgroups_root="mesos" --container_disk_watch_interval="15secs"
--containerizers="mesos" --credential="/tmp/Endpoint_SlaveEndpointTest_NoAuthorizer_2_s8NBbq/credential"
--default_role="*" --disk_watch_interval="1mins" --docker="docker" --docker_kill_orphans="true"
--docker_registry="https://registry-1.docker.io" --docker_remove_delay="6hrs" --docker_socket="/var/run/docker.sock"
--docker_stop_timeout="0ns" --docker_store_dir="/tmp/Endpoint_SlaveEndpointTest_NoAuthorizer_2_s8NBbq/store/docker"
--docker_volume_checkpoint_dir="/var/run/mesos/isolators/docker/volume" --enforce_container_disk_quota="false"
--executor_registration_timeout="1mins" --executor_reregistration_timeout="2secs" --executor_shutdown_grace_period="5secs"
--fetcher_cache_dir="/tmp/Endpoint_SlaveEndpointTest_NoAuthorizer_2_s8NBbq/fetch" --fetcher_cache_size="2GB"
--frameworks_home="" --gc_delay="1weeks" --gc_disk_headroom="0.1" --hadoop_home="" --help="false"
--hostname_lookup="true" --http_command_executor="false" --http_credentials="/tmp/Endpoint_SlaveEndpointTest_NoAuthorizer_2_s8NBbq/http_credentials"
--http_heartbeat_interval="30secs" --initialize_driver_logging="true" --isolation="posix/cpu,posix/mem"
--launcher="posix" --launcher_dir="/mesos/mesos-1.4.0/_build/src" --logbufsecs="0" --logging_level="INFO"
--max_completed_executors_per_framework="150" --oversubscribed_resources_interval="15secs"
--perf_duration="10secs" --perf_interval="1mins" --port="5051" --qos_correction_interval_min="0ns"
--quiet="false" --recover="reconnect" --recovery_timeout="15mins" --registration_backoff_factor="10ms"
--resources="cpus:2;gpus:0;mem:1024;disk:1024;ports:[31000-32000]" --revocable_cpu_low_priority="true"
--runtime_dir="/tmp/Endpoint_SlaveEndpointTest_NoAuthorizer_2_s8NBbq" --sandbox_directory="/mnt/mesos/sandbox"
--strict="true" --switch_user="true" --systemd_enable_support="true" --systemd_runtime_directory="/run/systemd/system"
--version="false" --work_dir="/tmp/Endpoint_SlaveEndpointTest_NoAuthorizer_2_KQ5PLa"
I0704 15:06:13.857758  4995 credentials.hpp:86] Loading credential for authentication from
'/tmp/Endpoint_SlaveEndpointTest_NoAuthorizer_2_s8NBbq/credential'
I0704 15:06:13.858055  4995 slave.cpp:283] Agent using credential for: test-principal
I0704 15:06:13.858108  4995 credentials.hpp:37] Loading credentials for authentication from
'/tmp/Endpoint_SlaveEndpointTest_NoAuthorizer_2_s8NBbq/http_credentials'
I0704 15:06:13.858500  4995 http.cpp:976] Creating default 'basic' HTTP authenticator for
realm 'mesos-agent-readonly'
I0704 15:06:13.859392  4995 http.cpp:976] Creating default 'basic' HTTP authenticator for
realm 'mesos-agent-readwrite'
I0704 15:06:13.861676  4995 slave.cpp:565] Agent resources: [{"name":"cpus","scalar":{"value":2.0},"type":"SCALAR"},{"name":"mem","scalar":{"value":1024.0},"type":"SCALAR"},{"name":"disk","scalar":{"value":1024.0},"type":"SCALAR"},{"name":"ports","ranges":{"range":[{"begin":31000,"end":32000}]},"type":"RANGES"}]
I0704 15:06:13.862166  4995 slave.cpp:573] Agent attributes: [  ]
I0704 15:06:13.862215  4995 slave.cpp:578] Agent hostname: e468e375a166
I0704 15:06:13.864066  4993 status_update_manager.cpp:177] Pausing sending status updates
I0704 15:06:13.869371  4995 state.cpp:64] Recovering state from '/tmp/Endpoint_SlaveEndpointTest_NoAuthorizer_2_KQ5PLa/meta'
I0704 15:06:13.869906  4995 status_update_manager.cpp:203] Recovering status update manager
I0704 15:06:13.870422  4991 containerizer.cpp:582] Recovering containerizer
I0704 15:06:13.874296  4995 provisioner.cpp:416] Provisioner recovery complete
I0704 15:06:13.875092  4995 slave.cpp:6189] Finished recovery
I0704 15:06:13.875825  4995 slave.cpp:6371] Querying resource estimator for oversubscribable
resources
I0704 15:06:13.876627  4989 slave.cpp:6385] Received oversubscribable resources {} from the
resource estimator
I0704 15:06:13.888449  4992 process.cpp:3779] Handling HTTP event for process 'slave(778)'
with path: '/slave(778)/containers'
I0704 15:06:13.891487  4992 http.cpp:1116] HTTP GET for /slave(778)/containers from 172.17.0.4:35906
I0704 15:06:13.891799  4992 http.cpp:937] Authorizing principal 'test-principal' to GET the
'/containers' endpoint
I0704 15:06:13.909966  4970 slave.cpp:839] Agent terminating
[       OK ] Endpoint/SlaveEndpointTest.NoAuthorizer/2 (93 ms)
[----------] 9 tests from Endpoint/SlaveEndpointTest (858 ms total)

[----------] Global test environment tear-down
[==========] 1620 tests from 179 test cases ran. (843062 ms total)
[  PASSED  ] 1616 tests.
[  FAILED  ] 4 tests, listed below:
[  FAILED  ] DefaultExecutorCheckTest.CommandCheckDeliveredAndReconciled
[  FAILED  ] DefaultExecutorCheckTest.CommandCheckStatusChange
[  FAILED  ] DefaultExecutorCheckTest.CommandCheckSeesParentsEnv
[  FAILED  ] DefaultExecutorCheckTest.CommandCheckSharesWorkDirWithTask

 4 FAILED TESTS
  YOU HAVE 20 DISABLED TESTS

I0704 15:06:14.114359  4997 process.cpp:968] Failed to accept socket: future discarded
make[4]: *** [check-local] Error 1
make[4]: Leaving directory `/mesos/mesos-1.4.0/_build/src'
make[3]: *** [check-am] Error 2
make[3]: Leaving directory `/mesos/mesos-1.4.0/_build/src'
make[2]: *** [check] Error 2
make[2]: Leaving directory `/mesos/mesos-1.4.0/_build/src'
make[1]: *** [check-recursive] Error 1
make[1]: Leaving directory `/mesos/mesos-1.4.0/_build'
make: *** [distcheck] Error 1
+ docker rmi mesos-1499174020-27048
Untagged: mesos-1499174020-27048:latest
Deleted: sha256:adde657a3068cc877bb17c1d7b0b1f810fc7e6c3f9d5a42e3eb3b80cd8b23e8d
Deleted: sha256:c18d9cb8bc7d0c80fe6368bd785822f821284e7df3afa5f4f92b4707f989bfd7
Deleted: sha256:189f46bb2804f8ce97d7cb085adb5d883480700bddc3e1134ab2824cca0dfa33
Deleted: sha256:0dfe89847d66eeaf35253dc5b41693df65b3e31415c659abb136acfeee2fc494
Deleted: sha256:6cbef39448fc2af66bb014c50c0550fa9692dd0705e8272aa50a575aec2f4bf5
Deleted: sha256:d0d4f1a1fe490aa932eacb502bddf17391019faa3974030575bd40f2f4e3423b
Deleted: sha256:46ab7b79ff49091b0ca97b7a48a7db1548a9446688802616e56992a73be3df0a
Deleted: sha256:bc6126a143ba99b454abd2b91661b2b0cc926d15b4924fa5aac9da8e4b1a8336
Deleted: sha256:494578a074b2b3a6e404754eb648e69607b898ebf12075186aa87762533eba38
Deleted: sha256:7be7f8fc6b8e0a970ba8cc50fb791c18066d92298f8217809f1cc4577fa51e19
Deleted: sha256:c89b95631ec699b43a62b64ae0076a844853f99aed3494afcd8200ac6782a00e
Deleted: sha256:ba2375aad0a51077249001e56eefc0a99f2d282e0c8d823e3156275409f86601
Deleted: sha256:d24ada420da8334e7cbe0a3130a0b04b12e874bb5f2e730391cb9f0797fcebf6
Deleted: sha256:d55333220b31c89015d0641d08dc2d26eceba5b058d66ced5f1bf7208cecfcf5
Deleted: sha256:ef4f8cd91a8c849c1376e9bbd6805beec145af829469b1799d920edd1b68066c
Deleted: sha256:56750f0440973d829738ba4a99c8a600d927ba4ecc1286a396bd20826b5b9ee7
Deleted: sha256:7aaa003d9ecaefebce561d6d72051ea02cc15cb0c45a32b6565365b02d6a6180
Deleted: sha256:e1051151d2d93132446e145af916112420af8b986edbcac4d30155fa1530daa4
Deleted: sha256:ad7c37b6ac8c720c18810f8e57d68fa94588fe5e9e35a3a64275035e0893ad2f
Deleted: sha256:65522443a590d8e916dfd23a26225f68a4211d9ed92858564245f835cc55c4cb
Deleted: sha256:6e65fcba8b55503a1a77ac41e6c23605520679670430fa18419223dc41751c1c
Deleted: sha256:96b5499a945859b43b6753bf2ef1106e5f40d4dc0533eb76a0f87310f88f8cf7
Deleted: sha256:1eed13f8ecca869cb9f08c1cec91fccff728c461b18bbaddaad817aa58d61a1f
Deleted: sha256:7c9a8d7faa2ae2fdcddbf2d83d0d1b988b53e012458fa1f395a28eeb3b86c698
Build step 'Execute shell' marked build as failure

Mime
View raw message