mesos-builds mailing list archives

Site index · List index
Message view « Date » · « Thread »
Top « Date » · « Thread »
From Apache Jenkins Server <jenk...@builds.apache.org>
Subject Build failed in Jenkins: Mesos-Buildbot » cmake,gcc,--verbose,GLOG_v=1 MESOS_VERBOSE=1,ubuntu:14.04,(ubuntu)&&(!ubuntu-us1)&&(!ubuntu-eu2) #3867
Date Thu, 06 Jul 2017 01:42:09 GMT
See <https://builds.apache.org/job/Mesos-Buildbot/BUILDTOOL=cmake,COMPILER=gcc,CONFIGURATION=--verbose,ENVIRONMENT=GLOG_v=1%20MESOS_VERBOSE=1,OS=ubuntu%3A14.04,label_exp=(ubuntu)&&(!ubuntu-us1)&&(!ubuntu-eu2)/3867/display/redirect?page=changes>

Changes:

[vinodkone] Updated bundled ruby dependencies.

[vinodkone] Bundled rake as part of managed ruby dependencies of website.

[neil.conway] Fixed flaky PersistentVolumeEndpointsTest.ReserveAndSlaveRemoval.

[neil.conway] Improved the documentation of 'TASK_LOST'.

[josephwu] Fixed indentation in apply-reviews.py.

------------------------------------------
[...truncated 28.10 MB...]
I0706 01:41:58.929543 32438 http.cpp:1116] HTTP GET for /slave(775)/containers from 127.0.0.1:33435
I0706 01:41:58.929679 32438 http.cpp:937] Authorizing principal 'test-principal' to GET the
'/containers' endpoint
I0706 01:41:58.934039 32427 slave.cpp:839] Agent terminating
[       OK ] Endpoint/SlaveEndpointTest.AuthorizedRequest/2 (38 ms)
[ RUN      ] Endpoint/SlaveEndpointTest.UnauthorizedRequest/0
I0706 01:41:58.948472 32427 containerizer.cpp:230] Using isolation: posix/cpu,posix/mem,filesystem/posix,network/cni,environment_secret
W0706 01:41:58.949110 32427 backend.cpp:76] Failed to create 'aufs' backend: AufsBackend requires
root privileges
W0706 01:41:58.949229 32427 backend.cpp:76] Failed to create 'bind' backend: BindBackend requires
root privileges
I0706 01:41:58.949264 32427 provisioner.cpp:255] Using default backend 'copy'
I0706 01:41:58.953426 32430 slave.cpp:250] Mesos agent started on (776)@127.0.0.1:34917
I0706 01:41:58.953456 32430 slave.cpp:251] Flags at startup: --acls="" --appc_simple_discovery_uri_prefix="http://"
--appc_store_dir="/tmp/Endpoint_SlaveEndpointTest_UnauthorizedRequest_0_EmZR5T/store/appc"
--authenticate_http_readonly="true" --authenticate_http_readwrite="true" --authenticatee="crammd5"
--authentication_backoff_factor="1secs" --authorizer="local" --cgroups_cpu_enable_pids_and_tids_count="false"
--cgroups_enable_cfs="false" --cgroups_hierarchy="/sys/fs/cgroup" --cgroups_limit_swap="false"
--cgroups_root="mesos" --container_disk_watch_interval="15secs" --containerizers="mesos" --credential="/tmp/Endpoint_SlaveEndpointTest_UnauthorizedRequest_0_EmZR5T/credential"
--default_role="*" --disk_watch_interval="1mins" --docker="docker" --docker_kill_orphans="true"
--docker_registry="https://registry-1.docker.io" --docker_remove_delay="6hrs" --docker_socket="/var/run/docker.sock"
--docker_stop_timeout="0ns" --docker_store_dir="/tmp/Endpoint_SlaveEndpointTest_UnauthorizedRequest_0_EmZR5T/store/docker"
--docker_volume_checkpoint_dir="/var/run/mesos/isolators/docker/volume" --enforce_container_disk_quota="false"
--executor_registration_timeout="1mins" --executor_reregistration_timeout="2secs" --executor_shutdown_grace_period="5secs"
--fetcher_cache_dir="/tmp/Endpoint_SlaveEndpointTest_UnauthorizedRequest_0_EmZR5T/fetch" --fetcher_cache_size="2GB"
--frameworks_home="" --gc_delay="1weeks" --gc_disk_headroom="0.1" --hadoop_home="" --help="false"
--hostname_lookup="true" --http_command_executor="false" --http_credentials="/tmp/Endpoint_SlaveEndpointTest_UnauthorizedRequest_0_EmZR5T/http_credentials"
--http_heartbeat_interval="30secs" --initialize_driver_logging="true" --isolation="posix/cpu,posix/mem"
--launcher="posix" --launcher_dir="/mesos/build/src" --logbufsecs="0" --logging_level="INFO"
--max_completed_executors_per_framework="150" --oversubscribed_resources_interval="15secs"
--perf_duration="10secs" --perf_interval="1mins" --port="5051" --qos_correction_interval_min="0ns"
--quiet="false" --recover="reconnect" --recovery_timeout="15mins" --registration_backoff_factor="10ms"
--resources="cpus:2;gpus:0;mem:1024;disk:1024;ports:[31000-32000]" --revocable_cpu_low_priority="true"
--runtime_dir="/tmp/Endpoint_SlaveEndpointTest_UnauthorizedRequest_0_EmZR5T" --sandbox_directory="/mnt/mesos/sandbox"
--strict="true" --switch_user="true" --systemd_enable_support="true" --systemd_runtime_directory="/run/systemd/system"
--version="false" --work_dir="/tmp/Endpoint_SlaveEndpointTest_UnauthorizedRequest_0_hg74Gs"
W0706 01:41:58.954238 32430 slave.cpp:254] 
**************************************************
Agent bound to loopback interface! Cannot communicate with remote master(s). You might want
to set '--ip' flag to a routable IP address.
**************************************************
I0706 01:41:58.954251 32430 credentials.hpp:86] Loading credential for authentication from
'/tmp/Endpoint_SlaveEndpointTest_UnauthorizedRequest_0_EmZR5T/credential'
I0706 01:41:58.954457 32430 slave.cpp:283] Agent using credential for: test-principal
I0706 01:41:58.954476 32430 credentials.hpp:37] Loading credentials for authentication from
'/tmp/Endpoint_SlaveEndpointTest_UnauthorizedRequest_0_EmZR5T/http_credentials'
I0706 01:41:58.954725 32430 http.cpp:976] Creating default 'basic' HTTP authenticator for
realm 'mesos-agent-readonly'
I0706 01:41:58.954877 32430 http.cpp:976] Creating default 'basic' HTTP authenticator for
realm 'mesos-agent-readwrite'
I0706 01:41:58.956215 32430 slave.cpp:565] Agent resources: [{"name":"cpus","scalar":{"value":2.0},"type":"SCALAR"},{"name":"mem","scalar":{"value":1024.0},"type":"SCALAR"},{"name":"disk","scalar":{"value":1024.0},"type":"SCALAR"},{"name":"ports","ranges":{"range":[{"begin":31000,"end":32000}]},"type":"RANGES"}]
I0706 01:41:58.956394 32430 slave.cpp:573] Agent attributes: [  ]
I0706 01:41:58.956404 32430 slave.cpp:578] Agent hostname: localhost
I0706 01:41:58.956516 32437 status_update_manager.cpp:177] Pausing sending status updates
I0706 01:41:58.957715 32437 state.cpp:64] Recovering state from '/tmp/Endpoint_SlaveEndpointTest_UnauthorizedRequest_0_hg74Gs/meta'
I0706 01:41:58.958101 32428 status_update_manager.cpp:203] Recovering status update manager
I0706 01:41:58.958300 32431 containerizer.cpp:582] Recovering containerizer
I0706 01:41:58.959754 32438 provisioner.cpp:416] Provisioner recovery complete
I0706 01:41:58.960130 32442 slave.cpp:6189] Finished recovery
I0706 01:41:58.960736 32442 slave.cpp:6371] Querying resource estimator for oversubscribable
resources
I0706 01:41:58.961012 32435 slave.cpp:6385] Received oversubscribable resources {} from the
resource estimator
I0706 01:41:58.964226 32434 process.cpp:3779] Handling HTTP event for process 'slave(776)'
with path: '/slave(776)/monitor/statistics'
I0706 01:41:58.965883 32440 http.cpp:1116] HTTP GET for /slave(776)/monitor/statistics from
127.0.0.1:33436
I0706 01:41:58.965960 32440 http.cpp:937] Authorizing principal 'test-principal' to GET the
'/monitor/statistics' endpoint
I0706 01:41:58.968773 32438 slave.cpp:839] Agent terminating
[       OK ] Endpoint/SlaveEndpointTest.UnauthorizedRequest/0 (32 ms)
[ RUN      ] Endpoint/SlaveEndpointTest.UnauthorizedRequest/1
I0706 01:41:58.980430 32427 containerizer.cpp:230] Using isolation: posix/cpu,posix/mem,filesystem/posix,network/cni,environment_secret
W0706 01:41:58.980873 32427 backend.cpp:76] Failed to create 'aufs' backend: AufsBackend requires
root privileges
W0706 01:41:58.980955 32427 backend.cpp:76] Failed to create 'bind' backend: BindBackend requires
root privileges
I0706 01:41:58.980981 32427 provisioner.cpp:255] Using default backend 'copy'
I0706 01:41:58.983844 32440 slave.cpp:250] Mesos agent started on (777)@127.0.0.1:34917
I0706 01:41:58.983871 32440 slave.cpp:251] Flags at startup: --acls="" --appc_simple_discovery_uri_prefix="http://"
--appc_store_dir="/tmp/Endpoint_SlaveEndpointTest_UnauthorizedRequest_1_wIRSYF/store/appc"
--authenticate_http_readonly="true" --authenticate_http_readwrite="true" --authenticatee="crammd5"
--authentication_backoff_factor="1secs" --authorizer="local" --cgroups_cpu_enable_pids_and_tids_count="false"
--cgroups_enable_cfs="false" --cgroups_hierarchy="/sys/fs/cgroup" --cgroups_limit_swap="false"
--cgroups_root="mesos" --container_disk_watch_interval="15secs" --containerizers="mesos" --credential="/tmp/Endpoint_SlaveEndpointTest_UnauthorizedRequest_1_wIRSYF/credential"
--default_role="*" --disk_watch_interval="1mins" --docker="docker" --docker_kill_orphans="true"
--docker_registry="https://registry-1.docker.io" --docker_remove_delay="6hrs" --docker_socket="/var/run/docker.sock"
--docker_stop_timeout="0ns" --docker_store_dir="/tmp/Endpoint_SlaveEndpointTest_UnauthorizedRequest_1_wIRSYF/store/docker"
--docker_volume_checkpoint_dir="/var/run/mesos/isolators/docker/volume" --enforce_container_disk_quota="false"
--executor_registration_timeout="1mins" --executor_reregistration_timeout="2secs" --executor_shutdown_grace_period="5secs"
--fetcher_cache_dir="/tmp/Endpoint_SlaveEndpointTest_UnauthorizedRequest_1_wIRSYF/fetch" --fetcher_cache_size="2GB"
--frameworks_home="" --gc_delay="1weeks" --gc_disk_headroom="0.1" --hadoop_home="" --help="false"
--hostname_lookup="true" --http_command_executor="false" --http_credentials="/tmp/Endpoint_SlaveEndpointTest_UnauthorizedRequest_1_wIRSYF/http_credentials"
--http_heartbeat_interval="30secs" --initialize_driver_logging="true" --isolation="posix/cpu,posix/mem"
--launcher="posix" --launcher_dir="/mesos/build/src" --logbufsecs="0" --logging_level="INFO"
--max_completed_executors_per_framework="150" --oversubscribed_resources_interval="15secs"
--perf_duration="10secs" --perf_interval="1mins" --port="5051" --qos_correction_interval_min="0ns"
--quiet="false" --recover="reconnect" --recovery_timeout="15mins" --registration_backoff_factor="10ms"
--resources="cpus:2;gpus:0;mem:1024;disk:1024;ports:[31000-32000]" --revocable_cpu_low_priority="true"
--runtime_dir="/tmp/Endpoint_SlaveEndpointTest_UnauthorizedRequest_1_wIRSYF" --sandbox_directory="/mnt/mesos/sandbox"
--strict="true" --switch_user="true" --systemd_enable_support="true" --systemd_runtime_directory="/run/systemd/system"
--version="false" --work_dir="/tmp/Endpoint_SlaveEndpointTest_UnauthorizedRequest_1_9EoRue"
W0706 01:41:58.984699 32440 slave.cpp:254] 
**************************************************
Agent bound to loopback interface! Cannot communicate with remote master(s). You might want
to set '--ip' flag to a routable IP address.
**************************************************
I0706 01:41:58.984712 32440 credentials.hpp:86] Loading credential for authentication from
'/tmp/Endpoint_SlaveEndpointTest_UnauthorizedRequest_1_wIRSYF/credential'
I0706 01:41:58.984947 32440 slave.cpp:283] Agent using credential for: test-principal
I0706 01:41:58.984968 32440 credentials.hpp:37] Loading credentials for authentication from
'/tmp/Endpoint_SlaveEndpointTest_UnauthorizedRequest_1_wIRSYF/http_credentials'
I0706 01:41:58.985175 32440 http.cpp:976] Creating default 'basic' HTTP authenticator for
realm 'mesos-agent-readonly'
I0706 01:41:58.985455 32440 http.cpp:976] Creating default 'basic' HTTP authenticator for
realm 'mesos-agent-readwrite'
I0706 01:41:58.986770 32440 slave.cpp:565] Agent resources: [{"name":"cpus","scalar":{"value":2.0},"type":"SCALAR"},{"name":"mem","scalar":{"value":1024.0},"type":"SCALAR"},{"name":"disk","scalar":{"value":1024.0},"type":"SCALAR"},{"name":"ports","ranges":{"range":[{"begin":31000,"end":32000}]},"type":"RANGES"}]
I0706 01:41:58.986948 32440 slave.cpp:573] Agent attributes: [  ]
I0706 01:41:58.986958 32440 slave.cpp:578] Agent hostname: localhost
I0706 01:41:58.987089 32428 status_update_manager.cpp:177] Pausing sending status updates
I0706 01:41:58.988456 32441 state.cpp:64] Recovering state from '/tmp/Endpoint_SlaveEndpointTest_UnauthorizedRequest_1_9EoRue/meta'
I0706 01:41:58.988764 32442 status_update_manager.cpp:203] Recovering status update manager
I0706 01:41:58.989015 32431 containerizer.cpp:582] Recovering containerizer
I0706 01:41:58.990490 32437 provisioner.cpp:416] Provisioner recovery complete
I0706 01:41:58.990969 32442 slave.cpp:6189] Finished recovery
I0706 01:41:58.991452 32442 slave.cpp:6371] Querying resource estimator for oversubscribable
resources
I0706 01:41:58.991699 32438 slave.cpp:6385] Received oversubscribable resources {} from the
resource estimator
I0706 01:41:58.994212 32437 process.cpp:3779] Handling HTTP event for process 'slave(777)'
with path: '/slave(777)/monitor/statistics.json'
I0706 01:41:58.995913 32430 http.cpp:1116] HTTP GET for /slave(777)/monitor/statistics.json
from 127.0.0.1:33437
I0706 01:41:58.996007 32430 http.cpp:937] Authorizing principal 'test-principal' to GET the
'/monitor/statistics.json' endpoint
I0706 01:41:58.999106 32433 slave.cpp:839] Agent terminating
[       OK ] Endpoint/SlaveEndpointTest.UnauthorizedRequest/1 (30 ms)
[ RUN      ] Endpoint/SlaveEndpointTest.UnauthorizedRequest/2
I0706 01:41:59.011229 32427 containerizer.cpp:230] Using isolation: posix/cpu,posix/mem,filesystem/posix,network/cni,environment_secret
W0706 01:41:59.011896 32427 backend.cpp:76] Failed to create 'aufs' backend: AufsBackend requires
root privileges
W0706 01:41:59.012017 32427 backend.cpp:76] Failed to create 'bind' backend: BindBackend requires
root privileges
I0706 01:41:59.012058 32427 provisioner.cpp:255] Using default backend 'copy'
I0706 01:41:59.016273 32443 slave.cpp:250] Mesos agent started on (778)@127.0.0.1:34917
I0706 01:41:59.016288 32443 slave.cpp:251] Flags at startup: --acls="" --appc_simple_discovery_uri_prefix="http://"
--appc_store_dir="/tmp/Endpoint_SlaveEndpointTest_UnauthorizedRequest_2_Ek5Mbs/store/appc"
--authenticate_http_readonly="true" --authenticate_http_readwrite="true" --authenticatee="crammd5"
--authentication_backoff_factor="1secs" --authorizer="local" --cgroups_cpu_enable_pids_and_tids_count="false"
--cgroups_enable_cfs="false" --cgroups_hierarchy="/sys/fs/cgroup" --cgroups_limit_swap="false"
--cgroups_root="mesos" --container_disk_watch_interval="15secs" --containerizers="mesos" --credential="/tmp/Endpoint_SlaveEndpointTest_UnauthorizedRequest_2_Ek5Mbs/credential"
--default_role="*" --disk_watch_interval="1mins" --docker="docker" --docker_kill_orphans="true"
--docker_registry="https://registry-1.docker.io" --docker_remove_delay="6hrs" --docker_socket="/var/run/docker.sock"
--docker_stop_timeout="0ns" --docker_store_dir="/tmp/Endpoint_SlaveEndpointTest_UnauthorizedRequest_2_Ek5Mbs/store/docker"
--docker_volume_checkpoint_dir="/var/run/mesos/isolators/docker/volume" --enforce_container_disk_quota="false"
--executor_registration_timeout="1mins" --executor_reregistration_timeout="2secs" --executor_shutdown_grace_period="5secs"
--fetcher_cache_dir="/tmp/Endpoint_SlaveEndpointTest_UnauthorizedRequest_2_Ek5Mbs/fetch" --fetcher_cache_size="2GB"
--frameworks_home="" --gc_delay="1weeks" --gc_disk_headroom="0.1" --hadoop_home="" --help="false"
--hostname_lookup="true" --http_command_executor="false" --http_credentials="/tmp/Endpoint_SlaveEndpointTest_UnauthorizedRequest_2_Ek5Mbs/http_credentials"
--http_heartbeat_interval="30secs" --initialize_driver_logging="true" --isolation="posix/cpu,posix/mem"
--launcher="posix" --launcher_dir="/mesos/build/src" --logbufsecs="0" --logging_level="INFO"
--max_completed_executors_per_framework="150" --oversubscribed_resources_interval="15secs"
--perf_duration="10secs" --perf_interval="1mins" --port="5051" --qos_correction_interval_min="0ns"
--quiet="false" --recover="reconnect" --recovery_timeout="15mins" --registration_backoff_factor="10ms"
--resources="cpus:2;gpus:0;mem:1024;disk:1024;ports:[31000-32000]" --revocable_cpu_low_priority="true"
--runtime_dir="/tmp/Endpoint_SlaveEndpointTest_UnauthorizedRequest_2_Ek5Mbs" --sandbox_directory="/mnt/mesos/sandbox"
--strict="true" --switch_user="true" --systemd_enable_support="true" --systemd_runtime_directory="/run/systemd/system"
--version="false" --work_dir="/tmp/Endpoint_SlaveEndpointTest_UnauthorizedRequest_2_lwaNC0"
W0706 01:41:59.016638 32443 slave.cpp:254] 
**************************************************
Agent bound to loopback interface! Cannot communicate with remote master(s). You might want
to set '--ip' flag to a routable IP address.
**************************************************
I0706 01:41:59.016649 32443 credentials.hpp:86] Loading credential for authentication from
'/tmp/Endpoint_SlaveEndpointTest_UnauthorizedRequest_2_Ek5Mbs/credential'
I0706 01:41:59.016777 32443 slave.cpp:283] Agent using credential for: test-principal
I0706 01:41:59.016794 32443 credentials.hpp:37] Loading credentials for authentication from
'/tmp/Endpoint_SlaveEndpointTest_UnauthorizedRequest_2_Ek5Mbs/http_credentials'
I0706 01:41:59.016990 32443 http.cpp:976] Creating default 'basic' HTTP authenticator for
realm 'mesos-agent-readonly'
I0706 01:41:59.017119 32443 http.cpp:976] Creating default 'basic' HTTP authenticator for
realm 'mesos-agent-readwrite'
I0706 01:41:59.018529 32443 slave.cpp:565] Agent resources: [{"name":"cpus","scalar":{"value":2.0},"type":"SCALAR"},{"name":"mem","scalar":{"value":1024.0},"type":"SCALAR"},{"name":"disk","scalar":{"value":1024.0},"type":"SCALAR"},{"name":"ports","ranges":{"range":[{"begin":31000,"end":32000}]},"type":"RANGES"}]
I0706 01:41:59.018707 32443 slave.cpp:573] Agent attributes: [  ]
I0706 01:41:59.018719 32443 slave.cpp:578] Agent hostname: localhost
I0706 01:41:59.018898 32433 status_update_manager.cpp:177] Pausing sending status updates
I0706 01:41:59.020532 32440 state.cpp:64] Recovering state from '/tmp/Endpoint_SlaveEndpointTest_UnauthorizedRequest_2_lwaNC0/meta'
I0706 01:41:59.020809 32443 status_update_manager.cpp:203] Recovering status update manager
I0706 01:41:59.021098 32438 containerizer.cpp:582] Recovering containerizer
I0706 01:41:59.022900 32428 provisioner.cpp:416] Provisioner recovery complete
I0706 01:41:59.023241 32432 slave.cpp:6189] Finished recovery
I0706 01:41:59.024001 32432 slave.cpp:6371] Querying resource estimator for oversubscribable
resources
I0706 01:41:59.024240 32438 slave.cpp:6385] Received oversubscribable resources {} from the
resource estimator
I0706 01:41:59.026738 32443 process.cpp:3779] Handling HTTP event for process 'slave(778)'
with path: '/slave(778)/containers'
I0706 01:41:59.027948 32429 http.cpp:1116] HTTP GET for /slave(778)/containers from 127.0.0.1:33438
I0706 01:41:59.028033 32429 http.cpp:937] Authorizing principal 'test-principal' to GET the
'/containers' endpoint
I0706 01:41:59.030287 32427 slave.cpp:839] Agent terminating
[       OK ] Endpoint/SlaveEndpointTest.UnauthorizedRequest/2 (30 ms)
[ RUN      ] Endpoint/SlaveEndpointTest.NoAuthorizer/0
I0706 01:41:59.043699 32427 containerizer.cpp:230] Using isolation: posix/cpu,posix/mem,filesystem/posix,network/cni,environment_secret
W0706 01:41:59.044570 32427 backend.cpp:76] Failed to create 'aufs' backend: AufsBackend requires
root privileges
W0706 01:41:59.044687 32427 backend.cpp:76] Failed to create 'bind' backend: BindBackend requires
root privileges
I0706 01:41:59.044725 32427 provisioner.cpp:255] Using default backend 'copy'
I0706 01:41:59.047224 32427 cluster.cpp:448] Creating default 'local' authorizer
I0706 01:41:59.050639 32433 slave.cpp:250] Mesos agent started on (779)@127.0.0.1:34917
I0706 01:41:59.050668 32433 slave.cpp:251] Flags at startup: --acls="" --appc_simple_discovery_uri_prefix="http://"
--appc_store_dir="/tmp/Endpoint_SlaveEndpointTest_NoAuthorizer_0_cZ6cJe/store/appc" --authenticate_http_readonly="true"
--authenticate_http_readwrite="true" --authenticatee="crammd5" --authentication_backoff_factor="1secs"
--authorizer="local" --cgroups_cpu_enable_pids_and_tids_count="false" --cgroups_enable_cfs="false"
--cgroups_hierarchy="/sys/fs/cgroup" --cgroups_limit_swap="false" --cgroups_root="mesos" --container_disk_watch_interval="15secs"
--containerizers="mesos" --credential="/tmp/Endpoint_SlaveEndpointTest_NoAuthorizer_0_cZ6cJe/credential"
--default_role="*" --disk_watch_interval="1mins" --docker="docker" --docker_kill_orphans="true"
--docker_registry="https://registry-1.docker.io" --docker_remove_delay="6hrs" --docker_socket="/var/run/docker.sock"
--docker_stop_timeout="0ns" --docker_store_dir="/tmp/Endpoint_SlaveEndpointTest_NoAuthorizer_0_cZ6cJe/store/docker"
--docker_volume_checkpoint_dir="/var/run/mesos/isolators/docker/volume" --enforce_container_disk_quota="false"
--executor_registration_timeout="1mins" --executor_reregistration_timeout="2secs" --executor_shutdown_grace_period="5secs"
--fetcher_cache_dir="/tmp/Endpoint_SlaveEndpointTest_NoAuthorizer_0_cZ6cJe/fetch" --fetcher_cache_size="2GB"
--frameworks_home="" --gc_delay="1weeks" --gc_disk_headroom="0.1" --hadoop_home="" --help="false"
--hostname_lookup="true" --http_command_executor="false" --http_credentials="/tmp/Endpoint_SlaveEndpointTest_NoAuthorizer_0_cZ6cJe/http_credentials"
--http_heartbeat_interval="30secs" --initialize_driver_logging="true" --isolation="posix/cpu,posix/mem"
--launcher="posix" --launcher_dir="/mesos/build/src" --logbufsecs="0" --logging_level="INFO"
--max_completed_executors_per_framework="150" --oversubscribed_resources_interval="15secs"
--perf_duration="10secs" --perf_interval="1mins" --port="5051" --qos_correction_interval_min="0ns"
--quiet="false" --recover="reconnect" --recovery_timeout="15mins" --registration_backoff_factor="10ms"
--resources="cpus:2;gpus:0;mem:1024;disk:1024;ports:[31000-32000]" --revocable_cpu_low_priority="true"
--runtime_dir="/tmp/Endpoint_SlaveEndpointTest_NoAuthorizer_0_cZ6cJe" --sandbox_directory="/mnt/mesos/sandbox"
--strict="true" --switch_user="true" --systemd_enable_support="true" --systemd_runtime_directory="/run/systemd/system"
--version="false" --work_dir="/tmp/Endpoint_SlaveEndpointTest_NoAuthorizer_0_tXC64M"
W0706 01:41:59.051540 32433 slave.cpp:254] 
**************************************************
Agent bound to loopback interface! Cannot communicate with remote master(s). You might want
to set '--ip' flag to a routable IP address.
**************************************************
I0706 01:41:59.051553 32433 credentials.hpp:86] Loading credential for authentication from
'/tmp/Endpoint_SlaveEndpointTest_NoAuthorizer_0_cZ6cJe/credential'
I0706 01:41:59.052079 32433 slave.cpp:283] Agent using credential for: test-principal
I0706 01:41:59.052098 32433 credentials.hpp:37] Loading credentials for authentication from
'/tmp/Endpoint_SlaveEndpointTest_NoAuthorizer_0_cZ6cJe/http_credentials'
I0706 01:41:59.052361 32433 http.cpp:976] Creating default 'basic' HTTP authenticator for
realm 'mesos-agent-readonly'
I0706 01:41:59.052559 32433 http.cpp:976] Creating default 'basic' HTTP authenticator for
realm 'mesos-agent-readwrite'
I0706 01:41:59.054193 32433 slave.cpp:565] Agent resources: [{"name":"cpus","scalar":{"value":2.0},"type":"SCALAR"},{"name":"mem","scalar":{"value":1024.0},"type":"SCALAR"},{"name":"disk","scalar":{"value":1024.0},"type":"SCALAR"},{"name":"ports","ranges":{"range":[{"begin":31000,"end":32000}]},"type":"RANGES"}]
I0706 01:41:59.054437 32433 slave.cpp:573] Agent attributes: [  ]
I0706 01:41:59.054451 32433 slave.cpp:578] Agent hostname: localhost
I0706 01:41:59.054608 32434 status_update_manager.cpp:177] Pausing sending status updates
I0706 01:41:59.056304 32438 state.cpp:64] Recovering state from '/tmp/Endpoint_SlaveEndpointTest_NoAuthorizer_0_tXC64M/meta'
I0706 01:41:59.056615 32442 status_update_manager.cpp:203] Recovering status update manager
I0706 01:41:59.056830 32441 containerizer.cpp:582] Recovering containerizer
I0706 01:41:59.059077 32441 provisioner.cpp:416] Provisioner recovery complete
I0706 01:41:59.059588 32443 slave.cpp:6189] Finished recovery
I0706 01:41:59.060345 32443 slave.cpp:6371] Querying resource estimator for oversubscribable
resources
I0706 01:41:59.060758 32439 slave.cpp:6385] Received oversubscribable resources {} from the
resource estimator
I0706 01:41:59.064287 32443 process.cpp:3779] Handling HTTP event for process 'slave(779)'
with path: '/slave(779)/monitor/statistics'
I0706 01:41:59.066139 32443 http.cpp:1116] HTTP GET for /slave(779)/monitor/statistics from
127.0.0.1:33439
I0706 01:41:59.066372 32443 http.cpp:937] Authorizing principal 'test-principal' to GET the
'/monitor/statistics' endpoint
I0706 01:41:59.070247 32430 slave.cpp:839] Agent terminating
[       OK ] Endpoint/SlaveEndpointTest.NoAuthorizer/0 (37 ms)
[ RUN      ] Endpoint/SlaveEndpointTest.NoAuthorizer/1
I0706 01:41:59.079247 32427 containerizer.cpp:230] Using isolation: posix/cpu,posix/mem,filesystem/posix,network/cni,environment_secret
W0706 01:41:59.079772 32427 backend.cpp:76] Failed to create 'aufs' backend: AufsBackend requires
root privileges
W0706 01:41:59.079856 32427 backend.cpp:76] Failed to create 'bind' backend: BindBackend requires
root privileges
I0706 01:41:59.079910 32427 provisioner.cpp:255] Using default backend 'copy'
I0706 01:41:59.081480 32427 cluster.cpp:448] Creating default 'local' authorizer
I0706 01:41:59.083957 32438 slave.cpp:250] Mesos agent started on (780)@127.0.0.1:34917
I0706 01:41:59.083976 32438 slave.cpp:251] Flags at startup: --acls="" --appc_simple_discovery_uri_prefix="http://"
--appc_store_dir="/tmp/Endpoint_SlaveEndpointTest_NoAuthorizer_1_w1HIE1/store/appc" --authenticate_http_readonly="true"
--authenticate_http_readwrite="true" --authenticatee="crammd5" --authentication_backoff_factor="1secs"
--authorizer="local" --cgroups_cpu_enable_pids_and_tids_count="false" --cgroups_enable_cfs="false"
--cgroups_hierarchy="/sys/fs/cgroup" --cgroups_limit_swap="false" --cgroups_root="mesos" --container_disk_watch_interval="15secs"
--containerizers="mesos" --credential="/tmp/Endpoint_SlaveEndpointTest_NoAuthorizer_1_w1HIE1/credential"
--default_role="*" --disk_watch_interval="1mins" --docker="docker" --docker_kill_orphans="true"
--docker_registry="https://registry-1.docker.io" --docker_remove_delay="6hrs" --docker_socket="/var/run/docker.sock"
--docker_stop_timeout="0ns" --docker_store_dir="/tmp/Endpoint_SlaveEndpointTest_NoAuthorizer_1_w1HIE1/store/docker"
--docker_volume_checkpoint_dir="/var/run/mesos/isolators/docker/volume" --enforce_container_disk_quota="false"
--executor_registration_timeout="1mins" --executor_reregistration_timeout="2secs" --executor_shutdown_grace_period="5secs"
--fetcher_cache_dir="/tmp/Endpoint_SlaveEndpointTest_NoAuthorizer_1_w1HIE1/fetch" --fetcher_cache_size="2GB"
--frameworks_home="" --gc_delay="1weeks" --gc_disk_headroom="0.1" --hadoop_home="" --help="false"
--hostname_lookup="true" --http_command_executor="false" --http_credentials="/tmp/Endpoint_SlaveEndpointTest_NoAuthorizer_1_w1HIE1/http_credentials"
--http_heartbeat_interval="30secs" --initialize_driver_logging="true" --isolation="posix/cpu,posix/mem"
--launcher="posix" --launcher_dir="/mesos/build/src" --logbufsecs="0" --logging_level="INFO"
--max_completed_executors_per_framework="150" --oversubscribed_resources_interval="15secs"
--perf_duration="10secs" --perf_interval="1mins" --port="5051" --qos_correction_interval_min="0ns"
--quiet="false" --recover="reconnect" --recovery_timeout="15mins" --registration_backoff_factor="10ms"
--resources="cpus:2;gpus:0;mem:1024;disk:1024;ports:[31000-32000]" --revocable_cpu_low_priority="true"
--runtime_dir="/tmp/Endpoint_SlaveEndpointTest_NoAuthorizer_1_w1HIE1" --sandbox_directory="/mnt/mesos/sandbox"
--strict="true" --switch_user="true" --systemd_enable_support="true" --systemd_runtime_directory="/run/systemd/system"
--version="false" --work_dir="/tmp/Endpoint_SlaveEndpointTest_NoAuthorizer_1_BK3AUz"
W0706 01:41:59.084462 32438 slave.cpp:254] 
**************************************************
Agent bound to loopback interface! Cannot communicate with remote master(s). You might want
to set '--ip' flag to a routable IP address.
**************************************************
I0706 01:41:59.084478 32438 credentials.hpp:86] Loading credential for authentication from
'/tmp/Endpoint_SlaveEndpointTest_NoAuthorizer_1_w1HIE1/credential'
I0706 01:41:59.084627 32438 slave.cpp:283] Agent using credential for: test-principal
I0706 01:41:59.084646 32438 credentials.hpp:37] Loading credentials for authentication from
'/tmp/Endpoint_SlaveEndpointTest_NoAuthorizer_1_w1HIE1/http_credentials'
I0706 01:41:59.084913 32438 http.cpp:976] Creating default 'basic' HTTP authenticator for
realm 'mesos-agent-readonly'
I0706 01:41:59.085080 32438 http.cpp:976] Creating default 'basic' HTTP authenticator for
realm 'mesos-agent-readwrite'
I0706 01:41:59.086889 32438 slave.cpp:565] Agent resources: [{"name":"cpus","scalar":{"value":2.0},"type":"SCALAR"},{"name":"mem","scalar":{"value":1024.0},"type":"SCALAR"},{"name":"disk","scalar":{"value":1024.0},"type":"SCALAR"},{"name":"ports","ranges":{"range":[{"begin":31000,"end":32000}]},"type":"RANGES"}]
I0706 01:41:59.087141 32438 slave.cpp:573] Agent attributes: [  ]
I0706 01:41:59.087154 32438 slave.cpp:578] Agent hostname: localhost
I0706 01:41:59.087285 32434 status_update_manager.cpp:177] Pausing sending status updates
I0706 01:41:59.088842 32433 state.cpp:64] Recovering state from '/tmp/Endpoint_SlaveEndpointTest_NoAuthorizer_1_BK3AUz/meta'
I0706 01:41:59.089237 32436 status_update_manager.cpp:203] Recovering status update manager
I0706 01:41:59.089412 32431 containerizer.cpp:582] Recovering containerizer
I0706 01:41:59.090952 32435 provisioner.cpp:416] Provisioner recovery complete
I0706 01:41:59.091440 32439 slave.cpp:6189] Finished recovery
I0706 01:41:59.092043 32439 slave.cpp:6371] Querying resource estimator for oversubscribable
resources
I0706 01:41:59.092293 32439 slave.cpp:6385] Received oversubscribable resources {} from the
resource estimator
I0706 01:41:59.095356 32428 process.cpp:3779] Handling HTTP event for process 'slave(780)'
with path: '/slave(780)/monitor/statistics.json'
I0706 01:41:59.096603 32429 http.cpp:1116] HTTP GET for /slave(780)/monitor/statistics.json
from 127.0.0.1:33440
I0706 01:41:59.096700 32429 http.cpp:937] Authorizing principal 'test-principal' to GET the
'/monitor/statistics.json' endpoint
I0706 01:41:59.100201 32434 slave.cpp:839] Agent terminating
[       OK ] Endpoint/SlaveEndpointTest.NoAuthorizer/1 (31 ms)
[ RUN      ] Endpoint/SlaveEndpointTest.NoAuthorizer/2
I0706 01:41:59.111167 32427 containerizer.cpp:230] Using isolation: posix/cpu,posix/mem,filesystem/posix,network/cni,environment_secret
W0706 01:41:59.111718 32427 backend.cpp:76] Failed to create 'aufs' backend: AufsBackend requires
root privileges
W0706 01:41:59.111805 32427 backend.cpp:76] Failed to create 'bind' backend: BindBackend requires
root privileges
I0706 01:41:59.111832 32427 provisioner.cpp:255] Using default backend 'copy'
I0706 01:41:59.113478 32427 cluster.cpp:448] Creating default 'local' authorizer
I0706 01:41:59.115372 32432 slave.cpp:250] Mesos agent started on (781)@127.0.0.1:34917
I0706 01:41:59.115391 32432 slave.cpp:251] Flags at startup: --acls="" --appc_simple_discovery_uri_prefix="http://"
--appc_store_dir="/tmp/Endpoint_SlaveEndpointTest_NoAuthorizer_2_4fm2UO/store/appc" --authenticate_http_readonly="true"
--authenticate_http_readwrite="true" --authenticatee="crammd5" --authentication_backoff_factor="1secs"
--authorizer="local" --cgroups_cpu_enable_pids_and_tids_count="false" --cgroups_enable_cfs="false"
--cgroups_hierarchy="/sys/fs/cgroup" --cgroups_limit_swap="false" --cgroups_root="mesos" --container_disk_watch_interval="15secs"
--containerizers="mesos" --credential="/tmp/Endpoint_SlaveEndpointTest_NoAuthorizer_2_4fm2UO/credential"
--default_role="*" --disk_watch_interval="1mins" --docker="docker" --docker_kill_orphans="true"
--docker_registry="https://registry-1.docker.io" --docker_remove_delay="6hrs" --docker_socket="/var/run/docker.sock"
--docker_stop_timeout="0ns" --docker_store_dir="/tmp/Endpoint_SlaveEndpointTest_NoAuthorizer_2_4fm2UO/store/docker"
--docker_volume_checkpoint_dir="/var/run/mesos/isolators/docker/volume" --enforce_container_disk_quota="false"
--executor_registration_timeout="1mins" --executor_reregistration_timeout="2secs" --executor_shutdown_grace_period="5secs"
--fetcher_cache_dir="/tmp/Endpoint_SlaveEndpointTest_NoAuthorizer_2_4fm2UO/fetch" --fetcher_cache_size="2GB"
--frameworks_home="" --gc_delay="1weeks" --gc_disk_headroom="0.1" --hadoop_home="" --help="false"
--hostname_lookup="true" --http_command_executor="false" --http_credentials="/tmp/Endpoint_SlaveEndpointTest_NoAuthorizer_2_4fm2UO/http_credentials"
--http_heartbeat_interval="30secs" --initialize_driver_logging="true" --isolation="posix/cpu,posix/mem"
--launcher="posix" --launcher_dir="/mesos/build/src" --logbufsecs="0" --logging_level="INFO"
--max_completed_executors_per_framework="150" --oversubscribed_resources_interval="15secs"
--perf_duration="10secs" --perf_interval="1mins" --port="5051" --qos_correction_interval_min="0ns"
--quiet="false" --recover="reconnect" --recovery_timeout="15mins" --registration_backoff_factor="10ms"
--resources="cpus:2;gpus:0;mem:1024;disk:1024;ports:[31000-32000]" --revocable_cpu_low_priority="true"
--runtime_dir="/tmp/Endpoint_SlaveEndpointTest_NoAuthorizer_2_4fm2UO" --sandbox_directory="/mnt/mesos/sandbox"
--strict="true" --switch_user="true" --systemd_enable_support="true" --systemd_runtime_directory="/run/systemd/system"
--version="false" --work_dir="/tmp/Endpoint_SlaveEndpointTest_NoAuthorizer_2_FRAH5m"
W0706 01:41:59.115784 32432 slave.cpp:254] 
**************************************************
Agent bound to loopback interface! Cannot communicate with remote master(s). You might want
to set '--ip' flag to a routable IP address.
**************************************************
I0706 01:41:59.115799 32432 credentials.hpp:86] Loading credential for authentication from
'/tmp/Endpoint_SlaveEndpointTest_NoAuthorizer_2_4fm2UO/credential'
I0706 01:41:59.116001 32432 slave.cpp:283] Agent using credential for: test-principal
I0706 01:41:59.116022 32432 credentials.hpp:37] Loading credentials for authentication from
'/tmp/Endpoint_SlaveEndpointTest_NoAuthorizer_2_4fm2UO/http_credentials'
I0706 01:41:59.116283 32432 http.cpp:976] Creating default 'basic' HTTP authenticator for
realm 'mesos-agent-readonly'
I0706 01:41:59.116446 32432 http.cpp:976] Creating default 'basic' HTTP authenticator for
realm 'mesos-agent-readwrite'
I0706 01:41:59.117743 32432 slave.cpp:565] Agent resources: [{"name":"cpus","scalar":{"value":2.0},"type":"SCALAR"},{"name":"mem","scalar":{"value":1024.0},"type":"SCALAR"},{"name":"disk","scalar":{"value":1024.0},"type":"SCALAR"},{"name":"ports","ranges":{"range":[{"begin":31000,"end":32000}]},"type":"RANGES"}]
I0706 01:41:59.117924 32432 slave.cpp:573] Agent attributes: [  ]
I0706 01:41:59.117939 32432 slave.cpp:578] Agent hostname: localhost
I0706 01:41:59.118065 32433 status_update_manager.cpp:177] Pausing sending status updates
I0706 01:41:59.119433 32438 state.cpp:64] Recovering state from '/tmp/Endpoint_SlaveEndpointTest_NoAuthorizer_2_FRAH5m/meta'
I0706 01:41:59.119783 32443 status_update_manager.cpp:203] Recovering status update manager
I0706 01:41:59.119994 32429 containerizer.cpp:582] Recovering containerizer
I0706 01:41:59.121706 32442 provisioner.cpp:416] Provisioner recovery complete
I0706 01:41:59.122084 32436 slave.cpp:6189] Finished recovery
I0706 01:41:59.122671 32436 slave.cpp:6371] Querying resource estimator for oversubscribable
resources
I0706 01:41:59.122977 32437 slave.cpp:6385] Received oversubscribable resources {} from the
resource estimator
I0706 01:41:59.130693 32437 process.cpp:3779] Handling HTTP event for process 'slave(781)'
with path: '/slave(781)/containers'
I0706 01:41:59.132242 32431 http.cpp:1116] HTTP GET for /slave(781)/containers from 127.0.0.1:33441
I0706 01:41:59.132346 32431 http.cpp:937] Authorizing principal 'test-principal' to GET the
'/containers' endpoint
I0706 01:41:59.136014 32439 slave.cpp:839] Agent terminating
[       OK ] Endpoint/SlaveEndpointTest.NoAuthorizer/2 (35 ms)
[----------] 9 tests from Endpoint/SlaveEndpointTest (317 ms total)

[----------] Global test environment tear-down
[==========] 1579 tests from 172 test cases ran. (333893 ms total)
[  PASSED  ] 1576 tests.
[  FAILED  ] 3 tests, listed below:
[  FAILED  ] SlaveTest.HTTPScheduler
[  FAILED  ] SlaveTest.HTTPSchedulerLiveUpgrade
[  FAILED  ] SlaveTest.HTTPSchedulerSlaveRestart

 3 FAILED TESTS
  YOU HAVE 20 DISABLED TESTS

I0706 01:41:59.201918 32444 process.cpp:968] Failed to accept socket: future discarded
make[3]: *** [CMakeFiles/check] Error 1
make[3]: Leaving directory `/mesos/build'
make[2]: Leaving directory `/mesos/build'
make[2]: *** [CMakeFiles/check.dir/all] Error 2
make[1]: *** [CMakeFiles/check.dir/rule] Error 2
make[1]: Leaving directory `/mesos/build'
make: *** [check] Error 2
+ docker rmi mesos-1499302161-17621
Untagged: mesos-1499302161-17621:latest
Deleted: sha256:790b5e7ef68ff49656affbe7b795577da204bc51dabb81663d968752ebfabc46
Deleted: sha256:743ba5dd09199ffb4e2188b250987dbd3fe5eed93703251cff0ee29e5fd61251
Deleted: sha256:303c59727bc873c4d643d8cf99aba7a6a780132bc899411bbe6f15fed31f8ce1
Deleted: sha256:6a3cbaa02a9a879c600bf0e0a2b0bd2c13fd18781e65961244798aac49abcbdb
Deleted: sha256:6868702e80419267c4072d7d94a1c9a3647a06307210d6da3cc515ef9322ae62
Deleted: sha256:f7cbf7fcd0c5ed6f983f34a32e230701d0920428afd4987a3f8dc72097c847db
Deleted: sha256:cabc4d0e6d51b47914dfefa1574314f2ad6941b09cfe5a0c5b435b186754a788
Deleted: sha256:509ff850b788d30219912f55a4217b9f9f66a31c7f673ff611e05d9be2796590
Deleted: sha256:f95e410dd5bac93dc0e9d3abb2d661ce3be30e6e4697c4157cafc5db532fe88a
Deleted: sha256:35188e373a3b9195c34099f9985bea363e37c72e51529bc82603eb444a5d539e
Deleted: sha256:7a370caa80a6dff995a4d8447f65f97a6021c9a8606b5689d822f1c2e32c9156
Deleted: sha256:ea85815c2bf699c4ce67c9ba31ab4e5d8aa24beac66f931e1774c10656bb0eb1
Deleted: sha256:20cc809ab24bbde09f5fc94c0121b1ccc6bd8b775f9285d5ea4ec881de08e8f5
Deleted: sha256:1f4f0e6e626f9adbd8a8daddd1f24834a462623a7f9e2a4b217181fcd0a29cb2
Deleted: sha256:2c9dbffb142f1f56d8586b17f8e06987b96a87af1d63f19f03c4a037d63cd9dd
Deleted: sha256:0deaafde3b1f2c4e09e0644285dd87baec6cfe68b4f2f518f5950fac57e96484
Deleted: sha256:29cec89049e0c113dc249f2cd287d059f53cfb541d89ffe8c516354b62c1a752
Deleted: sha256:1cb165eefe308c49b7e7af9d252b369a0798d560a87ace6b60199a46fba23cb3
Deleted: sha256:f41c5864b14fa38c322c1644001134739119003ba1a7d2bce55009320bf78d7a
Deleted: sha256:da8356ec62ab9affcc4655418c63395d60a4c27803c6870e6c0ae69a2f430d5e
Deleted: sha256:5079451340def4f0e3dd333a138056b9cdcab0d2e8423b4ab2c8b3f4b36858f1
Deleted: sha256:2e1926bc959fc3353b6fe199138f9fb512c8d931517ac74b2c0f87e201b62392
Deleted: sha256:9d4dc3248b3a5df0e8d2e05ad1fc400ba404a78d2c948453eaefae3bda7ff4ef
Deleted: sha256:a575f946896011c65c4adbdc96ce36d5f039925aac46a9591d84033bd5552484
Build step 'Execute shell' marked build as failure
Not sending mail to unregistered user neil.conway@gmail.com
Not sending mail to unregistered user benjamin.hindman@gmail.com

Mime
View raw message