mesos-builds mailing list archives

Site index · List index
Message view « Date » · « Thread »
Top « Date » · « Thread »
From Apache Jenkins Server <jenk...@builds.apache.org>
Subject Build failed in Jenkins: Mesos-Buildbot » cmake,clang,--verbose --enable-libevent --enable-ssl,GLOG_v=1 MESOS_VERBOSE=1,ubuntu:14.04,(ubuntu)&&(!ubuntu-us1)&&(!ubuntu-eu2) #3866
Date Wed, 05 Jul 2017 20:24:41 GMT
See <https://builds.apache.org/job/Mesos-Buildbot/BUILDTOOL=cmake,COMPILER=clang,CONFIGURATION=--verbose%20--enable-libevent%20--enable-ssl,ENVIRONMENT=GLOG_v=1%20MESOS_VERBOSE=1,OS=ubuntu%3A14.04,label_exp=(ubuntu)&&(!ubuntu-us1)&&(!ubuntu-eu2)/3866/display/redirect?page=changes>

Changes:

[benjamin.hindman] Moved `net::IPNetwork` to `net::IP:Network`.

[benjamin.hindman] Replaced use of `net::IPNetwork` by `net::IP::Network` in stout.

[benjamin.hindman] Replaced use of `net::IPNetwork` by `net::IP::Network` in Mesos.

[benjamin.hindman] Refactored net::IP and added net::IPv4 and net::IPv6.

[benjamin.hindman] Refactored inet::Address to base of inet4::Address and inet6::Address.

[benjamin.hindman] Mesos updates for new inet4::Address.

[benjamin.hindman] Added support for `net::IPv4` and `net::IPv6` in `FlagsBase`.

------------------------------------------
[...truncated 29.27 MB...]
I0705 20:24:35.270720  8496 http.cpp:997] Creating default 'jwt' HTTP authenticator for realm
'mesos-agent-readwrite'
I0705 20:24:35.272850  8496 slave.cpp:565] Agent resources: [{"name":"cpus","scalar":{"value":2.0},"type":"SCALAR"},{"name":"mem","scalar":{"value":1024.0},"type":"SCALAR"},{"name":"disk","scalar":{"value":1024.0},"type":"SCALAR"},{"name":"ports","ranges":{"range":[{"begin":31000,"end":32000}]},"type":"RANGES"}]
I0705 20:24:35.273206  8496 slave.cpp:573] Agent attributes: [  ]
I0705 20:24:35.273344  8496 slave.cpp:578] Agent hostname: localhost
I0705 20:24:35.273640  8507 status_update_manager.cpp:177] Pausing sending status updates
I0705 20:24:35.275254  8486 state.cpp:64] Recovering state from '/tmp/Endpoint_SlaveEndpointTest_UnauthorizedRequest_0_QLAnTw/meta'
I0705 20:24:35.275863  8495 status_update_manager.cpp:203] Recovering status update manager
I0705 20:24:35.276041  8495 containerizer.cpp:582] Recovering containerizer
I0705 20:24:35.277931  8495 provisioner.cpp:416] Provisioner recovery complete
I0705 20:24:35.278611  8501 slave.cpp:6189] Finished recovery
I0705 20:24:35.279146  8501 slave.cpp:6371] Querying resource estimator for oversubscribable
resources
I0705 20:24:35.279739  8501 slave.cpp:6385] Received oversubscribable resources {} from the
resource estimator
I0705 20:24:35.283967  8488 process.cpp:3779] Handling HTTP event for process 'slave(782)'
with path: '/slave(782)/monitor/statistics'
I0705 20:24:35.286201  8488 http.cpp:1116] HTTP GET for /slave(782)/monitor/statistics from
127.0.0.1:35174
I0705 20:24:35.286473  8488 http.cpp:937] Authorizing principal 'test-principal' to GET the
'/monitor/statistics' endpoint
I0705 20:24:35.295115  8506 slave.cpp:839] Agent terminating
[       OK ] Endpoint/SlaveEndpointTest.UnauthorizedRequest/0 (45 ms)
[ RUN      ] Endpoint/SlaveEndpointTest.UnauthorizedRequest/1
I0705 20:24:35.306654   608 containerizer.cpp:230] Using isolation: posix/cpu,posix/mem,filesystem/posix,network/cni,environment_secret
W0705 20:24:35.307164   608 backend.cpp:76] Failed to create 'aufs' backend: AufsBackend requires
root privileges
W0705 20:24:35.307283   608 backend.cpp:76] Failed to create 'bind' backend: BindBackend requires
root privileges
I0705 20:24:35.307319   608 provisioner.cpp:255] Using default backend 'copy'
I0705 20:24:35.310935  8502 slave.cpp:250] Mesos agent started on (783)@127.0.0.1:35671
I0705 20:24:35.310989  8502 slave.cpp:251] Flags at startup: --acls="" --appc_simple_discovery_uri_prefix="http://"
--appc_store_dir="/tmp/Endpoint_SlaveEndpointTest_UnauthorizedRequest_1_pitVrG/store/appc"
--authenticate_http_executors="true" --authenticate_http_readonly="true" --authenticate_http_readwrite="true"
--authenticatee="crammd5" --authentication_backoff_factor="1secs" --authorizer="local" --cgroups_cpu_enable_pids_and_tids_count="false"
--cgroups_enable_cfs="false" --cgroups_hierarchy="/sys/fs/cgroup" --cgroups_limit_swap="false"
--cgroups_root="mesos" --container_disk_watch_interval="15secs" --containerizers="mesos" --credential="/tmp/Endpoint_SlaveEndpointTest_UnauthorizedRequest_1_pitVrG/credential"
--default_role="*" --disk_watch_interval="1mins" --docker="docker" --docker_kill_orphans="true"
--docker_registry="https://registry-1.docker.io" --docker_remove_delay="6hrs" --docker_socket="/var/run/docker.sock"
--docker_stop_timeout="0ns" --docker_store_dir="/tmp/Endpoint_SlaveEndpointTest_UnauthorizedRequest_1_pitVrG/store/docker"
--docker_volume_checkpoint_dir="/var/run/mesos/isolators/docker/volume" --enforce_container_disk_quota="false"
--executor_registration_timeout="1mins" --executor_reregistration_timeout="2secs" --executor_secret_key="/tmp/Endpoint_SlaveEndpointTest_UnauthorizedRequest_1_pitVrG/executor_secret_key"
--executor_shutdown_grace_period="5secs" --fetcher_cache_dir="/tmp/Endpoint_SlaveEndpointTest_UnauthorizedRequest_1_pitVrG/fetch"
--fetcher_cache_size="2GB" --frameworks_home="" --gc_delay="1weeks" --gc_disk_headroom="0.1"
--hadoop_home="" --help="false" --hostname_lookup="true" --http_command_executor="false" --http_credentials="/tmp/Endpoint_SlaveEndpointTest_UnauthorizedRequest_1_pitVrG/http_credentials"
--http_heartbeat_interval="30secs" --initialize_driver_logging="true" --isolation="posix/cpu,posix/mem"
--launcher="posix" --launcher_dir="/mesos/build/src" --logbufsecs="0" --logging_level="INFO"
--max_completed_executors_per_framework="150" --oversubscribed_resources_interval="15secs"
--perf_duration="10secs" --perf_interval="1mins" --port="5051" --qos_correction_interval_min="0ns"
--quiet="false" --recover="reconnect" --recovery_timeout="15mins" --registration_backoff_factor="10ms"
--resources="cpus:2;gpus:0;mem:1024;disk:1024;ports:[31000-32000]" --revocable_cpu_low_priority="true"
--runtime_dir="/tmp/Endpoint_SlaveEndpointTest_UnauthorizedRequest_1_pitVrG" --sandbox_directory="/mnt/mesos/sandbox"
--strict="true" --switch_user="true" --systemd_enable_support="true" --systemd_runtime_directory="/run/systemd/system"
--version="false" --work_dir="/tmp/Endpoint_SlaveEndpointTest_UnauthorizedRequest_1_31Ft6r"
W0705 20:24:35.311372  8502 slave.cpp:254] 
**************************************************
Agent bound to loopback interface! Cannot communicate with remote master(s). You might want
to set '--ip' flag to a routable IP address.
**************************************************
I0705 20:24:35.311381  8502 credentials.hpp:86] Loading credential for authentication from
'/tmp/Endpoint_SlaveEndpointTest_UnauthorizedRequest_1_pitVrG/credential'
I0705 20:24:35.311568  8502 slave.cpp:283] Agent using credential for: test-principal
I0705 20:24:35.311583  8502 credentials.hpp:37] Loading credentials for authentication from
'/tmp/Endpoint_SlaveEndpointTest_UnauthorizedRequest_1_pitVrG/http_credentials'
I0705 20:24:35.311817  8502 http.cpp:976] Creating default 'basic' HTTP authenticator for
realm 'mesos-agent-executor'
I0705 20:24:35.311964  8502 http.cpp:997] Creating default 'jwt' HTTP authenticator for realm
'mesos-agent-executor'
I0705 20:24:35.312245  8502 http.cpp:976] Creating default 'basic' HTTP authenticator for
realm 'mesos-agent-readonly'
I0705 20:24:35.312338  8502 http.cpp:997] Creating default 'jwt' HTTP authenticator for realm
'mesos-agent-readonly'
I0705 20:24:35.312624  8502 http.cpp:976] Creating default 'basic' HTTP authenticator for
realm 'mesos-agent-readwrite'
I0705 20:24:35.312721  8502 http.cpp:997] Creating default 'jwt' HTTP authenticator for realm
'mesos-agent-readwrite'
I0705 20:24:35.314013  8502 slave.cpp:565] Agent resources: [{"name":"cpus","scalar":{"value":2.0},"type":"SCALAR"},{"name":"mem","scalar":{"value":1024.0},"type":"SCALAR"},{"name":"disk","scalar":{"value":1024.0},"type":"SCALAR"},{"name":"ports","ranges":{"range":[{"begin":31000,"end":32000}]},"type":"RANGES"}]
I0705 20:24:35.314183  8502 slave.cpp:573] Agent attributes: [  ]
I0705 20:24:35.314198  8502 slave.cpp:578] Agent hostname: localhost
I0705 20:24:35.314339  8490 status_update_manager.cpp:177] Pausing sending status updates
I0705 20:24:35.315788  8495 state.cpp:64] Recovering state from '/tmp/Endpoint_SlaveEndpointTest_UnauthorizedRequest_1_31Ft6r/meta'
I0705 20:24:35.316160  8490 status_update_manager.cpp:203] Recovering status update manager
I0705 20:24:35.316437  8505 containerizer.cpp:582] Recovering containerizer
I0705 20:24:35.317888  8502 provisioner.cpp:416] Provisioner recovery complete
I0705 20:24:35.318234  8496 slave.cpp:6189] Finished recovery
I0705 20:24:35.318761  8496 slave.cpp:6371] Querying resource estimator for oversubscribable
resources
I0705 20:24:35.319149  8493 slave.cpp:6385] Received oversubscribable resources {} from the
resource estimator
I0705 20:24:35.321053  8496 process.cpp:3779] Handling HTTP event for process 'slave(783)'
with path: '/slave(783)/monitor/statistics.json'
I0705 20:24:35.322747  8502 http.cpp:1116] HTTP GET for /slave(783)/monitor/statistics.json
from 127.0.0.1:35176
I0705 20:24:35.322851  8502 http.cpp:937] Authorizing principal 'test-principal' to GET the
'/monitor/statistics.json' endpoint
I0705 20:24:35.324681  8487 slave.cpp:839] Agent terminating
[       OK ] Endpoint/SlaveEndpointTest.UnauthorizedRequest/1 (29 ms)
[ RUN      ] Endpoint/SlaveEndpointTest.UnauthorizedRequest/2
I0705 20:24:35.336246   608 containerizer.cpp:230] Using isolation: posix/cpu,posix/mem,filesystem/posix,network/cni,environment_secret
W0705 20:24:35.336794   608 backend.cpp:76] Failed to create 'aufs' backend: AufsBackend requires
root privileges
W0705 20:24:35.336912   608 backend.cpp:76] Failed to create 'bind' backend: BindBackend requires
root privileges
I0705 20:24:35.336942   608 provisioner.cpp:255] Using default backend 'copy'
I0705 20:24:35.340315  8500 slave.cpp:250] Mesos agent started on (784)@127.0.0.1:35671
I0705 20:24:35.340348  8500 slave.cpp:251] Flags at startup: --acls="" --appc_simple_discovery_uri_prefix="http://"
--appc_store_dir="/tmp/Endpoint_SlaveEndpointTest_UnauthorizedRequest_2_7eFI4B/store/appc"
--authenticate_http_executors="true" --authenticate_http_readonly="true" --authenticate_http_readwrite="true"
--authenticatee="crammd5" --authentication_backoff_factor="1secs" --authorizer="local" --cgroups_cpu_enable_pids_and_tids_count="false"
--cgroups_enable_cfs="false" --cgroups_hierarchy="/sys/fs/cgroup" --cgroups_limit_swap="false"
--cgroups_root="mesos" --container_disk_watch_interval="15secs" --containerizers="mesos" --credential="/tmp/Endpoint_SlaveEndpointTest_UnauthorizedRequest_2_7eFI4B/credential"
--default_role="*" --disk_watch_interval="1mins" --docker="docker" --docker_kill_orphans="true"
--docker_registry="https://registry-1.docker.io" --docker_remove_delay="6hrs" --docker_socket="/var/run/docker.sock"
--docker_stop_timeout="0ns" --docker_store_dir="/tmp/Endpoint_SlaveEndpointTest_UnauthorizedRequest_2_7eFI4B/store/docker"
--docker_volume_checkpoint_dir="/var/run/mesos/isolators/docker/volume" --enforce_container_disk_quota="false"
--executor_registration_timeout="1mins" --executor_reregistration_timeout="2secs" --executor_secret_key="/tmp/Endpoint_SlaveEndpointTest_UnauthorizedRequest_2_7eFI4B/executor_secret_key"
--executor_shutdown_grace_period="5secs" --fetcher_cache_dir="/tmp/Endpoint_SlaveEndpointTest_UnauthorizedRequest_2_7eFI4B/fetch"
--fetcher_cache_size="2GB" --frameworks_home="" --gc_delay="1weeks" --gc_disk_headroom="0.1"
--hadoop_home="" --help="false" --hostname_lookup="true" --http_command_executor="false" --http_credentials="/tmp/Endpoint_SlaveEndpointTest_UnauthorizedRequest_2_7eFI4B/http_credentials"
--http_heartbeat_interval="30secs" --initialize_driver_logging="true" --isolation="posix/cpu,posix/mem"
--launcher="posix" --launcher_dir="/mesos/build/src" --logbufsecs="0" --logging_level="INFO"
--max_completed_executors_per_framework="150" --oversubscribed_resources_interval="15secs"
--perf_duration="10secs" --perf_interval="1mins" --port="5051" --qos_correction_interval_min="0ns"
--quiet="false" --recover="reconnect" --recovery_timeout="15mins" --registration_backoff_factor="10ms"
--resources="cpus:2;gpus:0;mem:1024;disk:1024;ports:[31000-32000]" --revocable_cpu_low_priority="true"
--runtime_dir="/tmp/Endpoint_SlaveEndpointTest_UnauthorizedRequest_2_7eFI4B" --sandbox_directory="/mnt/mesos/sandbox"
--strict="true" --switch_user="true" --systemd_enable_support="true" --systemd_runtime_directory="/run/systemd/system"
--version="false" --work_dir="/tmp/Endpoint_SlaveEndpointTest_UnauthorizedRequest_2_B36SEn"
W0705 20:24:35.340726  8500 slave.cpp:254] 
**************************************************
Agent bound to loopback interface! Cannot communicate with remote master(s). You might want
to set '--ip' flag to a routable IP address.
**************************************************
I0705 20:24:35.340736  8500 credentials.hpp:86] Loading credential for authentication from
'/tmp/Endpoint_SlaveEndpointTest_UnauthorizedRequest_2_7eFI4B/credential'
I0705 20:24:35.340864  8500 slave.cpp:283] Agent using credential for: test-principal
I0705 20:24:35.340879  8500 credentials.hpp:37] Loading credentials for authentication from
'/tmp/Endpoint_SlaveEndpointTest_UnauthorizedRequest_2_7eFI4B/http_credentials'
I0705 20:24:35.341101  8500 http.cpp:976] Creating default 'basic' HTTP authenticator for
realm 'mesos-agent-executor'
I0705 20:24:35.341197  8500 http.cpp:997] Creating default 'jwt' HTTP authenticator for realm
'mesos-agent-executor'
I0705 20:24:35.341405  8500 http.cpp:976] Creating default 'basic' HTTP authenticator for
realm 'mesos-agent-readonly'
I0705 20:24:35.341537  8500 http.cpp:997] Creating default 'jwt' HTTP authenticator for realm
'mesos-agent-readonly'
I0705 20:24:35.341704  8500 http.cpp:976] Creating default 'basic' HTTP authenticator for
realm 'mesos-agent-readwrite'
I0705 20:24:35.341814  8500 http.cpp:997] Creating default 'jwt' HTTP authenticator for realm
'mesos-agent-readwrite'
I0705 20:24:35.343276  8500 slave.cpp:565] Agent resources: [{"name":"cpus","scalar":{"value":2.0},"type":"SCALAR"},{"name":"mem","scalar":{"value":1024.0},"type":"SCALAR"},{"name":"disk","scalar":{"value":1024.0},"type":"SCALAR"},{"name":"ports","ranges":{"range":[{"begin":31000,"end":32000}]},"type":"RANGES"}]
I0705 20:24:35.343487  8500 slave.cpp:573] Agent attributes: [  ]
I0705 20:24:35.343495  8500 slave.cpp:578] Agent hostname: localhost
I0705 20:24:35.343633  8488 status_update_manager.cpp:177] Pausing sending status updates
I0705 20:24:35.345024  8502 state.cpp:64] Recovering state from '/tmp/Endpoint_SlaveEndpointTest_UnauthorizedRequest_2_B36SEn/meta'
I0705 20:24:35.345423  8486 status_update_manager.cpp:203] Recovering status update manager
I0705 20:24:35.345662  8485 containerizer.cpp:582] Recovering containerizer
I0705 20:24:35.347213  8501 provisioner.cpp:416] Provisioner recovery complete
I0705 20:24:35.347568  8494 slave.cpp:6189] Finished recovery
I0705 20:24:35.348268  8494 slave.cpp:6371] Querying resource estimator for oversubscribable
resources
I0705 20:24:35.348539  8494 slave.cpp:6385] Received oversubscribable resources {} from the
resource estimator
I0705 20:24:35.350172  8498 process.cpp:3779] Handling HTTP event for process 'slave(784)'
with path: '/slave(784)/containers'
I0705 20:24:35.351583  8493 http.cpp:1116] HTTP GET for /slave(784)/containers from 127.0.0.1:35178
I0705 20:24:35.351680  8493 http.cpp:937] Authorizing principal 'test-principal' to GET the
'/containers' endpoint
I0705 20:24:35.353684  8496 slave.cpp:839] Agent terminating
[       OK ] Endpoint/SlaveEndpointTest.UnauthorizedRequest/2 (28 ms)
[ RUN      ] Endpoint/SlaveEndpointTest.NoAuthorizer/0
I0705 20:24:35.368276   608 containerizer.cpp:230] Using isolation: posix/cpu,posix/mem,filesystem/posix,network/cni,environment_secret
W0705 20:24:35.369230   608 backend.cpp:76] Failed to create 'aufs' backend: AufsBackend requires
root privileges
W0705 20:24:35.369462   608 backend.cpp:76] Failed to create 'bind' backend: BindBackend requires
root privileges
I0705 20:24:35.369505   608 provisioner.cpp:255] Using default backend 'copy'
I0705 20:24:35.372344   608 cluster.cpp:448] Creating default 'local' authorizer
I0705 20:24:35.374876  8502 slave.cpp:250] Mesos agent started on (785)@127.0.0.1:35671
I0705 20:24:35.374930  8502 slave.cpp:251] Flags at startup: --acls="" --appc_simple_discovery_uri_prefix="http://"
--appc_store_dir="/tmp/Endpoint_SlaveEndpointTest_NoAuthorizer_0_Up8wYx/store/appc" --authenticate_http_executors="true"
--authenticate_http_readonly="true" --authenticate_http_readwrite="true" --authenticatee="crammd5"
--authentication_backoff_factor="1secs" --authorizer="local" --cgroups_cpu_enable_pids_and_tids_count="false"
--cgroups_enable_cfs="false" --cgroups_hierarchy="/sys/fs/cgroup" --cgroups_limit_swap="false"
--cgroups_root="mesos" --container_disk_watch_interval="15secs" --containerizers="mesos" --credential="/tmp/Endpoint_SlaveEndpointTest_NoAuthorizer_0_Up8wYx/credential"
--default_role="*" --disk_watch_interval="1mins" --docker="docker" --docker_kill_orphans="true"
--docker_registry="https://registry-1.docker.io" --docker_remove_delay="6hrs" --docker_socket="/var/run/docker.sock"
--docker_stop_timeout="0ns" --docker_store_dir="/tmp/Endpoint_SlaveEndpointTest_NoAuthorizer_0_Up8wYx/store/docker"
--docker_volume_checkpoint_dir="/var/run/mesos/isolators/docker/volume" --enforce_container_disk_quota="false"
--executor_registration_timeout="1mins" --executor_reregistration_timeout="2secs" --executor_secret_key="/tmp/Endpoint_SlaveEndpointTest_NoAuthorizer_0_Up8wYx/executor_secret_key"
--executor_shutdown_grace_period="5secs" --fetcher_cache_dir="/tmp/Endpoint_SlaveEndpointTest_NoAuthorizer_0_Up8wYx/fetch"
--fetcher_cache_size="2GB" --frameworks_home="" --gc_delay="1weeks" --gc_disk_headroom="0.1"
--hadoop_home="" --help="false" --hostname_lookup="true" --http_command_executor="false" --http_credentials="/tmp/Endpoint_SlaveEndpointTest_NoAuthorizer_0_Up8wYx/http_credentials"
--http_heartbeat_interval="30secs" --initialize_driver_logging="true" --isolation="posix/cpu,posix/mem"
--launcher="posix" --launcher_dir="/mesos/build/src" --logbufsecs="0" --logging_level="INFO"
--max_completed_executors_per_framework="150" --oversubscribed_resources_interval="15secs"
--perf_duration="10secs" --perf_interval="1mins" --port="5051" --qos_correction_interval_min="0ns"
--quiet="false" --recover="reconnect" --recovery_timeout="15mins" --registration_backoff_factor="10ms"
--resources="cpus:2;gpus:0;mem:1024;disk:1024;ports:[31000-32000]" --revocable_cpu_low_priority="true"
--runtime_dir="/tmp/Endpoint_SlaveEndpointTest_NoAuthorizer_0_Up8wYx" --sandbox_directory="/mnt/mesos/sandbox"
--strict="true" --switch_user="true" --systemd_enable_support="true" --systemd_runtime_directory="/run/systemd/system"
--version="false" --work_dir="/tmp/Endpoint_SlaveEndpointTest_NoAuthorizer_0_MHUuuj"
W0705 20:24:35.375376  8502 slave.cpp:254] 
**************************************************
Agent bound to loopback interface! Cannot communicate with remote master(s). You might want
to set '--ip' flag to a routable IP address.
**************************************************
I0705 20:24:35.375391  8502 credentials.hpp:86] Loading credential for authentication from
'/tmp/Endpoint_SlaveEndpointTest_NoAuthorizer_0_Up8wYx/credential'
I0705 20:24:35.375584  8502 slave.cpp:283] Agent using credential for: test-principal
I0705 20:24:35.375602  8502 credentials.hpp:37] Loading credentials for authentication from
'/tmp/Endpoint_SlaveEndpointTest_NoAuthorizer_0_Up8wYx/http_credentials'
I0705 20:24:35.375849  8502 http.cpp:976] Creating default 'basic' HTTP authenticator for
realm 'mesos-agent-executor'
I0705 20:24:35.375977  8502 http.cpp:997] Creating default 'jwt' HTTP authenticator for realm
'mesos-agent-executor'
I0705 20:24:35.376572  8502 http.cpp:976] Creating default 'basic' HTTP authenticator for
realm 'mesos-agent-readonly'
I0705 20:24:35.376768  8502 http.cpp:997] Creating default 'jwt' HTTP authenticator for realm
'mesos-agent-readonly'
I0705 20:24:35.377002  8502 http.cpp:976] Creating default 'basic' HTTP authenticator for
realm 'mesos-agent-readwrite'
I0705 20:24:35.377075  8502 http.cpp:997] Creating default 'jwt' HTTP authenticator for realm
'mesos-agent-readwrite'
I0705 20:24:35.378713  8502 slave.cpp:565] Agent resources: [{"name":"cpus","scalar":{"value":2.0},"type":"SCALAR"},{"name":"mem","scalar":{"value":1024.0},"type":"SCALAR"},{"name":"disk","scalar":{"value":1024.0},"type":"SCALAR"},{"name":"ports","ranges":{"range":[{"begin":31000,"end":32000}]},"type":"RANGES"}]
I0705 20:24:35.378980  8502 slave.cpp:573] Agent attributes: [  ]
I0705 20:24:35.378994  8502 slave.cpp:578] Agent hostname: localhost
I0705 20:24:35.381063  8502 status_update_manager.cpp:177] Pausing sending status updates
I0705 20:24:35.381402  8499 state.cpp:64] Recovering state from '/tmp/Endpoint_SlaveEndpointTest_NoAuthorizer_0_MHUuuj/meta'
I0705 20:24:35.381742  8489 status_update_manager.cpp:203] Recovering status update manager
I0705 20:24:35.381935  8485 containerizer.cpp:582] Recovering containerizer
I0705 20:24:35.383350  8484 provisioner.cpp:416] Provisioner recovery complete
I0705 20:24:35.383684  8507 slave.cpp:6189] Finished recovery
I0705 20:24:35.384258  8507 slave.cpp:6371] Querying resource estimator for oversubscribable
resources
I0705 20:24:35.384585  8492 slave.cpp:6385] Received oversubscribable resources {} from the
resource estimator
I0705 20:24:35.386773  8498 process.cpp:3779] Handling HTTP event for process 'slave(785)'
with path: '/slave(785)/monitor/statistics'
I0705 20:24:35.388541  8497 http.cpp:1116] HTTP GET for /slave(785)/monitor/statistics from
127.0.0.1:35180
I0705 20:24:35.388653  8497 http.cpp:937] Authorizing principal 'test-principal' to GET the
'/monitor/statistics' endpoint
I0705 20:24:35.391913  8502 slave.cpp:839] Agent terminating
[       OK ] Endpoint/SlaveEndpointTest.NoAuthorizer/0 (39 ms)
[ RUN      ] Endpoint/SlaveEndpointTest.NoAuthorizer/1
I0705 20:24:35.403955   608 containerizer.cpp:230] Using isolation: posix/cpu,posix/mem,filesystem/posix,network/cni,environment_secret
W0705 20:24:35.404661   608 backend.cpp:76] Failed to create 'aufs' backend: AufsBackend requires
root privileges
W0705 20:24:35.404780   608 backend.cpp:76] Failed to create 'bind' backend: BindBackend requires
root privileges
I0705 20:24:35.404816   608 provisioner.cpp:255] Using default backend 'copy'
I0705 20:24:35.411803   608 cluster.cpp:448] Creating default 'local' authorizer
I0705 20:24:35.413703  8505 slave.cpp:250] Mesos agent started on (786)@127.0.0.1:35671
I0705 20:24:35.413743  8505 slave.cpp:251] Flags at startup: --acls="" --appc_simple_discovery_uri_prefix="http://"
--appc_store_dir="/tmp/Endpoint_SlaveEndpointTest_NoAuthorizer_1_clCafu/store/appc" --authenticate_http_executors="true"
--authenticate_http_readonly="true" --authenticate_http_readwrite="true" --authenticatee="crammd5"
--authentication_backoff_factor="1secs" --authorizer="local" --cgroups_cpu_enable_pids_and_tids_count="false"
--cgroups_enable_cfs="false" --cgroups_hierarchy="/sys/fs/cgroup" --cgroups_limit_swap="false"
--cgroups_root="mesos" --container_disk_watch_interval="15secs" --containerizers="mesos" --credential="/tmp/Endpoint_SlaveEndpointTest_NoAuthorizer_1_clCafu/credential"
--default_role="*" --disk_watch_interval="1mins" --docker="docker" --docker_kill_orphans="true"
--docker_registry="https://registry-1.docker.io" --docker_remove_delay="6hrs" --docker_socket="/var/run/docker.sock"
--docker_stop_timeout="0ns" --docker_store_dir="/tmp/Endpoint_SlaveEndpointTest_NoAuthorizer_1_clCafu/store/docker"
--docker_volume_checkpoint_dir="/var/run/mesos/isolators/docker/volume" --enforce_container_disk_quota="false"
--executor_registration_timeout="1mins" --executor_reregistration_timeout="2secs" --executor_secret_key="/tmp/Endpoint_SlaveEndpointTest_NoAuthorizer_1_clCafu/executor_secret_key"
--executor_shutdown_grace_period="5secs" --fetcher_cache_dir="/tmp/Endpoint_SlaveEndpointTest_NoAuthorizer_1_clCafu/fetch"
--fetcher_cache_size="2GB" --frameworks_home="" --gc_delay="1weeks" --gc_disk_headroom="0.1"
--hadoop_home="" --help="false" --hostname_lookup="true" --http_command_executor="false" --http_credentials="/tmp/Endpoint_SlaveEndpointTest_NoAuthorizer_1_clCafu/http_credentials"
--http_heartbeat_interval="30secs" --initialize_driver_logging="true" --isolation="posix/cpu,posix/mem"
--launcher="posix" --launcher_dir="/mesos/build/src" --logbufsecs="0" --logging_level="INFO"
--max_completed_executors_per_framework="150" --oversubscribed_resources_interval="15secs"
--perf_duration="10secs" --perf_interval="1mins" --port="5051" --qos_correction_interval_min="0ns"
--quiet="false" --recover="reconnect" --recovery_timeout="15mins" --registration_backoff_factor="10ms"
--resources="cpus:2;gpus:0;mem:1024;disk:1024;ports:[31000-32000]" --revocable_cpu_low_priority="true"
--runtime_dir="/tmp/Endpoint_SlaveEndpointTest_NoAuthorizer_1_clCafu" --sandbox_directory="/mnt/mesos/sandbox"
--strict="true" --switch_user="true" --systemd_enable_support="true" --systemd_runtime_directory="/run/systemd/system"
--version="false" --work_dir="/tmp/Endpoint_SlaveEndpointTest_NoAuthorizer_1_dPxjFf"
W0705 20:24:35.414371  8505 slave.cpp:254] 
**************************************************
Agent bound to loopback interface! Cannot communicate with remote master(s). You might want
to set '--ip' flag to a routable IP address.
**************************************************
I0705 20:24:35.414384  8505 credentials.hpp:86] Loading credential for authentication from
'/tmp/Endpoint_SlaveEndpointTest_NoAuthorizer_1_clCafu/credential'
I0705 20:24:35.414577  8505 slave.cpp:283] Agent using credential for: test-principal
I0705 20:24:35.414597  8505 credentials.hpp:37] Loading credentials for authentication from
'/tmp/Endpoint_SlaveEndpointTest_NoAuthorizer_1_clCafu/http_credentials'
I0705 20:24:35.414880  8505 http.cpp:976] Creating default 'basic' HTTP authenticator for
realm 'mesos-agent-executor'
I0705 20:24:35.415005  8505 http.cpp:997] Creating default 'jwt' HTTP authenticator for realm
'mesos-agent-executor'
I0705 20:24:35.415196  8505 http.cpp:976] Creating default 'basic' HTTP authenticator for
realm 'mesos-agent-readonly'
I0705 20:24:35.415282  8505 http.cpp:997] Creating default 'jwt' HTTP authenticator for realm
'mesos-agent-readonly'
I0705 20:24:35.415421  8505 http.cpp:976] Creating default 'basic' HTTP authenticator for
realm 'mesos-agent-readwrite'
I0705 20:24:35.415632  8505 http.cpp:997] Creating default 'jwt' HTTP authenticator for realm
'mesos-agent-readwrite'
I0705 20:24:35.417122  8505 slave.cpp:565] Agent resources: [{"name":"cpus","scalar":{"value":2.0},"type":"SCALAR"},{"name":"mem","scalar":{"value":1024.0},"type":"SCALAR"},{"name":"disk","scalar":{"value":1024.0},"type":"SCALAR"},{"name":"ports","ranges":{"range":[{"begin":31000,"end":32000}]},"type":"RANGES"}]
I0705 20:24:35.417336  8505 slave.cpp:573] Agent attributes: [  ]
I0705 20:24:35.417351  8505 slave.cpp:578] Agent hostname: localhost
I0705 20:24:35.417484  8504 status_update_manager.cpp:177] Pausing sending status updates
I0705 20:24:35.419265  8505 state.cpp:64] Recovering state from '/tmp/Endpoint_SlaveEndpointTest_NoAuthorizer_1_dPxjFf/meta'
I0705 20:24:35.419716  8505 status_update_manager.cpp:203] Recovering status update manager
I0705 20:24:35.419870  8505 containerizer.cpp:582] Recovering containerizer
I0705 20:24:35.421703  8505 provisioner.cpp:416] Provisioner recovery complete
I0705 20:24:35.422173  8505 slave.cpp:6189] Finished recovery
I0705 20:24:35.422670  8505 slave.cpp:6371] Querying resource estimator for oversubscribable
resources
I0705 20:24:35.423143  8492 slave.cpp:6385] Received oversubscribable resources {} from the
resource estimator
I0705 20:24:35.425103  8491 process.cpp:3779] Handling HTTP event for process 'slave(786)'
with path: '/slave(786)/monitor/statistics.json'
I0705 20:24:35.426767  8500 http.cpp:1116] HTTP GET for /slave(786)/monitor/statistics.json
from 127.0.0.1:35182
I0705 20:24:35.426841  8500 http.cpp:937] Authorizing principal 'test-principal' to GET the
'/monitor/statistics.json' endpoint
I0705 20:24:35.429556  8485 slave.cpp:839] Agent terminating
[       OK ] Endpoint/SlaveEndpointTest.NoAuthorizer/1 (37 ms)
[ RUN      ] Endpoint/SlaveEndpointTest.NoAuthorizer/2
I0705 20:24:35.441524   608 containerizer.cpp:230] Using isolation: posix/cpu,posix/mem,filesystem/posix,network/cni,environment_secret
W0705 20:24:35.441954   608 backend.cpp:76] Failed to create 'aufs' backend: AufsBackend requires
root privileges
W0705 20:24:35.442054   608 backend.cpp:76] Failed to create 'bind' backend: BindBackend requires
root privileges
I0705 20:24:35.442085   608 provisioner.cpp:255] Using default backend 'copy'
I0705 20:24:35.443904   608 cluster.cpp:448] Creating default 'local' authorizer
I0705 20:24:35.445319  8501 slave.cpp:250] Mesos agent started on (787)@127.0.0.1:35671
I0705 20:24:35.445351  8501 slave.cpp:251] Flags at startup: --acls="" --appc_simple_discovery_uri_prefix="http://"
--appc_store_dir="/tmp/Endpoint_SlaveEndpointTest_NoAuthorizer_2_oXikSq/store/appc" --authenticate_http_executors="true"
--authenticate_http_readonly="true" --authenticate_http_readwrite="true" --authenticatee="crammd5"
--authentication_backoff_factor="1secs" --authorizer="local" --cgroups_cpu_enable_pids_and_tids_count="false"
--cgroups_enable_cfs="false" --cgroups_hierarchy="/sys/fs/cgroup" --cgroups_limit_swap="false"
--cgroups_root="mesos" --container_disk_watch_interval="15secs" --containerizers="mesos" --credential="/tmp/Endpoint_SlaveEndpointTest_NoAuthorizer_2_oXikSq/credential"
--default_role="*" --disk_watch_interval="1mins" --docker="docker" --docker_kill_orphans="true"
--docker_registry="https://registry-1.docker.io" --docker_remove_delay="6hrs" --docker_socket="/var/run/docker.sock"
--docker_stop_timeout="0ns" --docker_store_dir="/tmp/Endpoint_SlaveEndpointTest_NoAuthorizer_2_oXikSq/store/docker"
--docker_volume_checkpoint_dir="/var/run/mesos/isolators/docker/volume" --enforce_container_disk_quota="false"
--executor_registration_timeout="1mins" --executor_reregistration_timeout="2secs" --executor_secret_key="/tmp/Endpoint_SlaveEndpointTest_NoAuthorizer_2_oXikSq/executor_secret_key"
--executor_shutdown_grace_period="5secs" --fetcher_cache_dir="/tmp/Endpoint_SlaveEndpointTest_NoAuthorizer_2_oXikSq/fetch"
--fetcher_cache_size="2GB" --frameworks_home="" --gc_delay="1weeks" --gc_disk_headroom="0.1"
--hadoop_home="" --help="false" --hostname_lookup="true" --http_command_executor="false" --http_credentials="/tmp/Endpoint_SlaveEndpointTest_NoAuthorizer_2_oXikSq/http_credentials"
--http_heartbeat_interval="30secs" --initialize_driver_logging="true" --isolation="posix/cpu,posix/mem"
--launcher="posix" --launcher_dir="/mesos/build/src" --logbufsecs="0" --logging_level="INFO"
--max_completed_executors_per_framework="150" --oversubscribed_resources_interval="15secs"
--perf_duration="10secs" --perf_interval="1mins" --port="5051" --qos_correction_interval_min="0ns"
--quiet="false" --recover="reconnect" --recovery_timeout="15mins" --registration_backoff_factor="10ms"
--resources="cpus:2;gpus:0;mem:1024;disk:1024;ports:[31000-32000]" --revocable_cpu_low_priority="true"
--runtime_dir="/tmp/Endpoint_SlaveEndpointTest_NoAuthorizer_2_oXikSq" --sandbox_directory="/mnt/mesos/sandbox"
--strict="true" --switch_user="true" --systemd_enable_support="true" --systemd_runtime_directory="/run/systemd/system"
--version="false" --work_dir="/tmp/Endpoint_SlaveEndpointTest_NoAuthorizer_2_8blRcc"
W0705 20:24:35.445808  8501 slave.cpp:254] 
**************************************************
Agent bound to loopback interface! Cannot communicate with remote master(s). You might want
to set '--ip' flag to a routable IP address.
**************************************************
I0705 20:24:35.445823  8501 credentials.hpp:86] Loading credential for authentication from
'/tmp/Endpoint_SlaveEndpointTest_NoAuthorizer_2_oXikSq/credential'
I0705 20:24:35.445948  8501 slave.cpp:283] Agent using credential for: test-principal
I0705 20:24:35.445966  8501 credentials.hpp:37] Loading credentials for authentication from
'/tmp/Endpoint_SlaveEndpointTest_NoAuthorizer_2_oXikSq/http_credentials'
I0705 20:24:35.446179  8501 http.cpp:976] Creating default 'basic' HTTP authenticator for
realm 'mesos-agent-executor'
I0705 20:24:35.446295  8501 http.cpp:997] Creating default 'jwt' HTTP authenticator for realm
'mesos-agent-executor'
I0705 20:24:35.450419  8501 http.cpp:976] Creating default 'basic' HTTP authenticator for
realm 'mesos-agent-readonly'
I0705 20:24:35.450515  8501 http.cpp:997] Creating default 'jwt' HTTP authenticator for realm
'mesos-agent-readonly'
I0705 20:24:35.450677  8501 http.cpp:976] Creating default 'basic' HTTP authenticator for
realm 'mesos-agent-readwrite'
I0705 20:24:35.450753  8501 http.cpp:997] Creating default 'jwt' HTTP authenticator for realm
'mesos-agent-readwrite'
I0705 20:24:35.452358  8501 slave.cpp:565] Agent resources: [{"name":"cpus","scalar":{"value":2.0},"type":"SCALAR"},{"name":"mem","scalar":{"value":1024.0},"type":"SCALAR"},{"name":"disk","scalar":{"value":1024.0},"type":"SCALAR"},{"name":"ports","ranges":{"range":[{"begin":31000,"end":32000}]},"type":"RANGES"}]
I0705 20:24:35.452602  8501 slave.cpp:573] Agent attributes: [  ]
I0705 20:24:35.452615  8501 slave.cpp:578] Agent hostname: localhost
I0705 20:24:35.454617  8507 state.cpp:64] Recovering state from '/tmp/Endpoint_SlaveEndpointTest_NoAuthorizer_2_8blRcc/meta'
I0705 20:24:35.454658  8503 status_update_manager.cpp:177] Pausing sending status updates
I0705 20:24:35.454901  8503 status_update_manager.cpp:203] Recovering status update manager
I0705 20:24:35.455082  8490 containerizer.cpp:582] Recovering containerizer
I0705 20:24:35.456692  8499 provisioner.cpp:416] Provisioner recovery complete
I0705 20:24:35.457228  8499 slave.cpp:6189] Finished recovery
I0705 20:24:35.457804  8499 slave.cpp:6371] Querying resource estimator for oversubscribable
resources
I0705 20:24:35.458473  8499 slave.cpp:6385] Received oversubscribable resources {} from the
resource estimator
I0705 20:24:35.471979  8484 process.cpp:3779] Handling HTTP event for process 'slave(787)'
with path: '/slave(787)/containers'
I0705 20:24:35.474040  8488 http.cpp:1116] HTTP GET for /slave(787)/containers from 127.0.0.1:35184
I0705 20:24:35.474133  8488 http.cpp:937] Authorizing principal 'test-principal' to GET the
'/containers' endpoint
I0705 20:24:35.478168  8497 slave.cpp:839] Agent terminating
[       OK ] Endpoint/SlaveEndpointTest.NoAuthorizer/2 (47 ms)
[----------] 9 tests from Endpoint/SlaveEndpointTest (347 ms total)

[----------] Global test environment tear-down
[==========] 1587 tests from 174 test cases ran. (345124 ms total)
[  PASSED  ] 1584 tests.
[  FAILED  ] 3 tests, listed below:
[  FAILED  ] SlaveTest.HTTPScheduler
[  FAILED  ] SlaveTest.HTTPSchedulerLiveUpgrade
[  FAILED  ] SlaveTest.HTTPSchedulerSlaveRestart

 3 FAILED TESTS
  YOU HAVE 20 DISABLED TESTS

I0705 20:24:35.539248  8508 process.cpp:968] Failed to accept socket: future discarded
make[3]: *** [CMakeFiles/check] Error 1
make[3]: Leaving directory `/mesos/build'
make[2]: *** [CMakeFiles/check.dir/all] Error 2
make[2]: Leaving directory `/mesos/build'
make[1]: *** [CMakeFiles/check.dir/rule] Error 2
make: *** [check] Error 2
make[1]: Leaving directory `/mesos/build'
+ docker rmi mesos-1499284037-2057
Untagged: mesos-1499284037-2057:latest
Deleted: sha256:f1f8bfa808a61bb17d6caaae9083f49ab5b980083f02fd275092dd2c78dc99ec
Deleted: sha256:769059962efe6e737b026f9c46ee6fdde6415d0f6a4db2b534991fe1ace1cc85
Deleted: sha256:4fd1e06e8b5cacf465c7915d9c6508b2a4e0c0c9d78d21ad24fb8ff11533d9f6
Deleted: sha256:34192dfc6c43900994294d850095d9556b0fc4b81c0dcfcdb3d84705a5a29f0a
Deleted: sha256:76320703144304d4d9db9b5c29f749386b4ec8f9e5da922644c2677a00e9fa71
Deleted: sha256:fef4e4f75c69842db4cdda6a73e5d538aa1a05bd985345716664c06dcb9390ec
Deleted: sha256:cdad0a6b4ce4dc196d42ef5370c66c1b4a336161beacbf9d5887e919e28a94c6
Deleted: sha256:50b93a9f28e7e432bc64a37f179785d3ef32e0ea91c11b6976c68267ca4296e9
Deleted: sha256:d57609b6d76a68815afe0c151cc6578108d1d50baf2283937733f8d98f853abc
Deleted: sha256:dc8d9ce66c788845aeb88ff5992f9b846345eadee6d388d08f86d18c48ca21d9
Deleted: sha256:0ad89b3f6f0e831ed6f378947d7b4bf68b91607ee3d1c54c350e6456dc9762df
Deleted: sha256:5ec4903fe8d45cdcb868dfe7207c4c7b29de67cad373619de641e1454c3daeda
Deleted: sha256:8961c98eb67c05bd4b21bcb2fb60729f890f14be499c1fb26775d619335b0209
Deleted: sha256:51dc74090bad9b4f337d84c0e498cda343d50f071ca21847e6137d7231c6f6e7
Deleted: sha256:3825567212c71b793ce50fec7dda783ebb8e52d0780f1b65e523c6dbc29b0efc
Deleted: sha256:563cc2532faf0805a1629ca61490d37b8426ae276a9e707fbb4986424facce94
Deleted: sha256:84bbaeaa3a2567df6156c7b692515547094300bf1621dd4b7ea059dd1fa2fd5d
Deleted: sha256:34ec15153424f6f56ccb8d2505f9a7f5ac87da836d6720103fa4e1ffb01ad9b6
Deleted: sha256:9af465d145b9eccb95aef3a4408fd252a08c9dec95b70b1767c78696da58be73
Deleted: sha256:7dcaa82006967db5d6eb2eb323f49e5e0477a150662d87d22d26b9022d3d2c6b
Deleted: sha256:7b14b6287d5b49ec8fe080ca9bdfbfafa23bc5909fb53e2274ef885b36bdcdbd
Deleted: sha256:d248ea9fcc2fa8efacbc6104a9f0ecdf012cba8b5705666af9d991f4149723cb
Deleted: sha256:32bf77d65a9aed5c4d70808f6829f196a1b59593d7638017fb43d38a5dae376a
Deleted: sha256:6585f340779e97f8567a2798f20f52d82727109b8fffa7afc7364861554de791
Build step 'Execute shell' marked build as failure
Not sending mail to unregistered user benjamin.hindman@gmail.com

Mime
View raw message