mesos-builds mailing list archives

Site index · List index
Message view « Date » · « Thread »
Top « Date » · « Thread »
From Apache Jenkins Server <jenk...@builds.apache.org>
Subject Build failed in Jenkins: Mesos-Reviewbot #18634
Date Sat, 29 Jul 2017 04:01:53 GMT
See <https://builds.apache.org/job/Mesos-Reviewbot/18634/display/redirect?page=changes>

Changes:

[mpark] Added MESOS-5187 to 1.3.1 CHANGELOG.

[mpark] Added MESOS-7252 to 1.3.1 CHANGELOG.

[mpark] Added MESOS-7728 to 1.3.1 CHANGELOG.

[mpark] Added MESOS-7830 to 1.3.1 CHANGELOG.

[mpark] Sorted the tickets in 1.3.1 CHANGELOG.

------------------------------------------
[...truncated 30.71 MB...]
I0729 04:01:46.134641  5101 containerizer.cpp:230] Using isolation: posix/cpu,posix/mem,filesystem/posix,network/cni,environment_secret
W0729 04:01:46.135716  5101 backend.cpp:76] Failed to create 'overlay' backend: OverlayBackend
requires root privileges
W0729 04:01:46.136123  5101 backend.cpp:76] Failed to create 'bind' backend: BindBackend requires
root privileges
I0729 04:01:46.136224  5101 provisioner.cpp:255] Using default backend 'copy'
I0729 04:01:46.143844  5127 slave.cpp:250] Mesos agent started on (795)@172.17.0.3:39859
I0729 04:01:46.143925  5127 slave.cpp:251] Flags at startup: --acls="" --appc_simple_discovery_uri_prefix="http://"
--appc_store_dir="/tmp/Endpoint_SlaveEndpointTest_AuthorizedRequest_2_LXINJ3/store/appc" --authenticate_http_readonly="true"
--authenticate_http_readwrite="true" --authenticatee="crammd5" --authentication_backoff_factor="1secs"
--authorizer="local" --cgroups_cpu_enable_pids_and_tids_count="false" --cgroups_enable_cfs="false"
--cgroups_hierarchy="/sys/fs/cgroup" --cgroups_limit_swap="false" --cgroups_root="mesos" --container_disk_watch_interval="15secs"
--containerizers="mesos" --credential="/tmp/Endpoint_SlaveEndpointTest_AuthorizedRequest_2_LXINJ3/credential"
--default_role="*" --disk_watch_interval="1mins" --docker="docker" --docker_kill_orphans="true"
--docker_registry="https://registry-1.docker.io" --docker_remove_delay="6hrs" --docker_socket="/var/run/docker.sock"
--docker_stop_timeout="0ns" --docker_store_dir="/tmp/Endpoint_SlaveEndpointTest_AuthorizedRequest_2_LXINJ3/store/docker"
--docker_volume_checkpoint_dir="/var/run/mesos/isolators/docker/volume" --enforce_container_disk_quota="false"
--executor_registration_timeout="1mins" --executor_reregistration_timeout="2secs" --executor_shutdown_grace_period="5secs"
--fetcher_cache_dir="/tmp/Endpoint_SlaveEndpointTest_AuthorizedRequest_2_LXINJ3/fetch" --fetcher_cache_size="2GB"
--frameworks_home="" --gc_delay="1weeks" --gc_disk_headroom="0.1" --hadoop_home="" --help="false"
--hostname_lookup="true" --http_command_executor="false" --http_credentials="/tmp/Endpoint_SlaveEndpointTest_AuthorizedRequest_2_LXINJ3/http_credentials"
--http_heartbeat_interval="30secs" --initialize_driver_logging="true" --isolation="posix/cpu,posix/mem"
--launcher="posix" --launcher_dir="/mesos/mesos-1.4.0/_build/src" --logbufsecs="0" --logging_level="INFO"
--max_completed_executors_per_framework="150" --oversubscribed_resources_interval="15secs"
--perf_duration="10secs" --perf_interval="1mins" --port="5051" --qos_correction_interval_min="0ns"
--quiet="false" --recover="reconnect" --recovery_timeout="15mins" --registration_backoff_factor="10ms"
--resources="cpus:2;gpus:0;mem:1024;disk:1024;ports:[31000-32000]" --revocable_cpu_low_priority="true"
--runtime_dir="/tmp/Endpoint_SlaveEndpointTest_AuthorizedRequest_2_LXINJ3" --sandbox_directory="/mnt/mesos/sandbox"
--strict="true" --switch_user="true" --systemd_enable_support="true" --systemd_runtime_directory="/run/systemd/system"
--version="false" --work_dir="/tmp/Endpoint_SlaveEndpointTest_AuthorizedRequest_2_gkTACS"
I0729 04:01:46.144706  5127 credentials.hpp:86] Loading credential for authentication from
'/tmp/Endpoint_SlaveEndpointTest_AuthorizedRequest_2_LXINJ3/credential'
I0729 04:01:46.144995  5127 slave.cpp:283] Agent using credential for: test-principal
I0729 04:01:46.145043  5127 credentials.hpp:37] Loading credentials for authentication from
'/tmp/Endpoint_SlaveEndpointTest_AuthorizedRequest_2_LXINJ3/http_credentials'
I0729 04:01:46.145489  5127 http.cpp:993] Creating default 'basic' HTTP authenticator for
realm 'mesos-agent-readonly'
I0729 04:01:46.145993  5127 http.cpp:993] Creating default 'basic' HTTP authenticator for
realm 'mesos-agent-readwrite'
I0729 04:01:46.148572  5127 slave.cpp:565] Agent resources: [{"name":"cpus","scalar":{"value":2.0},"type":"SCALAR"},{"name":"mem","scalar":{"value":1024.0},"type":"SCALAR"},{"name":"disk","scalar":{"value":1024.0},"type":"SCALAR"},{"name":"ports","ranges":{"range":[{"begin":31000,"end":32000}]},"type":"RANGES"}]
I0729 04:01:46.149037  5127 slave.cpp:573] Agent attributes: [  ]
I0729 04:01:46.149062  5127 slave.cpp:582] Agent hostname: a6e3f910d20d
I0729 04:01:46.149493  5123 status_update_manager.cpp:177] Pausing sending status updates
I0729 04:01:46.151794  5122 state.cpp:64] Recovering state from '/tmp/Endpoint_SlaveEndpointTest_AuthorizedRequest_2_gkTACS/meta'
I0729 04:01:46.152468  5123 status_update_manager.cpp:203] Recovering status update manager
I0729 04:01:46.152937  5123 containerizer.cpp:582] Recovering containerizer
I0729 04:01:46.156103  5121 provisioner.cpp:416] Provisioner recovery complete
I0729 04:01:46.156980  5123 slave.cpp:6207] Finished recovery
I0729 04:01:46.158035  5123 slave.cpp:6389] Querying resource estimator for oversubscribable
resources
I0729 04:01:46.158601  5123 slave.cpp:6403] Received oversubscribable resources {} from the
resource estimator
I0729 04:01:46.164353  5127 process.cpp:3836] Handling HTTP event for process 'slave(795)'
with path: '/slave(795)/containers'
I0729 04:01:46.167691  5127 http.cpp:1133] HTTP GET for /slave(795)/containers from 172.17.0.3:52808
I0729 04:01:46.167840  5127 http.cpp:957] Authorizing principal 'test-principal' to GET the
'/containers' endpoint
I0729 04:01:46.177278  5101 slave.cpp:843] Agent terminating
[       OK ] Endpoint/SlaveEndpointTest.AuthorizedRequest/2 (139 ms)
[ RUN      ] Endpoint/SlaveEndpointTest.UnauthorizedRequest/0
I0729 04:01:46.272066  5101 containerizer.cpp:230] Using isolation: posix/cpu,posix/mem,filesystem/posix,network/cni,environment_secret
W0729 04:01:46.273119  5101 backend.cpp:76] Failed to create 'overlay' backend: OverlayBackend
requires root privileges
W0729 04:01:46.273330  5101 backend.cpp:76] Failed to create 'bind' backend: BindBackend requires
root privileges
I0729 04:01:46.273388  5101 provisioner.cpp:255] Using default backend 'copy'
I0729 04:01:46.281082  5127 slave.cpp:250] Mesos agent started on (796)@172.17.0.3:39859
I0729 04:01:46.281249  5127 slave.cpp:251] Flags at startup: --acls="" --appc_simple_discovery_uri_prefix="http://"
--appc_store_dir="/tmp/Endpoint_SlaveEndpointTest_UnauthorizedRequest_0_pyMPlN/store/appc"
--authenticate_http_readonly="true" --authenticate_http_readwrite="true" --authenticatee="crammd5"
--authentication_backoff_factor="1secs" --authorizer="local" --cgroups_cpu_enable_pids_and_tids_count="false"
--cgroups_enable_cfs="false" --cgroups_hierarchy="/sys/fs/cgroup" --cgroups_limit_swap="false"
--cgroups_root="mesos" --container_disk_watch_interval="15secs" --containerizers="mesos" --credential="/tmp/Endpoint_SlaveEndpointTest_UnauthorizedRequest_0_pyMPlN/credential"
--default_role="*" --disk_watch_interval="1mins" --docker="docker" --docker_kill_orphans="true"
--docker_registry="https://registry-1.docker.io" --docker_remove_delay="6hrs" --docker_socket="/var/run/docker.sock"
--docker_stop_timeout="0ns" --docker_store_dir="/tmp/Endpoint_SlaveEndpointTest_UnauthorizedRequest_0_pyMPlN/store/docker"
--docker_volume_checkpoint_dir="/var/run/mesos/isolators/docker/volume" --enforce_container_disk_quota="false"
--executor_registration_timeout="1mins" --executor_reregistration_timeout="2secs" --executor_shutdown_grace_period="5secs"
--fetcher_cache_dir="/tmp/Endpoint_SlaveEndpointTest_UnauthorizedRequest_0_pyMPlN/fetch" --fetcher_cache_size="2GB"
--frameworks_home="" --gc_delay="1weeks" --gc_disk_headroom="0.1" --hadoop_home="" --help="false"
--hostname_lookup="true" --http_command_executor="false" --http_credentials="/tmp/Endpoint_SlaveEndpointTest_UnauthorizedRequest_0_pyMPlN/http_credentials"
--http_heartbeat_interval="30secs" --initialize_driver_logging="true" --isolation="posix/cpu,posix/mem"
--launcher="posix" --launcher_dir="/mesos/mesos-1.4.0/_build/src" --logbufsecs="0" --logging_level="INFO"
--max_completed_executors_per_framework="150" --oversubscribed_resources_interval="15secs"
--perf_duration="10secs" --perf_interval="1mins" --port="5051" --qos_correction_interval_min="0ns"
--quiet="false" --recover="reconnect" --recovery_timeout="15mins" --registration_backoff_factor="10ms"
--resources="cpus:2;gpus:0;mem:1024;disk:1024;ports:[31000-32000]" --revocable_cpu_low_priority="true"
--runtime_dir="/tmp/Endpoint_SlaveEndpointTest_UnauthorizedRequest_0_pyMPlN" --sandbox_directory="/mnt/mesos/sandbox"
--strict="true" --switch_user="true" --systemd_enable_support="true" --systemd_runtime_directory="/run/systemd/system"
--version="false" --work_dir="/tmp/Endpoint_SlaveEndpointTest_UnauthorizedRequest_0_KV3fSB"
I0729 04:01:46.282176  5127 credentials.hpp:86] Loading credential for authentication from
'/tmp/Endpoint_SlaveEndpointTest_UnauthorizedRequest_0_pyMPlN/credential'
I0729 04:01:46.282706  5127 slave.cpp:283] Agent using credential for: test-principal
I0729 04:01:46.282790  5127 credentials.hpp:37] Loading credentials for authentication from
'/tmp/Endpoint_SlaveEndpointTest_UnauthorizedRequest_0_pyMPlN/http_credentials'
I0729 04:01:46.283426  5127 http.cpp:993] Creating default 'basic' HTTP authenticator for
realm 'mesos-agent-readonly'
I0729 04:01:46.283910  5127 http.cpp:993] Creating default 'basic' HTTP authenticator for
realm 'mesos-agent-readwrite'
I0729 04:01:46.286695  5127 slave.cpp:565] Agent resources: [{"name":"cpus","scalar":{"value":2.0},"type":"SCALAR"},{"name":"mem","scalar":{"value":1024.0},"type":"SCALAR"},{"name":"disk","scalar":{"value":1024.0},"type":"SCALAR"},{"name":"ports","ranges":{"range":[{"begin":31000,"end":32000}]},"type":"RANGES"}]
I0729 04:01:46.287595  5127 slave.cpp:573] Agent attributes: [  ]
I0729 04:01:46.287708  5127 slave.cpp:582] Agent hostname: a6e3f910d20d
I0729 04:01:46.288226  5124 status_update_manager.cpp:177] Pausing sending status updates
I0729 04:01:46.291671  5127 state.cpp:64] Recovering state from '/tmp/Endpoint_SlaveEndpointTest_UnauthorizedRequest_0_KV3fSB/meta'
I0729 04:01:46.294208  5120 status_update_manager.cpp:203] Recovering status update manager
I0729 04:01:46.294742  5120 containerizer.cpp:582] Recovering containerizer
I0729 04:01:46.297935  5125 provisioner.cpp:416] Provisioner recovery complete
I0729 04:01:46.299463  5123 slave.cpp:6207] Finished recovery
I0729 04:01:46.300305  5123 slave.cpp:6389] Querying resource estimator for oversubscribable
resources
I0729 04:01:46.301633  5125 slave.cpp:6403] Received oversubscribable resources {} from the
resource estimator
I0729 04:01:46.309419  5125 process.cpp:3836] Handling HTTP event for process 'slave(796)'
with path: '/slave(796)/monitor/statistics'
I0729 04:01:46.312461  5126 http.cpp:1133] HTTP GET for /slave(796)/monitor/statistics from
172.17.0.3:52810
I0729 04:01:46.312610  5126 http.cpp:957] Authorizing principal 'test-principal' to GET the
'/monitor/statistics' endpoint
I0729 04:01:46.346067  5121 slave.cpp:843] Agent terminating
[       OK ] Endpoint/SlaveEndpointTest.UnauthorizedRequest/0 (105 ms)
[ RUN      ] Endpoint/SlaveEndpointTest.UnauthorizedRequest/1
I0729 04:01:46.377810  5101 containerizer.cpp:230] Using isolation: posix/cpu,posix/mem,filesystem/posix,network/cni,environment_secret
W0729 04:01:46.378777  5101 backend.cpp:76] Failed to create 'overlay' backend: OverlayBackend
requires root privileges
W0729 04:01:46.379084  5101 backend.cpp:76] Failed to create 'bind' backend: BindBackend requires
root privileges
I0729 04:01:46.379179  5101 provisioner.cpp:255] Using default backend 'copy'
I0729 04:01:46.386620  5123 slave.cpp:250] Mesos agent started on (797)@172.17.0.3:39859
I0729 04:01:46.386672  5123 slave.cpp:251] Flags at startup: --acls="" --appc_simple_discovery_uri_prefix="http://"
--appc_store_dir="/tmp/Endpoint_SlaveEndpointTest_UnauthorizedRequest_1_zNEgay/store/appc"
--authenticate_http_readonly="true" --authenticate_http_readwrite="true" --authenticatee="crammd5"
--authentication_backoff_factor="1secs" --authorizer="local" --cgroups_cpu_enable_pids_and_tids_count="false"
--cgroups_enable_cfs="false" --cgroups_hierarchy="/sys/fs/cgroup" --cgroups_limit_swap="false"
--cgroups_root="mesos" --container_disk_watch_interval="15secs" --containerizers="mesos" --credential="/tmp/Endpoint_SlaveEndpointTest_UnauthorizedRequest_1_zNEgay/credential"
--default_role="*" --disk_watch_interval="1mins" --docker="docker" --docker_kill_orphans="true"
--docker_registry="https://registry-1.docker.io" --docker_remove_delay="6hrs" --docker_socket="/var/run/docker.sock"
--docker_stop_timeout="0ns" --docker_store_dir="/tmp/Endpoint_SlaveEndpointTest_UnauthorizedRequest_1_zNEgay/store/docker"
--docker_volume_checkpoint_dir="/var/run/mesos/isolators/docker/volume" --enforce_container_disk_quota="false"
--executor_registration_timeout="1mins" --executor_reregistration_timeout="2secs" --executor_shutdown_grace_period="5secs"
--fetcher_cache_dir="/tmp/Endpoint_SlaveEndpointTest_UnauthorizedRequest_1_zNEgay/fetch" --fetcher_cache_size="2GB"
--frameworks_home="" --gc_delay="1weeks" --gc_disk_headroom="0.1" --hadoop_home="" --help="false"
--hostname_lookup="true" --http_command_executor="false" --http_credentials="/tmp/Endpoint_SlaveEndpointTest_UnauthorizedRequest_1_zNEgay/http_credentials"
--http_heartbeat_interval="30secs" --initialize_driver_logging="true" --isolation="posix/cpu,posix/mem"
--launcher="posix" --launcher_dir="/mesos/mesos-1.4.0/_build/src" --logbufsecs="0" --logging_level="INFO"
--max_completed_executors_per_framework="150" --oversubscribed_resources_interval="15secs"
--perf_duration="10secs" --perf_interval="1mins" --port="5051" --qos_correction_interval_min="0ns"
--quiet="false" --recover="reconnect" --recovery_timeout="15mins" --registration_backoff_factor="10ms"
--resources="cpus:2;gpus:0;mem:1024;disk:1024;ports:[31000-32000]" --revocable_cpu_low_priority="true"
--runtime_dir="/tmp/Endpoint_SlaveEndpointTest_UnauthorizedRequest_1_zNEgay" --sandbox_directory="/mnt/mesos/sandbox"
--strict="true" --switch_user="true" --systemd_enable_support="true" --systemd_runtime_directory="/run/systemd/system"
--version="false" --work_dir="/tmp/Endpoint_SlaveEndpointTest_UnauthorizedRequest_1_kaZzpm"
I0729 04:01:46.387624  5123 credentials.hpp:86] Loading credential for authentication from
'/tmp/Endpoint_SlaveEndpointTest_UnauthorizedRequest_1_zNEgay/credential'
I0729 04:01:46.388078  5123 slave.cpp:283] Agent using credential for: test-principal
I0729 04:01:46.388126  5123 credentials.hpp:37] Loading credentials for authentication from
'/tmp/Endpoint_SlaveEndpointTest_UnauthorizedRequest_1_zNEgay/http_credentials'
I0729 04:01:46.388712  5123 http.cpp:993] Creating default 'basic' HTTP authenticator for
realm 'mesos-agent-readonly'
I0729 04:01:46.389482  5123 http.cpp:993] Creating default 'basic' HTTP authenticator for
realm 'mesos-agent-readwrite'
I0729 04:01:46.392757  5123 slave.cpp:565] Agent resources: [{"name":"cpus","scalar":{"value":2.0},"type":"SCALAR"},{"name":"mem","scalar":{"value":1024.0},"type":"SCALAR"},{"name":"disk","scalar":{"value":1024.0},"type":"SCALAR"},{"name":"ports","ranges":{"range":[{"begin":31000,"end":32000}]},"type":"RANGES"}]
I0729 04:01:46.393229  5123 slave.cpp:573] Agent attributes: [  ]
I0729 04:01:46.393257  5123 slave.cpp:582] Agent hostname: a6e3f910d20d
I0729 04:01:46.393769  5120 status_update_manager.cpp:177] Pausing sending status updates
I0729 04:01:46.396780  5120 state.cpp:64] Recovering state from '/tmp/Endpoint_SlaveEndpointTest_UnauthorizedRequest_1_kaZzpm/meta'
I0729 04:01:46.398488  5123 status_update_manager.cpp:203] Recovering status update manager
I0729 04:01:46.398788  5123 containerizer.cpp:582] Recovering containerizer
I0729 04:01:46.403208  5121 provisioner.cpp:416] Provisioner recovery complete
I0729 04:01:46.404292  5121 slave.cpp:6207] Finished recovery
I0729 04:01:46.405680  5121 slave.cpp:6389] Querying resource estimator for oversubscribable
resources
I0729 04:01:46.406688  5120 slave.cpp:6403] Received oversubscribable resources {} from the
resource estimator
I0729 04:01:46.412581  5126 process.cpp:3836] Handling HTTP event for process 'slave(797)'
with path: '/slave(797)/monitor/statistics.json'
I0729 04:01:46.415691  5121 http.cpp:1133] HTTP GET for /slave(797)/monitor/statistics.json
from 172.17.0.3:52812
I0729 04:01:46.415992  5121 http.cpp:957] Authorizing principal 'test-principal' to GET the
'/monitor/statistics.json' endpoint
I0729 04:01:46.421382  5101 slave.cpp:843] Agent terminating
[       OK ] Endpoint/SlaveEndpointTest.UnauthorizedRequest/1 (109 ms)
[ RUN      ] Endpoint/SlaveEndpointTest.UnauthorizedRequest/2
I0729 04:01:46.487895  5101 containerizer.cpp:230] Using isolation: posix/cpu,posix/mem,filesystem/posix,network/cni,environment_secret
W0729 04:01:46.489007  5101 backend.cpp:76] Failed to create 'overlay' backend: OverlayBackend
requires root privileges
W0729 04:01:46.489478  5101 backend.cpp:76] Failed to create 'bind' backend: BindBackend requires
root privileges
I0729 04:01:46.489748  5101 provisioner.cpp:255] Using default backend 'copy'
I0729 04:01:46.497045  5124 slave.cpp:250] Mesos agent started on (798)@172.17.0.3:39859
I0729 04:01:46.497140  5124 slave.cpp:251] Flags at startup: --acls="" --appc_simple_discovery_uri_prefix="http://"
--appc_store_dir="/tmp/Endpoint_SlaveEndpointTest_UnauthorizedRequest_2_r75P6j/store/appc"
--authenticate_http_readonly="true" --authenticate_http_readwrite="true" --authenticatee="crammd5"
--authentication_backoff_factor="1secs" --authorizer="local" --cgroups_cpu_enable_pids_and_tids_count="false"
--cgroups_enable_cfs="false" --cgroups_hierarchy="/sys/fs/cgroup" --cgroups_limit_swap="false"
--cgroups_root="mesos" --container_disk_watch_interval="15secs" --containerizers="mesos" --credential="/tmp/Endpoint_SlaveEndpointTest_UnauthorizedRequest_2_r75P6j/credential"
--default_role="*" --disk_watch_interval="1mins" --docker="docker" --docker_kill_orphans="true"
--docker_registry="https://registry-1.docker.io" --docker_remove_delay="6hrs" --docker_socket="/var/run/docker.sock"
--docker_stop_timeout="0ns" --docker_store_dir="/tmp/Endpoint_SlaveEndpointTest_UnauthorizedRequest_2_r75P6j/store/docker"
--docker_volume_checkpoint_dir="/var/run/mesos/isolators/docker/volume" --enforce_container_disk_quota="false"
--executor_registration_timeout="1mins" --executor_reregistration_timeout="2secs" --executor_shutdown_grace_period="5secs"
--fetcher_cache_dir="/tmp/Endpoint_SlaveEndpointTest_UnauthorizedRequest_2_r75P6j/fetch" --fetcher_cache_size="2GB"
--frameworks_home="" --gc_delay="1weeks" --gc_disk_headroom="0.1" --hadoop_home="" --help="false"
--hostname_lookup="true" --http_command_executor="false" --http_credentials="/tmp/Endpoint_SlaveEndpointTest_UnauthorizedRequest_2_r75P6j/http_credentials"
--http_heartbeat_interval="30secs" --initialize_driver_logging="true" --isolation="posix/cpu,posix/mem"
--launcher="posix" --launcher_dir="/mesos/mesos-1.4.0/_build/src" --logbufsecs="0" --logging_level="INFO"
--max_completed_executors_per_framework="150" --oversubscribed_resources_interval="15secs"
--perf_duration="10secs" --perf_interval="1mins" --port="5051" --qos_correction_interval_min="0ns"
--quiet="false" --recover="reconnect" --recovery_timeout="15mins" --registration_backoff_factor="10ms"
--resources="cpus:2;gpus:0;mem:1024;disk:1024;ports:[31000-32000]" --revocable_cpu_low_priority="true"
--runtime_dir="/tmp/Endpoint_SlaveEndpointTest_UnauthorizedRequest_2_r75P6j" --sandbox_directory="/mnt/mesos/sandbox"
--strict="true" --switch_user="true" --systemd_enable_support="true" --systemd_runtime_directory="/run/systemd/system"
--version="false" --work_dir="/tmp/Endpoint_SlaveEndpointTest_UnauthorizedRequest_2_8ncq47"
I0729 04:01:46.498414  5124 credentials.hpp:86] Loading credential for authentication from
'/tmp/Endpoint_SlaveEndpointTest_UnauthorizedRequest_2_r75P6j/credential'
I0729 04:01:46.498895  5124 slave.cpp:283] Agent using credential for: test-principal
I0729 04:01:46.499570  5124 credentials.hpp:37] Loading credentials for authentication from
'/tmp/Endpoint_SlaveEndpointTest_UnauthorizedRequest_2_r75P6j/http_credentials'
I0729 04:01:46.500351  5124 http.cpp:993] Creating default 'basic' HTTP authenticator for
realm 'mesos-agent-readonly'
I0729 04:01:46.500701  5124 http.cpp:993] Creating default 'basic' HTTP authenticator for
realm 'mesos-agent-readwrite'
I0729 04:01:46.503733  5124 slave.cpp:565] Agent resources: [{"name":"cpus","scalar":{"value":2.0},"type":"SCALAR"},{"name":"mem","scalar":{"value":1024.0},"type":"SCALAR"},{"name":"disk","scalar":{"value":1024.0},"type":"SCALAR"},{"name":"ports","ranges":{"range":[{"begin":31000,"end":32000}]},"type":"RANGES"}]
I0729 04:01:46.504528  5124 slave.cpp:573] Agent attributes: [  ]
I0729 04:01:46.504611  5124 slave.cpp:582] Agent hostname: a6e3f910d20d
I0729 04:01:46.505134  5121 status_update_manager.cpp:177] Pausing sending status updates
I0729 04:01:46.508039  5123 state.cpp:64] Recovering state from '/tmp/Endpoint_SlaveEndpointTest_UnauthorizedRequest_2_8ncq47/meta'
I0729 04:01:46.509027  5123 status_update_manager.cpp:203] Recovering status update manager
I0729 04:01:46.509768  5121 containerizer.cpp:582] Recovering containerizer
I0729 04:01:46.513831  5126 provisioner.cpp:416] Provisioner recovery complete
I0729 04:01:46.515014  5126 slave.cpp:6207] Finished recovery
I0729 04:01:46.516026  5126 slave.cpp:6389] Querying resource estimator for oversubscribable
resources
I0729 04:01:46.516865  5124 slave.cpp:6403] Received oversubscribable resources {} from the
resource estimator
I0729 04:01:46.523072  5125 process.cpp:3836] Handling HTTP event for process 'slave(798)'
with path: '/slave(798)/containers'
I0729 04:01:46.527336  5125 http.cpp:1133] HTTP GET for /slave(798)/containers from 172.17.0.3:52814
I0729 04:01:46.527957  5125 http.cpp:957] Authorizing principal 'test-principal' to GET the
'/containers' endpoint
I0729 04:01:46.544612  5101 slave.cpp:843] Agent terminating
[       OK ] Endpoint/SlaveEndpointTest.UnauthorizedRequest/2 (122 ms)
[ RUN      ] Endpoint/SlaveEndpointTest.NoAuthorizer/0
I0729 04:01:46.610427  5101 containerizer.cpp:230] Using isolation: posix/cpu,posix/mem,filesystem/posix,network/cni,environment_secret
W0729 04:01:46.611604  5101 backend.cpp:76] Failed to create 'overlay' backend: OverlayBackend
requires root privileges
W0729 04:01:46.611824  5101 backend.cpp:76] Failed to create 'bind' backend: BindBackend requires
root privileges
I0729 04:01:46.612341  5101 provisioner.cpp:255] Using default backend 'copy'
I0729 04:01:46.616684  5101 cluster.cpp:448] Creating default 'local' authorizer
I0729 04:01:46.620582  5120 slave.cpp:250] Mesos agent started on (799)@172.17.0.3:39859
I0729 04:01:46.620828  5120 slave.cpp:251] Flags at startup: --acls="" --appc_simple_discovery_uri_prefix="http://"
--appc_store_dir="/tmp/Endpoint_SlaveEndpointTest_NoAuthorizer_0_bXJUi7/store/appc" --authenticate_http_readonly="true"
--authenticate_http_readwrite="true" --authenticatee="crammd5" --authentication_backoff_factor="1secs"
--authorizer="local" --cgroups_cpu_enable_pids_and_tids_count="false" --cgroups_enable_cfs="false"
--cgroups_hierarchy="/sys/fs/cgroup" --cgroups_limit_swap="false" --cgroups_root="mesos" --container_disk_watch_interval="15secs"
--containerizers="mesos" --credential="/tmp/Endpoint_SlaveEndpointTest_NoAuthorizer_0_bXJUi7/credential"
--default_role="*" --disk_watch_interval="1mins" --docker="docker" --docker_kill_orphans="true"
--docker_registry="https://registry-1.docker.io" --docker_remove_delay="6hrs" --docker_socket="/var/run/docker.sock"
--docker_stop_timeout="0ns" --docker_store_dir="/tmp/Endpoint_SlaveEndpointTest_NoAuthorizer_0_bXJUi7/store/docker"
--docker_volume_checkpoint_dir="/var/run/mesos/isolators/docker/volume" --enforce_container_disk_quota="false"
--executor_registration_timeout="1mins" --executor_reregistration_timeout="2secs" --executor_shutdown_grace_period="5secs"
--fetcher_cache_dir="/tmp/Endpoint_SlaveEndpointTest_NoAuthorizer_0_bXJUi7/fetch" --fetcher_cache_size="2GB"
--frameworks_home="" --gc_delay="1weeks" --gc_disk_headroom="0.1" --hadoop_home="" --help="false"
--hostname_lookup="true" --http_command_executor="false" --http_credentials="/tmp/Endpoint_SlaveEndpointTest_NoAuthorizer_0_bXJUi7/http_credentials"
--http_heartbeat_interval="30secs" --initialize_driver_logging="true" --isolation="posix/cpu,posix/mem"
--launcher="posix" --launcher_dir="/mesos/mesos-1.4.0/_build/src" --logbufsecs="0" --logging_level="INFO"
--max_completed_executors_per_framework="150" --oversubscribed_resources_interval="15secs"
--perf_duration="10secs" --perf_interval="1mins" --port="5051" --qos_correction_interval_min="0ns"
--quiet="false" --recover="reconnect" --recovery_timeout="15mins" --registration_backoff_factor="10ms"
--resources="cpus:2;gpus:0;mem:1024;disk:1024;ports:[31000-32000]" --revocable_cpu_low_priority="true"
--runtime_dir="/tmp/Endpoint_SlaveEndpointTest_NoAuthorizer_0_bXJUi7" --sandbox_directory="/mnt/mesos/sandbox"
--strict="true" --switch_user="true" --systemd_enable_support="true" --systemd_runtime_directory="/run/systemd/system"
--version="false" --work_dir="/tmp/Endpoint_SlaveEndpointTest_NoAuthorizer_0_4PyEWU"
I0729 04:01:46.622076  5120 credentials.hpp:86] Loading credential for authentication from
'/tmp/Endpoint_SlaveEndpointTest_NoAuthorizer_0_bXJUi7/credential'
I0729 04:01:46.622722  5120 slave.cpp:283] Agent using credential for: test-principal
I0729 04:01:46.623167  5120 credentials.hpp:37] Loading credentials for authentication from
'/tmp/Endpoint_SlaveEndpointTest_NoAuthorizer_0_bXJUi7/http_credentials'
I0729 04:01:46.624042  5120 http.cpp:993] Creating default 'basic' HTTP authenticator for
realm 'mesos-agent-readonly'
I0729 04:01:46.624884  5120 http.cpp:993] Creating default 'basic' HTTP authenticator for
realm 'mesos-agent-readwrite'
I0729 04:01:46.628162  5120 slave.cpp:565] Agent resources: [{"name":"cpus","scalar":{"value":2.0},"type":"SCALAR"},{"name":"mem","scalar":{"value":1024.0},"type":"SCALAR"},{"name":"disk","scalar":{"value":1024.0},"type":"SCALAR"},{"name":"ports","ranges":{"range":[{"begin":31000,"end":32000}]},"type":"RANGES"}]
I0729 04:01:46.629153  5120 slave.cpp:573] Agent attributes: [  ]
I0729 04:01:46.629973  5120 slave.cpp:582] Agent hostname: a6e3f910d20d
I0729 04:01:46.631268  5121 status_update_manager.cpp:177] Pausing sending status updates
I0729 04:01:46.633618  5125 state.cpp:64] Recovering state from '/tmp/Endpoint_SlaveEndpointTest_NoAuthorizer_0_4PyEWU/meta'
I0729 04:01:46.634378  5120 status_update_manager.cpp:203] Recovering status update manager
I0729 04:01:46.635006  5120 containerizer.cpp:582] Recovering containerizer
I0729 04:01:46.638886  5122 provisioner.cpp:416] Provisioner recovery complete
I0729 04:01:46.640110  5121 slave.cpp:6207] Finished recovery
I0729 04:01:46.646917  5121 slave.cpp:6389] Querying resource estimator for oversubscribable
resources
I0729 04:01:46.647562  5122 slave.cpp:6403] Received oversubscribable resources {} from the
resource estimator
I0729 04:01:46.654168  5121 process.cpp:3836] Handling HTTP event for process 'slave(799)'
with path: '/slave(799)/monitor/statistics'
I0729 04:01:46.657860  5122 http.cpp:1133] HTTP GET for /slave(799)/monitor/statistics from
172.17.0.3:52816
I0729 04:01:46.658299  5122 http.cpp:957] Authorizing principal 'test-principal' to GET the
'/monitor/statistics' endpoint
I0729 04:01:46.677079  5126 slave.cpp:843] Agent terminating
[       OK ] Endpoint/SlaveEndpointTest.NoAuthorizer/0 (114 ms)
[ RUN      ] Endpoint/SlaveEndpointTest.NoAuthorizer/1
I0729 04:01:46.728340  5101 containerizer.cpp:230] Using isolation: posix/cpu,posix/mem,filesystem/posix,network/cni,environment_secret
W0729 04:01:46.729584  5101 backend.cpp:76] Failed to create 'overlay' backend: OverlayBackend
requires root privileges
W0729 04:01:46.730088  5101 backend.cpp:76] Failed to create 'bind' backend: BindBackend requires
root privileges
I0729 04:01:46.730417  5101 provisioner.cpp:255] Using default backend 'copy'
I0729 04:01:46.734532  5101 cluster.cpp:448] Creating default 'local' authorizer
I0729 04:01:46.738298  5122 slave.cpp:250] Mesos agent started on (800)@172.17.0.3:39859
I0729 04:01:46.738348  5122 slave.cpp:251] Flags at startup: --acls="" --appc_simple_discovery_uri_prefix="http://"
--appc_store_dir="/tmp/Endpoint_SlaveEndpointTest_NoAuthorizer_1_fBCiKV/store/appc" --authenticate_http_readonly="true"
--authenticate_http_readwrite="true" --authenticatee="crammd5" --authentication_backoff_factor="1secs"
--authorizer="local" --cgroups_cpu_enable_pids_and_tids_count="false" --cgroups_enable_cfs="false"
--cgroups_hierarchy="/sys/fs/cgroup" --cgroups_limit_swap="false" --cgroups_root="mesos" --container_disk_watch_interval="15secs"
--containerizers="mesos" --credential="/tmp/Endpoint_SlaveEndpointTest_NoAuthorizer_1_fBCiKV/credential"
--default_role="*" --disk_watch_interval="1mins" --docker="docker" --docker_kill_orphans="true"
--docker_registry="https://registry-1.docker.io" --docker_remove_delay="6hrs" --docker_socket="/var/run/docker.sock"
--docker_stop_timeout="0ns" --docker_store_dir="/tmp/Endpoint_SlaveEndpointTest_NoAuthorizer_1_fBCiKV/store/docker"
--docker_volume_checkpoint_dir="/var/run/mesos/isolators/docker/volume" --enforce_container_disk_quota="false"
--executor_registration_timeout="1mins" --executor_reregistration_timeout="2secs" --executor_shutdown_grace_period="5secs"
--fetcher_cache_dir="/tmp/Endpoint_SlaveEndpointTest_NoAuthorizer_1_fBCiKV/fetch" --fetcher_cache_size="2GB"
--frameworks_home="" --gc_delay="1weeks" --gc_disk_headroom="0.1" --hadoop_home="" --help="false"
--hostname_lookup="true" --http_command_executor="false" --http_credentials="/tmp/Endpoint_SlaveEndpointTest_NoAuthorizer_1_fBCiKV/http_credentials"
--http_heartbeat_interval="30secs" --initialize_driver_logging="true" --isolation="posix/cpu,posix/mem"
--launcher="posix" --launcher_dir="/mesos/mesos-1.4.0/_build/src" --logbufsecs="0" --logging_level="INFO"
--max_completed_executors_per_framework="150" --oversubscribed_resources_interval="15secs"
--perf_duration="10secs" --perf_interval="1mins" --port="5051" --qos_correction_interval_min="0ns"
--quiet="false" --recover="reconnect" --recovery_timeout="15mins" --registration_backoff_factor="10ms"
--resources="cpus:2;gpus:0;mem:1024;disk:1024;ports:[31000-32000]" --revocable_cpu_low_priority="true"
--runtime_dir="/tmp/Endpoint_SlaveEndpointTest_NoAuthorizer_1_fBCiKV" --sandbox_directory="/mnt/mesos/sandbox"
--strict="true" --switch_user="true" --systemd_enable_support="true" --systemd_runtime_directory="/run/systemd/system"
--version="false" --work_dir="/tmp/Endpoint_SlaveEndpointTest_NoAuthorizer_1_6KIc5I"
I0729 04:01:46.739588  5122 credentials.hpp:86] Loading credential for authentication from
'/tmp/Endpoint_SlaveEndpointTest_NoAuthorizer_1_fBCiKV/credential'
I0729 04:01:46.740427  5122 slave.cpp:283] Agent using credential for: test-principal
I0729 04:01:46.740476  5122 credentials.hpp:37] Loading credentials for authentication from
'/tmp/Endpoint_SlaveEndpointTest_NoAuthorizer_1_fBCiKV/http_credentials'
I0729 04:01:46.741334  5122 http.cpp:993] Creating default 'basic' HTTP authenticator for
realm 'mesos-agent-readonly'
I0729 04:01:46.741974  5122 http.cpp:993] Creating default 'basic' HTTP authenticator for
realm 'mesos-agent-readwrite'
I0729 04:01:46.745184  5122 slave.cpp:565] Agent resources: [{"name":"cpus","scalar":{"value":2.0},"type":"SCALAR"},{"name":"mem","scalar":{"value":1024.0},"type":"SCALAR"},{"name":"disk","scalar":{"value":1024.0},"type":"SCALAR"},{"name":"ports","ranges":{"range":[{"begin":31000,"end":32000}]},"type":"RANGES"}]
I0729 04:01:46.745676  5122 slave.cpp:573] Agent attributes: [  ]
I0729 04:01:46.747449  5122 slave.cpp:582] Agent hostname: a6e3f910d20d
I0729 04:01:46.749282  5120 status_update_manager.cpp:177] Pausing sending status updates
I0729 04:01:46.752650  5125 state.cpp:64] Recovering state from '/tmp/Endpoint_SlaveEndpointTest_NoAuthorizer_1_6KIc5I/meta'
I0729 04:01:46.754284  5126 status_update_manager.cpp:203] Recovering status update manager
I0729 04:01:46.754994  5124 containerizer.cpp:582] Recovering containerizer
I0729 04:01:46.759080  5124 provisioner.cpp:416] Provisioner recovery complete
I0729 04:01:46.760290  5126 slave.cpp:6207] Finished recovery
I0729 04:01:46.761325  5126 slave.cpp:6389] Querying resource estimator for oversubscribable
resources
I0729 04:01:46.762118  5126 slave.cpp:6403] Received oversubscribable resources {} from the
resource estimator
I0729 04:01:46.768373  5123 process.cpp:3836] Handling HTTP event for process 'slave(800)'
with path: '/slave(800)/monitor/statistics.json'
I0729 04:01:46.772496  5123 http.cpp:1133] HTTP GET for /slave(800)/monitor/statistics.json
from 172.17.0.3:52818
I0729 04:01:46.772747  5123 http.cpp:957] Authorizing principal 'test-principal' to GET the
'/monitor/statistics.json' endpoint
I0729 04:01:46.781445  5101 slave.cpp:843] Agent terminating
[       OK ] Endpoint/SlaveEndpointTest.NoAuthorizer/1 (133 ms)
[ RUN      ] Endpoint/SlaveEndpointTest.NoAuthorizer/2
I0729 04:01:46.859045  5101 containerizer.cpp:230] Using isolation: posix/cpu,posix/mem,filesystem/posix,network/cni,environment_secret
W0729 04:01:46.860070  5101 backend.cpp:76] Failed to create 'overlay' backend: OverlayBackend
requires root privileges
W0729 04:01:46.860431  5101 backend.cpp:76] Failed to create 'bind' backend: BindBackend requires
root privileges
I0729 04:01:46.860507  5101 provisioner.cpp:255] Using default backend 'copy'
I0729 04:01:46.864173  5101 cluster.cpp:448] Creating default 'local' authorizer
I0729 04:01:46.867561  5121 slave.cpp:250] Mesos agent started on (801)@172.17.0.3:39859
I0729 04:01:46.867606  5121 slave.cpp:251] Flags at startup: --acls="" --appc_simple_discovery_uri_prefix="http://"
--appc_store_dir="/tmp/Endpoint_SlaveEndpointTest_NoAuthorizer_2_9feUwL/store/appc" --authenticate_http_readonly="true"
--authenticate_http_readwrite="true" --authenticatee="crammd5" --authentication_backoff_factor="1secs"
--authorizer="local" --cgroups_cpu_enable_pids_and_tids_count="false" --cgroups_enable_cfs="false"
--cgroups_hierarchy="/sys/fs/cgroup" --cgroups_limit_swap="false" --cgroups_root="mesos" --container_disk_watch_interval="15secs"
--containerizers="mesos" --credential="/tmp/Endpoint_SlaveEndpointTest_NoAuthorizer_2_9feUwL/credential"
--default_role="*" --disk_watch_interval="1mins" --docker="docker" --docker_kill_orphans="true"
--docker_registry="https://registry-1.docker.io" --docker_remove_delay="6hrs" --docker_socket="/var/run/docker.sock"
--docker_stop_timeout="0ns" --docker_store_dir="/tmp/Endpoint_SlaveEndpointTest_NoAuthorizer_2_9feUwL/store/docker"
--docker_volume_checkpoint_dir="/var/run/mesos/isolators/docker/volume" --enforce_container_disk_quota="false"
--executor_registration_timeout="1mins" --executor_reregistration_timeout="2secs" --executor_shutdown_grace_period="5secs"
--fetcher_cache_dir="/tmp/Endpoint_SlaveEndpointTest_NoAuthorizer_2_9feUwL/fetch" --fetcher_cache_size="2GB"
--frameworks_home="" --gc_delay="1weeks" --gc_disk_headroom="0.1" --hadoop_home="" --help="false"
--hostname_lookup="true" --http_command_executor="false" --http_credentials="/tmp/Endpoint_SlaveEndpointTest_NoAuthorizer_2_9feUwL/http_credentials"
--http_heartbeat_interval="30secs" --initialize_driver_logging="true" --isolation="posix/cpu,posix/mem"
--launcher="posix" --launcher_dir="/mesos/mesos-1.4.0/_build/src" --logbufsecs="0" --logging_level="INFO"
--max_completed_executors_per_framework="150" --oversubscribed_resources_interval="15secs"
--perf_duration="10secs" --perf_interval="1mins" --port="5051" --qos_correction_interval_min="0ns"
--quiet="false" --recover="reconnect" --recovery_timeout="15mins" --registration_backoff_factor="10ms"
--resources="cpus:2;gpus:0;mem:1024;disk:1024;ports:[31000-32000]" --revocable_cpu_low_priority="true"
--runtime_dir="/tmp/Endpoint_SlaveEndpointTest_NoAuthorizer_2_9feUwL" --sandbox_directory="/mnt/mesos/sandbox"
--strict="true" --switch_user="true" --systemd_enable_support="true" --systemd_runtime_directory="/run/systemd/system"
--version="false" --work_dir="/tmp/Endpoint_SlaveEndpointTest_NoAuthorizer_2_OHEnwy"
I0729 04:01:46.874516  5121 credentials.hpp:86] Loading credential for authentication from
'/tmp/Endpoint_SlaveEndpointTest_NoAuthorizer_2_9feUwL/credential'
I0729 04:01:46.875067  5121 slave.cpp:283] Agent using credential for: test-principal
I0729 04:01:46.875115  5121 credentials.hpp:37] Loading credentials for authentication from
'/tmp/Endpoint_SlaveEndpointTest_NoAuthorizer_2_9feUwL/http_credentials'
I0729 04:01:46.875744  5121 http.cpp:993] Creating default 'basic' HTTP authenticator for
realm 'mesos-agent-readonly'
I0729 04:01:46.876225  5121 http.cpp:993] Creating default 'basic' HTTP authenticator for
realm 'mesos-agent-readwrite'
I0729 04:01:46.878912  5121 slave.cpp:565] Agent resources: [{"name":"cpus","scalar":{"value":2.0},"type":"SCALAR"},{"name":"mem","scalar":{"value":1024.0},"type":"SCALAR"},{"name":"disk","scalar":{"value":1024.0},"type":"SCALAR"},{"name":"ports","ranges":{"range":[{"begin":31000,"end":32000}]},"type":"RANGES"}]
I0729 04:01:46.879379  5121 slave.cpp:573] Agent attributes: [  ]
I0729 04:01:46.879406  5121 slave.cpp:582] Agent hostname: a6e3f910d20d
I0729 04:01:46.879959  5127 status_update_manager.cpp:177] Pausing sending status updates
I0729 04:01:46.882345  5123 state.cpp:64] Recovering state from '/tmp/Endpoint_SlaveEndpointTest_NoAuthorizer_2_OHEnwy/meta'
I0729 04:01:46.883586  5121 status_update_manager.cpp:203] Recovering status update manager
I0729 04:01:46.884321  5121 containerizer.cpp:582] Recovering containerizer
I0729 04:01:46.887698  5122 provisioner.cpp:416] Provisioner recovery complete
I0729 04:01:46.889236  5122 slave.cpp:6207] Finished recovery
I0729 04:01:46.890121  5122 slave.cpp:6389] Querying resource estimator for oversubscribable
resources
I0729 04:01:46.890931  5123 slave.cpp:6403] Received oversubscribable resources {} from the
resource estimator
I0729 04:01:46.897320  5121 process.cpp:3836] Handling HTTP event for process 'slave(801)'
with path: '/slave(801)/containers'
I0729 04:01:46.900645  5121 http.cpp:1133] HTTP GET for /slave(801)/containers from 172.17.0.3:52820
I0729 04:01:46.900794  5121 http.cpp:957] Authorizing principal 'test-principal' to GET the
'/containers' endpoint
I0729 04:01:46.914023  5124 slave.cpp:843] Agent terminating
[       OK ] Endpoint/SlaveEndpointTest.NoAuthorizer/2 (158 ms)
[----------] 9 tests from Endpoint/SlaveEndpointTest (1111 ms total)

[----------] Global test environment tear-down
[==========] 1649 tests from 181 test cases ran. (870605 ms total)
[  PASSED  ] 1645 tests.
[  FAILED  ] 4 tests, listed below:
[  FAILED  ] DefaultExecutorCheckTest.CommandCheckDeliveredAndReconciled
[  FAILED  ] DefaultExecutorCheckTest.CommandCheckStatusChange
[  FAILED  ] DefaultExecutorCheckTest.CommandCheckSeesParentsEnv
[  FAILED  ] DefaultExecutorCheckTest.CommandCheckSharesWorkDirWithTask

 4 FAILED TESTS
  YOU HAVE 20 DISABLED TESTS

I0729 04:01:47.153434  5128 process.cpp:1006] Failed to accept socket: future discarded
make[4]: *** [check-local] Error 1
make[4]: Leaving directory `/mesos/mesos-1.4.0/_build/src'
make[3]: *** [check-am] Error 2
make[3]: Leaving directory `/mesos/mesos-1.4.0/_build/src'
make[2]: *** [check] Error 2
make[2]: Leaving directory `/mesos/mesos-1.4.0/_build/src'
make[1]: *** [check-recursive] Error 1
make[1]: Leaving directory `/mesos/mesos-1.4.0/_build'
make: *** [distcheck] Error 1
+ docker rmi mesos-1501294277-16904
Untagged: mesos-1501294277-16904:latest
Deleted: sha256:abbc21229213e4b68708ca7ed2e9bfcfbaf77b206419b59d689db6d85f7a4730
Deleted: sha256:80a94ac30f540fd9ff6d2522a5183431a00819630b1e7319d1130ed1b6a37e4a
Deleted: sha256:84262df3626ac61961c2652a13c57a75b09a66ecb3ce13ba4505677fc1dcefe0
Deleted: sha256:668bc5188f538965c3e9363a085dd2993d30401ad0748abea22e0ea8f0af4595
Deleted: sha256:3c9699b96f216ac0069324994257282412e49a5b15fa4fc4df959aef2e06a576
Deleted: sha256:2e7b55ce45038b9d63ca510504f84392fb050b77f2bb71b30469c15631d9e333
Deleted: sha256:15ea92b5bc1d237fa13005a3ce5889fe379e637c68ac47efdb3d336ea9319c1c
Deleted: sha256:0da8729ca50ad5f14ad5ab41d685e9d673b887876ccfa74ef842da3c2315dd79
Deleted: sha256:31921647b8e65df1da3f7f7bbde82687f35fb8e4f47682ede9540c897dfcb880
Deleted: sha256:029e3b540b415a8b3a9182bc1007ee5979481b00f6d77868719b1c1d18bc0362
Deleted: sha256:ab76797ea58e1ab0d7311065ca6a47babbf1b58ba2bd84d32952a90a3a49379c
Deleted: sha256:a72d54ef9bc9497d36ab8788ef38016cd5887df72213b15dcdd02a69ba59a75e
Deleted: sha256:cb9b55a63f2fa5e3763610f5cbfe82614fa49fde85c603fd6cbf72a25afff50e
Deleted: sha256:080c483d9d8470aaf3cc0f8a2bc0fcd3d8c14d4a94ffecf8627a12f50a151bf6
Deleted: sha256:41a8174a0211ec375cb391971ee90d9011850231da9544a422b6306fee5bd6bb
Deleted: sha256:df03c57967ad218932a374b82d88f5bcc02110d418c209ac55272dacc95aa8fa
Deleted: sha256:12327be2341b272c13000b819c1e85b7f94e56a8d3dba455255ffe746eef956a
Deleted: sha256:f3ff4f0ad8117bdd8bdf77014d3676b444bf48e6aa06b5437e597b9d0039ebb2
Deleted: sha256:879dc2fd61e6e40c09bc754b4a67f0cd9601176491f8368d098967a2e95581ed
Deleted: sha256:35f62afb7aa6c0ff31365ccf62d604862960043c27c0575b2e632f70ccc09f66
Deleted: sha256:00e80c15f0c50dc08c756afcbfc6f63bc831826caabca6d8332a7f95620f1dbf
Deleted: sha256:cc138af4f565a03f4668e66e0fefb5405a6a110e3c47a3d0002d137b0756614c
Deleted: sha256:cc29acb20451732b574dd71d6646bc47164c0b2c8a1da013aa52757573f2146f
Deleted: sha256:22d7ae11cc1c4ae14d4ef34f96762ef578b7536123e780f0845712352709ad23
Build step 'Execute shell' marked build as failure

Mime
View raw message