mesos-builds mailing list archives

Site index · List index
Message view « Date » · « Thread »
Top « Date » · « Thread »
From Apache Jenkins Server <jenk...@builds.apache.org>
Subject Build failed in Jenkins: Mesos-Buildbot » autotools,gcc,--verbose --enable-libevent --enable-ssl,GLOG_v=1 MESOS_VERBOSE=1,centos:7,(ubuntu)&&(!ubuntu-us1)&&(!ubuntu-eu2) #3898
Date Tue, 11 Jul 2017 15:37:42 GMT
See <https://builds.apache.org/job/Mesos-Buildbot/BUILDTOOL=autotools,COMPILER=gcc,CONFIGURATION=--verbose%20--enable-libevent%20--enable-ssl,ENVIRONMENT=GLOG_v=1%20MESOS_VERBOSE=1,OS=centos%3A7,label_exp=(ubuntu)&&(!ubuntu-us1)&&(!ubuntu-eu2)/3898/display/redirect?page=changes>

Changes:

[alexander] Enabled filtering of reservations.

------------------------------------------
[...truncated 30.94 MB...]
I0711 15:37:37.435137 29948 http.cpp:1116] HTTP GET for /slave(782)/containers from 172.17.0.6:42312
I0711 15:37:37.435220 29948 http.cpp:937] Authorizing principal 'test-principal' to GET the
'/containers' endpoint
I0711 15:37:37.438612 29941 slave.cpp:839] Agent terminating
[       OK ] Endpoint/SlaveEndpointTest.AuthorizedRequest/2 (35 ms)
[ RUN      ] Endpoint/SlaveEndpointTest.UnauthorizedRequest/0
I0711 15:37:37.453171  9210 containerizer.cpp:230] Using isolation: posix/cpu,posix/mem,filesystem/posix,network/cni,environment_secret
W0711 15:37:37.453685  9210 backend.cpp:76] Failed to create 'aufs' backend: AufsBackend requires
root privileges
W0711 15:37:37.453783  9210 backend.cpp:76] Failed to create 'bind' backend: BindBackend requires
root privileges
I0711 15:37:37.453817  9210 provisioner.cpp:255] Using default backend 'copy'
I0711 15:37:37.457161 29935 slave.cpp:250] Mesos agent started on (783)@172.17.0.6:35570
I0711 15:37:37.457186 29935 slave.cpp:251] Flags at startup: --acls="" --appc_simple_discovery_uri_prefix="http://"
--appc_store_dir="/tmp/Endpoint_SlaveEndpointTest_UnauthorizedRequest_0_F0Xvfq/store/appc"
--authenticate_http_executors="true" --authenticate_http_readonly="true" --authenticate_http_readwrite="true"
--authenticatee="crammd5" --authentication_backoff_factor="1secs" --authorizer="local" --cgroups_cpu_enable_pids_and_tids_count="false"
--cgroups_enable_cfs="false" --cgroups_hierarchy="/sys/fs/cgroup" --cgroups_limit_swap="false"
--cgroups_root="mesos" --container_disk_watch_interval="15secs" --containerizers="mesos" --credential="/tmp/Endpoint_SlaveEndpointTest_UnauthorizedRequest_0_F0Xvfq/credential"
--default_role="*" --disk_watch_interval="1mins" --docker="docker" --docker_kill_orphans="true"
--docker_registry="https://registry-1.docker.io" --docker_remove_delay="6hrs" --docker_socket="/var/run/docker.sock"
--docker_stop_timeout="0ns" --docker_store_dir="/tmp/Endpoint_SlaveEndpointTest_UnauthorizedRequest_0_F0Xvfq/store/docker"
--docker_volume_checkpoint_dir="/var/run/mesos/isolators/docker/volume" --enforce_container_disk_quota="false"
--executor_registration_timeout="1mins" --executor_reregistration_timeout="2secs" --executor_secret_key="/tmp/Endpoint_SlaveEndpointTest_UnauthorizedRequest_0_F0Xvfq/executor_secret_key"
--executor_shutdown_grace_period="5secs" --fetcher_cache_dir="/tmp/Endpoint_SlaveEndpointTest_UnauthorizedRequest_0_F0Xvfq/fetch"
--fetcher_cache_size="2GB" --frameworks_home="" --gc_delay="1weeks" --gc_disk_headroom="0.1"
--hadoop_home="" --help="false" --hostname_lookup="true" --http_command_executor="false" --http_credentials="/tmp/Endpoint_SlaveEndpointTest_UnauthorizedRequest_0_F0Xvfq/http_credentials"
--http_heartbeat_interval="30secs" --initialize_driver_logging="true" --isolation="posix/cpu,posix/mem"
--launcher="posix" --launcher_dir="/mesos/mesos-1.4.0/_build/src" --logbufsecs="0" --logging_level="INFO"
--max_completed_executors_per_framework="150" --oversubscribed_resources_interval="15secs"
--perf_duration="10secs" --perf_interval="1mins" --port="5051" --qos_correction_interval_min="0ns"
--quiet="false" --recover="reconnect" --recovery_timeout="15mins" --registration_backoff_factor="10ms"
--resources="cpus:2;gpus:0;mem:1024;disk:1024;ports:[31000-32000]" --revocable_cpu_low_priority="true"
--runtime_dir="/tmp/Endpoint_SlaveEndpointTest_UnauthorizedRequest_0_F0Xvfq" --sandbox_directory="/mnt/mesos/sandbox"
--strict="true" --switch_user="true" --systemd_enable_support="true" --systemd_runtime_directory="/run/systemd/system"
--version="false" --work_dir="/tmp/Endpoint_SlaveEndpointTest_UnauthorizedRequest_0_RugwaK"
I0711 15:37:37.457660 29935 credentials.hpp:86] Loading credential for authentication from
'/tmp/Endpoint_SlaveEndpointTest_UnauthorizedRequest_0_F0Xvfq/credential'
I0711 15:37:37.457813 29935 slave.cpp:283] Agent using credential for: test-principal
I0711 15:37:37.457837 29935 credentials.hpp:37] Loading credentials for authentication from
'/tmp/Endpoint_SlaveEndpointTest_UnauthorizedRequest_0_F0Xvfq/http_credentials'
I0711 15:37:37.458127 29935 http.cpp:976] Creating default 'basic' HTTP authenticator for
realm 'mesos-agent-executor'
I0711 15:37:37.458263 29935 http.cpp:997] Creating default 'jwt' HTTP authenticator for realm
'mesos-agent-executor'
I0711 15:37:37.458503 29935 http.cpp:976] Creating default 'basic' HTTP authenticator for
realm 'mesos-agent-readonly'
I0711 15:37:37.458608 29935 http.cpp:997] Creating default 'jwt' HTTP authenticator for realm
'mesos-agent-readonly'
I0711 15:37:37.458791 29935 http.cpp:976] Creating default 'basic' HTTP authenticator for
realm 'mesos-agent-readwrite'
I0711 15:37:37.458899 29935 http.cpp:997] Creating default 'jwt' HTTP authenticator for realm
'mesos-agent-readwrite'
I0711 15:37:37.460350 29935 slave.cpp:565] Agent resources: [{"name":"cpus","scalar":{"value":2.0},"type":"SCALAR"},{"name":"mem","scalar":{"value":1024.0},"type":"SCALAR"},{"name":"disk","scalar":{"value":1024.0},"type":"SCALAR"},{"name":"ports","ranges":{"range":[{"begin":31000,"end":32000}]},"type":"RANGES"}]
I0711 15:37:37.460585 29935 slave.cpp:573] Agent attributes: [  ]
I0711 15:37:37.460600 29935 slave.cpp:578] Agent hostname: e6e65751bd04
I0711 15:37:37.460726 29942 status_update_manager.cpp:177] Pausing sending status updates
I0711 15:37:37.462236 29942 state.cpp:64] Recovering state from '/tmp/Endpoint_SlaveEndpointTest_UnauthorizedRequest_0_RugwaK/meta'
I0711 15:37:37.462641 29935 status_update_manager.cpp:203] Recovering status update manager
I0711 15:37:37.462846 29946 containerizer.cpp:582] Recovering containerizer
I0711 15:37:37.464747 29955 provisioner.cpp:416] Provisioner recovery complete
I0711 15:37:37.465332 29945 slave.cpp:6203] Finished recovery
I0711 15:37:37.465821 29945 slave.cpp:6385] Querying resource estimator for oversubscribable
resources
I0711 15:37:37.466065 29935 slave.cpp:6399] Received oversubscribable resources {} from the
resource estimator
I0711 15:37:37.468183 29954 process.cpp:3820] Handling HTTP event for process 'slave(783)'
with path: '/slave(783)/monitor/statistics'
I0711 15:37:37.470319 29948 http.cpp:1116] HTTP GET for /slave(783)/monitor/statistics from
172.17.0.6:42314
I0711 15:37:37.470398 29948 http.cpp:937] Authorizing principal 'test-principal' to GET the
'/monitor/statistics' endpoint
I0711 15:37:37.472462 29951 slave.cpp:839] Agent terminating
[       OK ] Endpoint/SlaveEndpointTest.UnauthorizedRequest/0 (31 ms)
[ RUN      ] Endpoint/SlaveEndpointTest.UnauthorizedRequest/1
I0711 15:37:37.485080  9210 containerizer.cpp:230] Using isolation: posix/cpu,posix/mem,filesystem/posix,network/cni,environment_secret
W0711 15:37:37.485605  9210 backend.cpp:76] Failed to create 'aufs' backend: AufsBackend requires
root privileges
W0711 15:37:37.485709  9210 backend.cpp:76] Failed to create 'bind' backend: BindBackend requires
root privileges
I0711 15:37:37.485743  9210 provisioner.cpp:255] Using default backend 'copy'
I0711 15:37:37.489241 29957 slave.cpp:250] Mesos agent started on (784)@172.17.0.6:35570
I0711 15:37:37.489284 29957 slave.cpp:251] Flags at startup: --acls="" --appc_simple_discovery_uri_prefix="http://"
--appc_store_dir="/tmp/Endpoint_SlaveEndpointTest_UnauthorizedRequest_1_zAaDP8/store/appc"
--authenticate_http_executors="true" --authenticate_http_readonly="true" --authenticate_http_readwrite="true"
--authenticatee="crammd5" --authentication_backoff_factor="1secs" --authorizer="local" --cgroups_cpu_enable_pids_and_tids_count="false"
--cgroups_enable_cfs="false" --cgroups_hierarchy="/sys/fs/cgroup" --cgroups_limit_swap="false"
--cgroups_root="mesos" --container_disk_watch_interval="15secs" --containerizers="mesos" --credential="/tmp/Endpoint_SlaveEndpointTest_UnauthorizedRequest_1_zAaDP8/credential"
--default_role="*" --disk_watch_interval="1mins" --docker="docker" --docker_kill_orphans="true"
--docker_registry="https://registry-1.docker.io" --docker_remove_delay="6hrs" --docker_socket="/var/run/docker.sock"
--docker_stop_timeout="0ns" --docker_store_dir="/tmp/Endpoint_SlaveEndpointTest_UnauthorizedRequest_1_zAaDP8/store/docker"
--docker_volume_checkpoint_dir="/var/run/mesos/isolators/docker/volume" --enforce_container_disk_quota="false"
--executor_registration_timeout="1mins" --executor_reregistration_timeout="2secs" --executor_secret_key="/tmp/Endpoint_SlaveEndpointTest_UnauthorizedRequest_1_zAaDP8/executor_secret_key"
--executor_shutdown_grace_period="5secs" --fetcher_cache_dir="/tmp/Endpoint_SlaveEndpointTest_UnauthorizedRequest_1_zAaDP8/fetch"
--fetcher_cache_size="2GB" --frameworks_home="" --gc_delay="1weeks" --gc_disk_headroom="0.1"
--hadoop_home="" --help="false" --hostname_lookup="true" --http_command_executor="false" --http_credentials="/tmp/Endpoint_SlaveEndpointTest_UnauthorizedRequest_1_zAaDP8/http_credentials"
--http_heartbeat_interval="30secs" --initialize_driver_logging="true" --isolation="posix/cpu,posix/mem"
--launcher="posix" --launcher_dir="/mesos/mesos-1.4.0/_build/src" --logbufsecs="0" --logging_level="INFO"
--max_completed_executors_per_framework="150" --oversubscribed_resources_interval="15secs"
--perf_duration="10secs" --perf_interval="1mins" --port="5051" --qos_correction_interval_min="0ns"
--quiet="false" --recover="reconnect" --recovery_timeout="15mins" --registration_backoff_factor="10ms"
--resources="cpus:2;gpus:0;mem:1024;disk:1024;ports:[31000-32000]" --revocable_cpu_low_priority="true"
--runtime_dir="/tmp/Endpoint_SlaveEndpointTest_UnauthorizedRequest_1_zAaDP8" --sandbox_directory="/mnt/mesos/sandbox"
--strict="true" --switch_user="true" --systemd_enable_support="true" --systemd_runtime_directory="/run/systemd/system"
--version="false" --work_dir="/tmp/Endpoint_SlaveEndpointTest_UnauthorizedRequest_1_LOTTFs"
I0711 15:37:37.489742 29957 credentials.hpp:86] Loading credential for authentication from
'/tmp/Endpoint_SlaveEndpointTest_UnauthorizedRequest_1_zAaDP8/credential'
I0711 15:37:37.489894 29957 slave.cpp:283] Agent using credential for: test-principal
I0711 15:37:37.489917 29957 credentials.hpp:37] Loading credentials for authentication from
'/tmp/Endpoint_SlaveEndpointTest_UnauthorizedRequest_1_zAaDP8/http_credentials'
I0711 15:37:37.490214 29957 http.cpp:976] Creating default 'basic' HTTP authenticator for
realm 'mesos-agent-executor'
I0711 15:37:37.490341 29957 http.cpp:997] Creating default 'jwt' HTTP authenticator for realm
'mesos-agent-executor'
I0711 15:37:37.490778 29957 http.cpp:976] Creating default 'basic' HTTP authenticator for
realm 'mesos-agent-readonly'
I0711 15:37:37.490953 29957 http.cpp:997] Creating default 'jwt' HTTP authenticator for realm
'mesos-agent-readonly'
I0711 15:37:37.491201 29957 http.cpp:976] Creating default 'basic' HTTP authenticator for
realm 'mesos-agent-readwrite'
I0711 15:37:37.491333 29957 http.cpp:997] Creating default 'jwt' HTTP authenticator for realm
'mesos-agent-readwrite'
I0711 15:37:37.492954 29957 slave.cpp:565] Agent resources: [{"name":"cpus","scalar":{"value":2.0},"type":"SCALAR"},{"name":"mem","scalar":{"value":1024.0},"type":"SCALAR"},{"name":"disk","scalar":{"value":1024.0},"type":"SCALAR"},{"name":"ports","ranges":{"range":[{"begin":31000,"end":32000}]},"type":"RANGES"}]
I0711 15:37:37.493196 29957 slave.cpp:573] Agent attributes: [  ]
I0711 15:37:37.493211 29957 slave.cpp:578] Agent hostname: e6e65751bd04
I0711 15:37:37.493338 29952 status_update_manager.cpp:177] Pausing sending status updates
I0711 15:37:37.494806 29946 state.cpp:64] Recovering state from '/tmp/Endpoint_SlaveEndpointTest_UnauthorizedRequest_1_LOTTFs/meta'
I0711 15:37:37.495463 29938 status_update_manager.cpp:203] Recovering status update manager
I0711 15:37:37.495774 29945 containerizer.cpp:582] Recovering containerizer
I0711 15:37:37.497717 29953 provisioner.cpp:416] Provisioner recovery complete
I0711 15:37:37.498155 29940 slave.cpp:6203] Finished recovery
I0711 15:37:37.498616 29940 slave.cpp:6385] Querying resource estimator for oversubscribable
resources
I0711 15:37:37.498903 29949 slave.cpp:6399] Received oversubscribable resources {} from the
resource estimator
I0711 15:37:37.501246 29950 process.cpp:3820] Handling HTTP event for process 'slave(784)'
with path: '/slave(784)/monitor/statistics.json'
I0711 15:37:37.503170 29954 http.cpp:1116] HTTP GET for /slave(784)/monitor/statistics.json
from 172.17.0.6:42316
I0711 15:37:37.503244 29954 http.cpp:937] Authorizing principal 'test-principal' to GET the
'/monitor/statistics.json' endpoint
I0711 15:37:37.505667 29952 slave.cpp:839] Agent terminating
[       OK ] Endpoint/SlaveEndpointTest.UnauthorizedRequest/1 (33 ms)
[ RUN      ] Endpoint/SlaveEndpointTest.UnauthorizedRequest/2
I0711 15:37:37.521842  9210 containerizer.cpp:230] Using isolation: posix/cpu,posix/mem,filesystem/posix,network/cni,environment_secret
W0711 15:37:37.522694  9210 backend.cpp:76] Failed to create 'aufs' backend: AufsBackend requires
root privileges
W0711 15:37:37.522843  9210 backend.cpp:76] Failed to create 'bind' backend: BindBackend requires
root privileges
I0711 15:37:37.522879  9210 provisioner.cpp:255] Using default backend 'copy'
I0711 15:37:37.528146 29937 slave.cpp:250] Mesos agent started on (785)@172.17.0.6:35570
I0711 15:37:37.528174 29937 slave.cpp:251] Flags at startup: --acls="" --appc_simple_discovery_uri_prefix="http://"
--appc_store_dir="/tmp/Endpoint_SlaveEndpointTest_UnauthorizedRequest_2_flHUJR/store/appc"
--authenticate_http_executors="true" --authenticate_http_readonly="true" --authenticate_http_readwrite="true"
--authenticatee="crammd5" --authentication_backoff_factor="1secs" --authorizer="local" --cgroups_cpu_enable_pids_and_tids_count="false"
--cgroups_enable_cfs="false" --cgroups_hierarchy="/sys/fs/cgroup" --cgroups_limit_swap="false"
--cgroups_root="mesos" --container_disk_watch_interval="15secs" --containerizers="mesos" --credential="/tmp/Endpoint_SlaveEndpointTest_UnauthorizedRequest_2_flHUJR/credential"
--default_role="*" --disk_watch_interval="1mins" --docker="docker" --docker_kill_orphans="true"
--docker_registry="https://registry-1.docker.io" --docker_remove_delay="6hrs" --docker_socket="/var/run/docker.sock"
--docker_stop_timeout="0ns" --docker_store_dir="/tmp/Endpoint_SlaveEndpointTest_UnauthorizedRequest_2_flHUJR/store/docker"
--docker_volume_checkpoint_dir="/var/run/mesos/isolators/docker/volume" --enforce_container_disk_quota="false"
--executor_registration_timeout="1mins" --executor_reregistration_timeout="2secs" --executor_secret_key="/tmp/Endpoint_SlaveEndpointTest_UnauthorizedRequest_2_flHUJR/executor_secret_key"
--executor_shutdown_grace_period="5secs" --fetcher_cache_dir="/tmp/Endpoint_SlaveEndpointTest_UnauthorizedRequest_2_flHUJR/fetch"
--fetcher_cache_size="2GB" --frameworks_home="" --gc_delay="1weeks" --gc_disk_headroom="0.1"
--hadoop_home="" --help="false" --hostname_lookup="true" --http_command_executor="false" --http_credentials="/tmp/Endpoint_SlaveEndpointTest_UnauthorizedRequest_2_flHUJR/http_credentials"
--http_heartbeat_interval="30secs" --initialize_driver_logging="true" --isolation="posix/cpu,posix/mem"
--launcher="posix" --launcher_dir="/mesos/mesos-1.4.0/_build/src" --logbufsecs="0" --logging_level="INFO"
--max_completed_executors_per_framework="150" --oversubscribed_resources_interval="15secs"
--perf_duration="10secs" --perf_interval="1mins" --port="5051" --qos_correction_interval_min="0ns"
--quiet="false" --recover="reconnect" --recovery_timeout="15mins" --registration_backoff_factor="10ms"
--resources="cpus:2;gpus:0;mem:1024;disk:1024;ports:[31000-32000]" --revocable_cpu_low_priority="true"
--runtime_dir="/tmp/Endpoint_SlaveEndpointTest_UnauthorizedRequest_2_flHUJR" --sandbox_directory="/mnt/mesos/sandbox"
--strict="true" --switch_user="true" --systemd_enable_support="true" --systemd_runtime_directory="/run/systemd/system"
--version="false" --work_dir="/tmp/Endpoint_SlaveEndpointTest_UnauthorizedRequest_2_1L41ub"
I0711 15:37:37.528619 29937 credentials.hpp:86] Loading credential for authentication from
'/tmp/Endpoint_SlaveEndpointTest_UnauthorizedRequest_2_flHUJR/credential'
I0711 15:37:37.528784 29937 slave.cpp:283] Agent using credential for: test-principal
I0711 15:37:37.528807 29937 credentials.hpp:37] Loading credentials for authentication from
'/tmp/Endpoint_SlaveEndpointTest_UnauthorizedRequest_2_flHUJR/http_credentials'
I0711 15:37:37.529114 29937 http.cpp:976] Creating default 'basic' HTTP authenticator for
realm 'mesos-agent-executor'
I0711 15:37:37.529223 29937 http.cpp:997] Creating default 'jwt' HTTP authenticator for realm
'mesos-agent-executor'
I0711 15:37:37.529569 29937 http.cpp:976] Creating default 'basic' HTTP authenticator for
realm 'mesos-agent-readonly'
I0711 15:37:37.529665 29937 http.cpp:997] Creating default 'jwt' HTTP authenticator for realm
'mesos-agent-readonly'
I0711 15:37:37.529970 29937 http.cpp:976] Creating default 'basic' HTTP authenticator for
realm 'mesos-agent-readwrite'
I0711 15:37:37.530083 29937 http.cpp:997] Creating default 'jwt' HTTP authenticator for realm
'mesos-agent-readwrite'
I0711 15:37:37.531591 29937 slave.cpp:565] Agent resources: [{"name":"cpus","scalar":{"value":2.0},"type":"SCALAR"},{"name":"mem","scalar":{"value":1024.0},"type":"SCALAR"},{"name":"disk","scalar":{"value":1024.0},"type":"SCALAR"},{"name":"ports","ranges":{"range":[{"begin":31000,"end":32000}]},"type":"RANGES"}]
I0711 15:37:37.531818 29937 slave.cpp:573] Agent attributes: [  ]
I0711 15:37:37.531834 29937 slave.cpp:578] Agent hostname: e6e65751bd04
I0711 15:37:37.531963 29946 status_update_manager.cpp:177] Pausing sending status updates
I0711 15:37:37.533898 29942 state.cpp:64] Recovering state from '/tmp/Endpoint_SlaveEndpointTest_UnauthorizedRequest_2_1L41ub/meta'
I0711 15:37:37.534250 29953 status_update_manager.cpp:203] Recovering status update manager
I0711 15:37:37.534605 29934 containerizer.cpp:582] Recovering containerizer
I0711 15:37:37.536617 29955 provisioner.cpp:416] Provisioner recovery complete
I0711 15:37:37.537185 29954 slave.cpp:6203] Finished recovery
I0711 15:37:37.537634 29954 slave.cpp:6385] Querying resource estimator for oversubscribable
resources
I0711 15:37:37.537945 29940 slave.cpp:6399] Received oversubscribable resources {} from the
resource estimator
I0711 15:37:37.540562 29957 process.cpp:3820] Handling HTTP event for process 'slave(785)'
with path: '/slave(785)/containers'
I0711 15:37:37.543051 29938 http.cpp:1116] HTTP GET for /slave(785)/containers from 172.17.0.6:42320
I0711 15:37:37.543134 29938 http.cpp:937] Authorizing principal 'test-principal' to GET the
'/containers' endpoint
I0711 15:37:37.545557 29957 slave.cpp:839] Agent terminating
[       OK ] Endpoint/SlaveEndpointTest.UnauthorizedRequest/2 (39 ms)
[ RUN      ] Endpoint/SlaveEndpointTest.NoAuthorizer/0
I0711 15:37:37.558060  9210 containerizer.cpp:230] Using isolation: posix/cpu,posix/mem,filesystem/posix,network/cni,environment_secret
W0711 15:37:37.558866  9210 backend.cpp:76] Failed to create 'aufs' backend: AufsBackend requires
root privileges
W0711 15:37:37.559031  9210 backend.cpp:76] Failed to create 'bind' backend: BindBackend requires
root privileges
I0711 15:37:37.559087  9210 provisioner.cpp:255] Using default backend 'copy'
I0711 15:37:37.561034  9210 cluster.cpp:448] Creating default 'local' authorizer
I0711 15:37:37.562805 29934 slave.cpp:250] Mesos agent started on (786)@172.17.0.6:35570
I0711 15:37:37.562845 29934 slave.cpp:251] Flags at startup: --acls="" --appc_simple_discovery_uri_prefix="http://"
--appc_store_dir="/tmp/Endpoint_SlaveEndpointTest_NoAuthorizer_0_JcOg1A/store/appc" --authenticate_http_executors="true"
--authenticate_http_readonly="true" --authenticate_http_readwrite="true" --authenticatee="crammd5"
--authentication_backoff_factor="1secs" --authorizer="local" --cgroups_cpu_enable_pids_and_tids_count="false"
--cgroups_enable_cfs="false" --cgroups_hierarchy="/sys/fs/cgroup" --cgroups_limit_swap="false"
--cgroups_root="mesos" --container_disk_watch_interval="15secs" --containerizers="mesos" --credential="/tmp/Endpoint_SlaveEndpointTest_NoAuthorizer_0_JcOg1A/credential"
--default_role="*" --disk_watch_interval="1mins" --docker="docker" --docker_kill_orphans="true"
--docker_registry="https://registry-1.docker.io" --docker_remove_delay="6hrs" --docker_socket="/var/run/docker.sock"
--docker_stop_timeout="0ns" --docker_store_dir="/tmp/Endpoint_SlaveEndpointTest_NoAuthorizer_0_JcOg1A/store/docker"
--docker_volume_checkpoint_dir="/var/run/mesos/isolators/docker/volume" --enforce_container_disk_quota="false"
--executor_registration_timeout="1mins" --executor_reregistration_timeout="2secs" --executor_secret_key="/tmp/Endpoint_SlaveEndpointTest_NoAuthorizer_0_JcOg1A/executor_secret_key"
--executor_shutdown_grace_period="5secs" --fetcher_cache_dir="/tmp/Endpoint_SlaveEndpointTest_NoAuthorizer_0_JcOg1A/fetch"
--fetcher_cache_size="2GB" --frameworks_home="" --gc_delay="1weeks" --gc_disk_headroom="0.1"
--hadoop_home="" --help="false" --hostname_lookup="true" --http_command_executor="false" --http_credentials="/tmp/Endpoint_SlaveEndpointTest_NoAuthorizer_0_JcOg1A/http_credentials"
--http_heartbeat_interval="30secs" --initialize_driver_logging="true" --isolation="posix/cpu,posix/mem"
--launcher="posix" --launcher_dir="/mesos/mesos-1.4.0/_build/src" --logbufsecs="0" --logging_level="INFO"
--max_completed_executors_per_framework="150" --oversubscribed_resources_interval="15secs"
--perf_duration="10secs" --perf_interval="1mins" --port="5051" --qos_correction_interval_min="0ns"
--quiet="false" --recover="reconnect" --recovery_timeout="15mins" --registration_backoff_factor="10ms"
--resources="cpus:2;gpus:0;mem:1024;disk:1024;ports:[31000-32000]" --revocable_cpu_low_priority="true"
--runtime_dir="/tmp/Endpoint_SlaveEndpointTest_NoAuthorizer_0_JcOg1A" --sandbox_directory="/mnt/mesos/sandbox"
--strict="true" --switch_user="true" --systemd_enable_support="true" --systemd_runtime_directory="/run/systemd/system"
--version="false" --work_dir="/tmp/Endpoint_SlaveEndpointTest_NoAuthorizer_0_9EsHGU"
I0711 15:37:37.563493 29934 credentials.hpp:86] Loading credential for authentication from
'/tmp/Endpoint_SlaveEndpointTest_NoAuthorizer_0_JcOg1A/credential'
I0711 15:37:37.563688 29934 slave.cpp:283] Agent using credential for: test-principal
I0711 15:37:37.563732 29934 credentials.hpp:37] Loading credentials for authentication from
'/tmp/Endpoint_SlaveEndpointTest_NoAuthorizer_0_JcOg1A/http_credentials'
I0711 15:37:37.564332 29934 http.cpp:976] Creating default 'basic' HTTP authenticator for
realm 'mesos-agent-executor'
I0711 15:37:37.564522 29934 http.cpp:997] Creating default 'jwt' HTTP authenticator for realm
'mesos-agent-executor'
I0711 15:37:37.564936 29934 http.cpp:976] Creating default 'basic' HTTP authenticator for
realm 'mesos-agent-readonly'
I0711 15:37:37.565057 29934 http.cpp:997] Creating default 'jwt' HTTP authenticator for realm
'mesos-agent-readonly'
I0711 15:37:37.565261 29934 http.cpp:976] Creating default 'basic' HTTP authenticator for
realm 'mesos-agent-readwrite'
I0711 15:37:37.565412 29934 http.cpp:997] Creating default 'jwt' HTTP authenticator for realm
'mesos-agent-readwrite'
I0711 15:37:37.566853 29934 slave.cpp:565] Agent resources: [{"name":"cpus","scalar":{"value":2.0},"type":"SCALAR"},{"name":"mem","scalar":{"value":1024.0},"type":"SCALAR"},{"name":"disk","scalar":{"value":1024.0},"type":"SCALAR"},{"name":"ports","ranges":{"range":[{"begin":31000,"end":32000}]},"type":"RANGES"}]
I0711 15:37:37.567087 29934 slave.cpp:573] Agent attributes: [  ]
I0711 15:37:37.567102 29934 slave.cpp:578] Agent hostname: e6e65751bd04
I0711 15:37:37.567241 29945 status_update_manager.cpp:177] Pausing sending status updates
I0711 15:37:37.568637 29939 state.cpp:64] Recovering state from '/tmp/Endpoint_SlaveEndpointTest_NoAuthorizer_0_9EsHGU/meta'
I0711 15:37:37.569031 29942 status_update_manager.cpp:203] Recovering status update manager
I0711 15:37:37.569242 29943 containerizer.cpp:582] Recovering containerizer
I0711 15:37:37.570581 29942 provisioner.cpp:416] Provisioner recovery complete
I0711 15:37:37.571089 29936 slave.cpp:6203] Finished recovery
I0711 15:37:37.571566 29936 slave.cpp:6385] Querying resource estimator for oversubscribable
resources
I0711 15:37:37.571808 29948 slave.cpp:6399] Received oversubscribable resources {} from the
resource estimator
I0711 15:37:37.573612 29935 process.cpp:3820] Handling HTTP event for process 'slave(786)'
with path: '/slave(786)/monitor/statistics'
I0711 15:37:37.575623 29947 http.cpp:1116] HTTP GET for /slave(786)/monitor/statistics from
172.17.0.6:42322
I0711 15:37:37.575726 29947 http.cpp:937] Authorizing principal 'test-principal' to GET the
'/monitor/statistics' endpoint
I0711 15:37:37.579215 29938 slave.cpp:839] Agent terminating
[       OK ] Endpoint/SlaveEndpointTest.NoAuthorizer/0 (34 ms)
[ RUN      ] Endpoint/SlaveEndpointTest.NoAuthorizer/1
I0711 15:37:37.591892  9210 containerizer.cpp:230] Using isolation: posix/cpu,posix/mem,filesystem/posix,network/cni,environment_secret
W0711 15:37:37.592404  9210 backend.cpp:76] Failed to create 'aufs' backend: AufsBackend requires
root privileges
W0711 15:37:37.592504  9210 backend.cpp:76] Failed to create 'bind' backend: BindBackend requires
root privileges
I0711 15:37:37.592535  9210 provisioner.cpp:255] Using default backend 'copy'
I0711 15:37:37.594389  9210 cluster.cpp:448] Creating default 'local' authorizer
I0711 15:37:37.596055 29954 slave.cpp:250] Mesos agent started on (787)@172.17.0.6:35570
I0711 15:37:37.596079 29954 slave.cpp:251] Flags at startup: --acls="" --appc_simple_discovery_uri_prefix="http://"
--appc_store_dir="/tmp/Endpoint_SlaveEndpointTest_NoAuthorizer_1_LFOMCk/store/appc" --authenticate_http_executors="true"
--authenticate_http_readonly="true" --authenticate_http_readwrite="true" --authenticatee="crammd5"
--authentication_backoff_factor="1secs" --authorizer="local" --cgroups_cpu_enable_pids_and_tids_count="false"
--cgroups_enable_cfs="false" --cgroups_hierarchy="/sys/fs/cgroup" --cgroups_limit_swap="false"
--cgroups_root="mesos" --container_disk_watch_interval="15secs" --containerizers="mesos" --credential="/tmp/Endpoint_SlaveEndpointTest_NoAuthorizer_1_LFOMCk/credential"
--default_role="*" --disk_watch_interval="1mins" --docker="docker" --docker_kill_orphans="true"
--docker_registry="https://registry-1.docker.io" --docker_remove_delay="6hrs" --docker_socket="/var/run/docker.sock"
--docker_stop_timeout="0ns" --docker_store_dir="/tmp/Endpoint_SlaveEndpointTest_NoAuthorizer_1_LFOMCk/store/docker"
--docker_volume_checkpoint_dir="/var/run/mesos/isolators/docker/volume" --enforce_container_disk_quota="false"
--executor_registration_timeout="1mins" --executor_reregistration_timeout="2secs" --executor_secret_key="/tmp/Endpoint_SlaveEndpointTest_NoAuthorizer_1_LFOMCk/executor_secret_key"
--executor_shutdown_grace_period="5secs" --fetcher_cache_dir="/tmp/Endpoint_SlaveEndpointTest_NoAuthorizer_1_LFOMCk/fetch"
--fetcher_cache_size="2GB" --frameworks_home="" --gc_delay="1weeks" --gc_disk_headroom="0.1"
--hadoop_home="" --help="false" --hostname_lookup="true" --http_command_executor="false" --http_credentials="/tmp/Endpoint_SlaveEndpointTest_NoAuthorizer_1_LFOMCk/http_credentials"
--http_heartbeat_interval="30secs" --initialize_driver_logging="true" --isolation="posix/cpu,posix/mem"
--launcher="posix" --launcher_dir="/mesos/mesos-1.4.0/_build/src" --logbufsecs="0" --logging_level="INFO"
--max_completed_executors_per_framework="150" --oversubscribed_resources_interval="15secs"
--perf_duration="10secs" --perf_interval="1mins" --port="5051" --qos_correction_interval_min="0ns"
--quiet="false" --recover="reconnect" --recovery_timeout="15mins" --registration_backoff_factor="10ms"
--resources="cpus:2;gpus:0;mem:1024;disk:1024;ports:[31000-32000]" --revocable_cpu_low_priority="true"
--runtime_dir="/tmp/Endpoint_SlaveEndpointTest_NoAuthorizer_1_LFOMCk" --sandbox_directory="/mnt/mesos/sandbox"
--strict="true" --switch_user="true" --systemd_enable_support="true" --systemd_runtime_directory="/run/systemd/system"
--version="false" --work_dir="/tmp/Endpoint_SlaveEndpointTest_NoAuthorizer_1_TW5adE"
I0711 15:37:37.596488 29954 credentials.hpp:86] Loading credential for authentication from
'/tmp/Endpoint_SlaveEndpointTest_NoAuthorizer_1_LFOMCk/credential'
I0711 15:37:37.596642 29954 slave.cpp:283] Agent using credential for: test-principal
I0711 15:37:37.596668 29954 credentials.hpp:37] Loading credentials for authentication from
'/tmp/Endpoint_SlaveEndpointTest_NoAuthorizer_1_LFOMCk/http_credentials'
I0711 15:37:37.596961 29954 http.cpp:976] Creating default 'basic' HTTP authenticator for
realm 'mesos-agent-executor'
I0711 15:37:37.597075 29954 http.cpp:997] Creating default 'jwt' HTTP authenticator for realm
'mesos-agent-executor'
I0711 15:37:37.597275 29954 http.cpp:976] Creating default 'basic' HTTP authenticator for
realm 'mesos-agent-readonly'
I0711 15:37:37.597380 29954 http.cpp:997] Creating default 'jwt' HTTP authenticator for realm
'mesos-agent-readonly'
I0711 15:37:37.597648 29954 http.cpp:976] Creating default 'basic' HTTP authenticator for
realm 'mesos-agent-readwrite'
I0711 15:37:37.597755 29954 http.cpp:997] Creating default 'jwt' HTTP authenticator for realm
'mesos-agent-readwrite'
I0711 15:37:37.599969 29954 slave.cpp:565] Agent resources: [{"name":"cpus","scalar":{"value":2.0},"type":"SCALAR"},{"name":"mem","scalar":{"value":1024.0},"type":"SCALAR"},{"name":"disk","scalar":{"value":1024.0},"type":"SCALAR"},{"name":"ports","ranges":{"range":[{"begin":31000,"end":32000}]},"type":"RANGES"}]
I0711 15:37:37.600400 29954 slave.cpp:573] Agent attributes: [  ]
I0711 15:37:37.600420 29954 slave.cpp:578] Agent hostname: e6e65751bd04
I0711 15:37:37.600556 29955 status_update_manager.cpp:177] Pausing sending status updates
I0711 15:37:37.602008 29949 state.cpp:64] Recovering state from '/tmp/Endpoint_SlaveEndpointTest_NoAuthorizer_1_TW5adE/meta'
I0711 15:37:37.602393 29954 status_update_manager.cpp:203] Recovering status update manager
I0711 15:37:37.602679 29956 containerizer.cpp:582] Recovering containerizer
I0711 15:37:37.604425 29944 provisioner.cpp:416] Provisioner recovery complete
I0711 15:37:37.604811 29939 slave.cpp:6203] Finished recovery
I0711 15:37:37.605305 29939 slave.cpp:6385] Querying resource estimator for oversubscribable
resources
I0711 15:37:37.605558 29956 slave.cpp:6399] Received oversubscribable resources {} from the
resource estimator
I0711 15:37:37.607470 29946 process.cpp:3820] Handling HTTP event for process 'slave(787)'
with path: '/slave(787)/monitor/statistics.json'
I0711 15:37:37.609410 29945 http.cpp:1116] HTTP GET for /slave(787)/monitor/statistics.json
from 172.17.0.6:42324
I0711 15:37:37.609496 29945 http.cpp:937] Authorizing principal 'test-principal' to GET the
'/monitor/statistics.json' endpoint
I0711 15:37:37.612942 29943 slave.cpp:839] Agent terminating
[       OK ] Endpoint/SlaveEndpointTest.NoAuthorizer/1 (33 ms)
[ RUN      ] Endpoint/SlaveEndpointTest.NoAuthorizer/2
I0711 15:37:37.624866  9210 containerizer.cpp:230] Using isolation: posix/cpu,posix/mem,filesystem/posix,network/cni,environment_secret
W0711 15:37:37.625383  9210 backend.cpp:76] Failed to create 'aufs' backend: AufsBackend requires
root privileges
W0711 15:37:37.625478  9210 backend.cpp:76] Failed to create 'bind' backend: BindBackend requires
root privileges
I0711 15:37:37.625515  9210 provisioner.cpp:255] Using default backend 'copy'
I0711 15:37:37.627355  9210 cluster.cpp:448] Creating default 'local' authorizer
I0711 15:37:37.628968 29945 slave.cpp:250] Mesos agent started on (788)@172.17.0.6:35570
I0711 15:37:37.629000 29945 slave.cpp:251] Flags at startup: --acls="" --appc_simple_discovery_uri_prefix="http://"
--appc_store_dir="/tmp/Endpoint_SlaveEndpointTest_NoAuthorizer_2_3qA4x4/store/appc" --authenticate_http_executors="true"
--authenticate_http_readonly="true" --authenticate_http_readwrite="true" --authenticatee="crammd5"
--authentication_backoff_factor="1secs" --authorizer="local" --cgroups_cpu_enable_pids_and_tids_count="false"
--cgroups_enable_cfs="false" --cgroups_hierarchy="/sys/fs/cgroup" --cgroups_limit_swap="false"
--cgroups_root="mesos" --container_disk_watch_interval="15secs" --containerizers="mesos" --credential="/tmp/Endpoint_SlaveEndpointTest_NoAuthorizer_2_3qA4x4/credential"
--default_role="*" --disk_watch_interval="1mins" --docker="docker" --docker_kill_orphans="true"
--docker_registry="https://registry-1.docker.io" --docker_remove_delay="6hrs" --docker_socket="/var/run/docker.sock"
--docker_stop_timeout="0ns" --docker_store_dir="/tmp/Endpoint_SlaveEndpointTest_NoAuthorizer_2_3qA4x4/store/docker"
--docker_volume_checkpoint_dir="/var/run/mesos/isolators/docker/volume" --enforce_container_disk_quota="false"
--executor_registration_timeout="1mins" --executor_reregistration_timeout="2secs" --executor_secret_key="/tmp/Endpoint_SlaveEndpointTest_NoAuthorizer_2_3qA4x4/executor_secret_key"
--executor_shutdown_grace_period="5secs" --fetcher_cache_dir="/tmp/Endpoint_SlaveEndpointTest_NoAuthorizer_2_3qA4x4/fetch"
--fetcher_cache_size="2GB" --frameworks_home="" --gc_delay="1weeks" --gc_disk_headroom="0.1"
--hadoop_home="" --help="false" --hostname_lookup="true" --http_command_executor="false" --http_credentials="/tmp/Endpoint_SlaveEndpointTest_NoAuthorizer_2_3qA4x4/http_credentials"
--http_heartbeat_interval="30secs" --initialize_driver_logging="true" --isolation="posix/cpu,posix/mem"
--launcher="posix" --launcher_dir="/mesos/mesos-1.4.0/_build/src" --logbufsecs="0" --logging_level="INFO"
--max_completed_executors_per_framework="150" --oversubscribed_resources_interval="15secs"
--perf_duration="10secs" --perf_interval="1mins" --port="5051" --qos_correction_interval_min="0ns"
--quiet="false" --recover="reconnect" --recovery_timeout="15mins" --registration_backoff_factor="10ms"
--resources="cpus:2;gpus:0;mem:1024;disk:1024;ports:[31000-32000]" --revocable_cpu_low_priority="true"
--runtime_dir="/tmp/Endpoint_SlaveEndpointTest_NoAuthorizer_2_3qA4x4" --sandbox_directory="/mnt/mesos/sandbox"
--strict="true" --switch_user="true" --systemd_enable_support="true" --systemd_runtime_directory="/run/systemd/system"
--version="false" --work_dir="/tmp/Endpoint_SlaveEndpointTest_NoAuthorizer_2_fXpy3n"
I0711 15:37:37.629386 29945 credentials.hpp:86] Loading credential for authentication from
'/tmp/Endpoint_SlaveEndpointTest_NoAuthorizer_2_3qA4x4/credential'
I0711 15:37:37.629537 29945 slave.cpp:283] Agent using credential for: test-principal
I0711 15:37:37.629568 29945 credentials.hpp:37] Loading credentials for authentication from
'/tmp/Endpoint_SlaveEndpointTest_NoAuthorizer_2_3qA4x4/http_credentials'
I0711 15:37:37.629861 29945 http.cpp:976] Creating default 'basic' HTTP authenticator for
realm 'mesos-agent-executor'
I0711 15:37:37.629997 29945 http.cpp:997] Creating default 'jwt' HTTP authenticator for realm
'mesos-agent-executor'
I0711 15:37:37.630398 29945 http.cpp:976] Creating default 'basic' HTTP authenticator for
realm 'mesos-agent-readonly'
I0711 15:37:37.630518 29945 http.cpp:997] Creating default 'jwt' HTTP authenticator for realm
'mesos-agent-readonly'
I0711 15:37:37.630900 29945 http.cpp:976] Creating default 'basic' HTTP authenticator for
realm 'mesos-agent-readwrite'
I0711 15:37:37.631031 29945 http.cpp:997] Creating default 'jwt' HTTP authenticator for realm
'mesos-agent-readwrite'
I0711 15:37:37.632580 29945 slave.cpp:565] Agent resources: [{"name":"cpus","scalar":{"value":2.0},"type":"SCALAR"},{"name":"mem","scalar":{"value":1024.0},"type":"SCALAR"},{"name":"disk","scalar":{"value":1024.0},"type":"SCALAR"},{"name":"ports","ranges":{"range":[{"begin":31000,"end":32000}]},"type":"RANGES"}]
I0711 15:37:37.632817 29945 slave.cpp:573] Agent attributes: [  ]
I0711 15:37:37.632832 29945 slave.cpp:578] Agent hostname: e6e65751bd04
I0711 15:37:37.632978 29954 status_update_manager.cpp:177] Pausing sending status updates
I0711 15:37:37.634316 29955 state.cpp:64] Recovering state from '/tmp/Endpoint_SlaveEndpointTest_NoAuthorizer_2_fXpy3n/meta'
I0711 15:37:37.634819 29944 status_update_manager.cpp:203] Recovering status update manager
I0711 15:37:37.635012 29948 containerizer.cpp:582] Recovering containerizer
I0711 15:37:37.636669 29936 provisioner.cpp:416] Provisioner recovery complete
I0711 15:37:37.637096 29950 slave.cpp:6203] Finished recovery
I0711 15:37:37.637603 29950 slave.cpp:6385] Querying resource estimator for oversubscribable
resources
I0711 15:37:37.637929 29947 slave.cpp:6399] Received oversubscribable resources {} from the
resource estimator
I0711 15:37:37.639820 29949 process.cpp:3820] Handling HTTP event for process 'slave(788)'
with path: '/slave(788)/containers'
I0711 15:37:37.641739 29955 http.cpp:1116] HTTP GET for /slave(788)/containers from 172.17.0.6:42326
I0711 15:37:37.641870 29955 http.cpp:937] Authorizing principal 'test-principal' to GET the
'/containers' endpoint
I0711 15:37:37.645882 29950 slave.cpp:839] Agent terminating
[       OK ] Endpoint/SlaveEndpointTest.NoAuthorizer/2 (34 ms)
[----------] 9 tests from Endpoint/SlaveEndpointTest (308 ms total)

[----------] Global test environment tear-down
[==========] 1633 tests from 181 test cases ran. (532970 ms total)
[  PASSED  ] 1632 tests.
[  FAILED  ] 1 test, listed below:
[  FAILED  ] CommandExecutorCheckTest.CommandCheckDeliveredAndReconciled

 1 FAILED TEST
  YOU HAVE 20 DISABLED TESTS

I0711 15:37:37.715787 29958 process.cpp:993] Failed to accept socket: future discarded
make[4]: *** [check-local] Error 1
make[4]: Leaving directory `/mesos/mesos-1.4.0/_build/src'
make[3]: *** [check-am] Error 2
make[3]: Leaving directory `/mesos/mesos-1.4.0/_build/src'
make[2]: *** [check] Error 2
make[2]: Leaving directory `/mesos/mesos-1.4.0/_build/src'
make[1]: *** [check-recursive] Error 1
make[1]: Leaving directory `/mesos/mesos-1.4.0/_build'
make: *** [distcheck] Error 1
+ docker rmi mesos-1499784870-377
Untagged: mesos-1499784870-377:latest
Deleted: sha256:fb38cb7d72d594ad55d7a255f6b0f2afadd7ea06130c08f10c326e15e211d75f
Deleted: sha256:27cf154aff093250efa7ff3c290d61470812258311be9e9683b7dbdcfa9f98e0
Deleted: sha256:6e1baf2ae95b8a2f873bff6cfff5a597153ba6e196dfdc8efb680b61cda9ed65
Deleted: sha256:edc0505a6f00857eb2808ce97355ad198ed4127a9e2579ad82a8fe1a1cf7b547
Deleted: sha256:8154e462aa7320135a37fc86e1961ead6435e62f56e215881c954344ce162cd7
Deleted: sha256:eac1add049157ecfcc8a439832414b9ba0c55eaff48c6b7739f99b40bf741487
Deleted: sha256:86c94f9cdc0de122fbc97cb0e966692232b3678bea0666938e7e86ecf8906463
Deleted: sha256:1fc94bbd24add955aba7c4376b3d64e09b6ff003704b7ee042ceda2e21d0ab85
Deleted: sha256:7ef702d897976c37215159ef58115b308dc9112f03a2852c4b79022021da2312
Deleted: sha256:463348aebbcbac0e3e3b3acd8175a7b9d06db043eacf6a3c86b30dbfe549c28e
Deleted: sha256:50fb6a9114676f5cb6f20eba63ad9483f0e874b2335bcd0116ef493c2bfdb219
Deleted: sha256:7ab470769d18ec78adb66e2bce7607aae631326121fcbfc024e7d229c7045bae
Deleted: sha256:4fda1b557c3cde5b0d9778b4f5b11d23be8ae3838cb8ece384a9738b1d7679dc
Deleted: sha256:3827504904379316a62b82d05d490692e36b7e9fbf599fa17537a24b31326a59
Deleted: sha256:b2b0e4e6bd25c26b513cb2711863311461b6b95d3a030cace545703bcf0f19b7
Deleted: sha256:95c4eca86bae6e6d7f45c01e6261d42550b367f5db9f42ee4542f1b7a2e7a21c
Deleted: sha256:1530b4cd05b2fc0606d586b9893a865ab7db13dc050e9bac4d5dd7704e96c0d7
Deleted: sha256:695eaa5221d8574d5cac896dbc253f9e75d631193b3628fbf8ab6a67dc2fa9a7
Deleted: sha256:447d0cc57e11be3321ea3363d8927cf6042930ab7e1e287bd2ee757435d375af
Deleted: sha256:d89c9db1b871fa9d0a4e4f63efbc80ce590d1828420442537ea2c1ed8e42c1d4
Deleted: sha256:4988bbf68a76b6e0fc98531384ef1351f41a0b2500f99e8aa3d3514877c3ac8d
Deleted: sha256:26cd7f150530176b0de0ac1f0e1d5d38d4f71b0ba763810d5db81decce3088d9
Deleted: sha256:73be32e8c9a02da5a22b2fb91ab33a3efc0ed07ad32c7f9beca7ba4a9f8f3aad
Deleted: sha256:85cfe8580256287e3252176fa19baf9487bfe5f98085610e2344f036e7d6729f
Deleted: sha256:d2ddb946748f06a00aa6466b0838492f42309563c2e24af8f765ff1f2b4c18d3
Build step 'Execute shell' marked build as failure
Not sending mail to unregistered user alexander@mesosphere.io

Mime
View raw message