mesos-builds mailing list archives

Site index · List index
Message view « Date » · « Thread »
Top « Date » · « Thread »
From Apache Jenkins Server <jenk...@builds.apache.org>
Subject Build failed in Jenkins: Mesos-Buildbot » autotools,clang,--verbose --enable-libevent --enable-ssl,GLOG_v=1 MESOS_VERBOSE=1,ubuntu:14.04,(ubuntu)&&(!ubuntu-us1)&&(!ubuntu-eu2) #3966
Date Fri, 28 Jul 2017 07:47:05 GMT
See <https://builds.apache.org/job/Mesos-Buildbot/BUILDTOOL=autotools,COMPILER=clang,CONFIGURATION=--verbose%20--enable-libevent%20--enable-ssl,ENVIRONMENT=GLOG_v=1%20MESOS_VERBOSE=1,OS=ubuntu%3A14.04,label_exp=(ubuntu)&&(!ubuntu-us1)&&(!ubuntu-eu2)/3966/display/redirect?page=changes>

Changes:

[songzihao1990] Logged each container state transition.

[songzihao1990] Store container reference in a variable if it will be used repeatedly.

------------------------------------------
[...truncated 31.56 MB...]
I0728 07:46:56.707926 27221 process.cpp:3837] Handling HTTP event for process 'slave(802)'
with path: '/slave(802)/containers'
I0728 07:46:56.709889 27217 http.cpp:1133] HTTP GET for /slave(802)/containers from 172.17.0.6:45104
I0728 07:46:56.709959 27217 http.cpp:957] Authorizing principal 'test-principal' to GET the
'/containers' endpoint
I0728 07:46:56.713073 27221 slave.cpp:843] Agent terminating
[       OK ] Endpoint/SlaveEndpointTest.AuthorizedRequest/2 (31 ms)
[ RUN      ] Endpoint/SlaveEndpointTest.UnauthorizedRequest/0
I0728 07:46:56.723551  6611 containerizer.cpp:230] Using isolation: posix/cpu,posix/mem,filesystem/posix,network/cni,environment_secret
W0728 07:46:56.724025  6611 backend.cpp:76] Failed to create 'aufs' backend: AufsBackend requires
root privileges
W0728 07:46:56.724120  6611 backend.cpp:76] Failed to create 'bind' backend: BindBackend requires
root privileges
I0728 07:46:56.724153  6611 provisioner.cpp:255] Using default backend 'copy'
I0728 07:46:56.727139 27217 slave.cpp:250] Mesos agent started on (803)@172.17.0.6:37974
I0728 07:46:56.727174 27217 slave.cpp:251] Flags at startup: --acls="" --appc_simple_discovery_uri_prefix="http://"
--appc_store_dir="/tmp/Endpoint_SlaveEndpointTest_UnauthorizedRequest_0_VXkKSY/store/appc"
--authenticate_http_executors="true" --authenticate_http_readonly="true" --authenticate_http_readwrite="true"
--authenticatee="crammd5" --authentication_backoff_factor="1secs" --authorizer="local" --cgroups_cpu_enable_pids_and_tids_count="false"
--cgroups_enable_cfs="false" --cgroups_hierarchy="/sys/fs/cgroup" --cgroups_limit_swap="false"
--cgroups_root="mesos" --container_disk_watch_interval="15secs" --containerizers="mesos" --credential="/tmp/Endpoint_SlaveEndpointTest_UnauthorizedRequest_0_VXkKSY/credential"
--default_role="*" --disk_watch_interval="1mins" --docker="docker" --docker_kill_orphans="true"
--docker_registry="https://registry-1.docker.io" --docker_remove_delay="6hrs" --docker_socket="/var/run/docker.sock"
--docker_stop_timeout="0ns" --docker_store_dir="/tmp/Endpoint_SlaveEndpointTest_UnauthorizedRequest_0_VXkKSY/store/docker"
--docker_volume_checkpoint_dir="/var/run/mesos/isolators/docker/volume" --enforce_container_disk_quota="false"
--executor_registration_timeout="1mins" --executor_reregistration_timeout="2secs" --executor_secret_key="/tmp/Endpoint_SlaveEndpointTest_UnauthorizedRequest_0_VXkKSY/executor_secret_key"
--executor_shutdown_grace_period="5secs" --fetcher_cache_dir="/tmp/Endpoint_SlaveEndpointTest_UnauthorizedRequest_0_VXkKSY/fetch"
--fetcher_cache_size="2GB" --frameworks_home="" --gc_delay="1weeks" --gc_disk_headroom="0.1"
--hadoop_home="" --help="false" --hostname_lookup="true" --http_command_executor="false" --http_credentials="/tmp/Endpoint_SlaveEndpointTest_UnauthorizedRequest_0_VXkKSY/http_credentials"
--http_heartbeat_interval="30secs" --initialize_driver_logging="true" --isolation="posix/cpu,posix/mem"
--launcher="posix" --launcher_dir="/mesos/mesos-1.4.0/_build/src" --logbufsecs="0" --logging_level="INFO"
--max_completed_executors_per_framework="150" --oversubscribed_resources_interval="15secs"
--perf_duration="10secs" --perf_interval="1mins" --port="5051" --qos_correction_interval_min="0ns"
--quiet="false" --recover="reconnect" --recovery_timeout="15mins" --registration_backoff_factor="10ms"
--resources="cpus:2;gpus:0;mem:1024;disk:1024;ports:[31000-32000]" --revocable_cpu_low_priority="true"
--runtime_dir="/tmp/Endpoint_SlaveEndpointTest_UnauthorizedRequest_0_VXkKSY" --sandbox_directory="/mnt/mesos/sandbox"
--strict="true" --switch_user="true" --systemd_enable_support="true" --systemd_runtime_directory="/run/systemd/system"
--version="false" --work_dir="/tmp/Endpoint_SlaveEndpointTest_UnauthorizedRequest_0_ybUlPG"
I0728 07:46:56.727514 27217 credentials.hpp:86] Loading credential for authentication from
'/tmp/Endpoint_SlaveEndpointTest_UnauthorizedRequest_0_VXkKSY/credential'
I0728 07:46:56.727668 27217 slave.cpp:283] Agent using credential for: test-principal
I0728 07:46:56.727689 27217 credentials.hpp:37] Loading credentials for authentication from
'/tmp/Endpoint_SlaveEndpointTest_UnauthorizedRequest_0_VXkKSY/http_credentials'
I0728 07:46:56.727959 27217 http.cpp:993] Creating default 'basic' HTTP authenticator for
realm 'mesos-agent-executor'
I0728 07:46:56.728068 27217 http.cpp:1014] Creating default 'jwt' HTTP authenticator for realm
'mesos-agent-executor'
I0728 07:46:56.728238 27217 http.cpp:993] Creating default 'basic' HTTP authenticator for
realm 'mesos-agent-readonly'
I0728 07:46:56.728324 27217 http.cpp:1014] Creating default 'jwt' HTTP authenticator for realm
'mesos-agent-readonly'
I0728 07:46:56.728477 27217 http.cpp:993] Creating default 'basic' HTTP authenticator for
realm 'mesos-agent-readwrite'
I0728 07:46:56.728587 27217 http.cpp:1014] Creating default 'jwt' HTTP authenticator for realm
'mesos-agent-readwrite'
I0728 07:46:56.729887 27217 slave.cpp:565] Agent resources: [{"name":"cpus","scalar":{"value":2.0},"type":"SCALAR"},{"name":"mem","scalar":{"value":1024.0},"type":"SCALAR"},{"name":"disk","scalar":{"value":1024.0},"type":"SCALAR"},{"name":"ports","ranges":{"range":[{"begin":31000,"end":32000}]},"type":"RANGES"}]
I0728 07:46:56.730110 27217 slave.cpp:573] Agent attributes: [  ]
I0728 07:46:56.730124 27217 slave.cpp:582] Agent hostname: 738f89b9c788
I0728 07:46:56.730232 27222 status_update_manager.cpp:177] Pausing sending status updates
I0728 07:46:56.731535 27206 state.cpp:64] Recovering state from '/tmp/Endpoint_SlaveEndpointTest_UnauthorizedRequest_0_ybUlPG/meta'
I0728 07:46:56.731858 27224 status_update_manager.cpp:203] Recovering status update manager
I0728 07:46:56.732034 27210 containerizer.cpp:582] Recovering containerizer
I0728 07:46:56.733301 27202 provisioner.cpp:416] Provisioner recovery complete
I0728 07:46:56.733640 27209 slave.cpp:6207] Finished recovery
I0728 07:46:56.734082 27209 slave.cpp:6389] Querying resource estimator for oversubscribable
resources
I0728 07:46:56.734284 27216 slave.cpp:6403] Received oversubscribable resources {} from the
resource estimator
I0728 07:46:56.736469 27213 process.cpp:3837] Handling HTTP event for process 'slave(803)'
with path: '/slave(803)/monitor/statistics'
I0728 07:46:56.738188 27221 http.cpp:1133] HTTP GET for /slave(803)/monitor/statistics from
172.17.0.6:45106
I0728 07:46:56.738261 27221 http.cpp:957] Authorizing principal 'test-principal' to GET the
'/monitor/statistics' endpoint
I0728 07:46:56.740119 27224 slave.cpp:843] Agent terminating
[       OK ] Endpoint/SlaveEndpointTest.UnauthorizedRequest/0 (27 ms)
[ RUN      ] Endpoint/SlaveEndpointTest.UnauthorizedRequest/1
I0728 07:46:56.750840  6611 containerizer.cpp:230] Using isolation: posix/cpu,posix/mem,filesystem/posix,network/cni,environment_secret
W0728 07:46:56.751312  6611 backend.cpp:76] Failed to create 'aufs' backend: AufsBackend requires
root privileges
W0728 07:46:56.751408  6611 backend.cpp:76] Failed to create 'bind' backend: BindBackend requires
root privileges
I0728 07:46:56.751441  6611 provisioner.cpp:255] Using default backend 'copy'
I0728 07:46:56.754457 27214 slave.cpp:250] Mesos agent started on (804)@172.17.0.6:37974
I0728 07:46:56.754495 27214 slave.cpp:251] Flags at startup: --acls="" --appc_simple_discovery_uri_prefix="http://"
--appc_store_dir="/tmp/Endpoint_SlaveEndpointTest_UnauthorizedRequest_1_NYJ9j9/store/appc"
--authenticate_http_executors="true" --authenticate_http_readonly="true" --authenticate_http_readwrite="true"
--authenticatee="crammd5" --authentication_backoff_factor="1secs" --authorizer="local" --cgroups_cpu_enable_pids_and_tids_count="false"
--cgroups_enable_cfs="false" --cgroups_hierarchy="/sys/fs/cgroup" --cgroups_limit_swap="false"
--cgroups_root="mesos" --container_disk_watch_interval="15secs" --containerizers="mesos" --credential="/tmp/Endpoint_SlaveEndpointTest_UnauthorizedRequest_1_NYJ9j9/credential"
--default_role="*" --disk_watch_interval="1mins" --docker="docker" --docker_kill_orphans="true"
--docker_registry="https://registry-1.docker.io" --docker_remove_delay="6hrs" --docker_socket="/var/run/docker.sock"
--docker_stop_timeout="0ns" --docker_store_dir="/tmp/Endpoint_SlaveEndpointTest_UnauthorizedRequest_1_NYJ9j9/store/docker"
--docker_volume_checkpoint_dir="/var/run/mesos/isolators/docker/volume" --enforce_container_disk_quota="false"
--executor_registration_timeout="1mins" --executor_reregistration_timeout="2secs" --executor_secret_key="/tmp/Endpoint_SlaveEndpointTest_UnauthorizedRequest_1_NYJ9j9/executor_secret_key"
--executor_shutdown_grace_period="5secs" --fetcher_cache_dir="/tmp/Endpoint_SlaveEndpointTest_UnauthorizedRequest_1_NYJ9j9/fetch"
--fetcher_cache_size="2GB" --frameworks_home="" --gc_delay="1weeks" --gc_disk_headroom="0.1"
--hadoop_home="" --help="false" --hostname_lookup="true" --http_command_executor="false" --http_credentials="/tmp/Endpoint_SlaveEndpointTest_UnauthorizedRequest_1_NYJ9j9/http_credentials"
--http_heartbeat_interval="30secs" --initialize_driver_logging="true" --isolation="posix/cpu,posix/mem"
--launcher="posix" --launcher_dir="/mesos/mesos-1.4.0/_build/src" --logbufsecs="0" --logging_level="INFO"
--max_completed_executors_per_framework="150" --oversubscribed_resources_interval="15secs"
--perf_duration="10secs" --perf_interval="1mins" --port="5051" --qos_correction_interval_min="0ns"
--quiet="false" --recover="reconnect" --recovery_timeout="15mins" --registration_backoff_factor="10ms"
--resources="cpus:2;gpus:0;mem:1024;disk:1024;ports:[31000-32000]" --revocable_cpu_low_priority="true"
--runtime_dir="/tmp/Endpoint_SlaveEndpointTest_UnauthorizedRequest_1_NYJ9j9" --sandbox_directory="/mnt/mesos/sandbox"
--strict="true" --switch_user="true" --systemd_enable_support="true" --systemd_runtime_directory="/run/systemd/system"
--version="false" --work_dir="/tmp/Endpoint_SlaveEndpointTest_UnauthorizedRequest_1_29kHcR"
I0728 07:46:56.754837 27214 credentials.hpp:86] Loading credential for authentication from
'/tmp/Endpoint_SlaveEndpointTest_UnauthorizedRequest_1_NYJ9j9/credential'
I0728 07:46:56.754987 27214 slave.cpp:283] Agent using credential for: test-principal
I0728 07:46:56.755009 27214 credentials.hpp:37] Loading credentials for authentication from
'/tmp/Endpoint_SlaveEndpointTest_UnauthorizedRequest_1_NYJ9j9/http_credentials'
I0728 07:46:56.755275 27214 http.cpp:993] Creating default 'basic' HTTP authenticator for
realm 'mesos-agent-executor'
I0728 07:46:56.755379 27214 http.cpp:1014] Creating default 'jwt' HTTP authenticator for realm
'mesos-agent-executor'
I0728 07:46:56.755543 27214 http.cpp:993] Creating default 'basic' HTTP authenticator for
realm 'mesos-agent-readonly'
I0728 07:46:56.755627 27214 http.cpp:1014] Creating default 'jwt' HTTP authenticator for realm
'mesos-agent-readonly'
I0728 07:46:56.755770 27214 http.cpp:993] Creating default 'basic' HTTP authenticator for
realm 'mesos-agent-readwrite'
I0728 07:46:56.755857 27214 http.cpp:1014] Creating default 'jwt' HTTP authenticator for realm
'mesos-agent-readwrite'
I0728 07:46:56.757154 27214 slave.cpp:565] Agent resources: [{"name":"cpus","scalar":{"value":2.0},"type":"SCALAR"},{"name":"mem","scalar":{"value":1024.0},"type":"SCALAR"},{"name":"disk","scalar":{"value":1024.0},"type":"SCALAR"},{"name":"ports","ranges":{"range":[{"begin":31000,"end":32000}]},"type":"RANGES"}]
I0728 07:46:56.757380 27214 slave.cpp:573] Agent attributes: [  ]
I0728 07:46:56.757395 27214 slave.cpp:582] Agent hostname: 738f89b9c788
I0728 07:46:56.757541 27215 status_update_manager.cpp:177] Pausing sending status updates
I0728 07:46:56.758893 27223 state.cpp:64] Recovering state from '/tmp/Endpoint_SlaveEndpointTest_UnauthorizedRequest_1_29kHcR/meta'
I0728 07:46:56.759161 27216 status_update_manager.cpp:203] Recovering status update manager
I0728 07:46:56.759332 27203 containerizer.cpp:582] Recovering containerizer
I0728 07:46:56.760469 27211 provisioner.cpp:416] Provisioner recovery complete
I0728 07:46:56.760783 27214 slave.cpp:6207] Finished recovery
I0728 07:46:56.761211 27214 slave.cpp:6389] Querying resource estimator for oversubscribable
resources
I0728 07:46:56.761397 27209 slave.cpp:6403] Received oversubscribable resources {} from the
resource estimator
I0728 07:46:56.763288 27202 process.cpp:3837] Handling HTTP event for process 'slave(804)'
with path: '/slave(804)/monitor/statistics.json'
I0728 07:46:56.764860 27216 http.cpp:1133] HTTP GET for /slave(804)/monitor/statistics.json
from 172.17.0.6:45108
I0728 07:46:56.764928 27216 http.cpp:957] Authorizing principal 'test-principal' to GET the
'/monitor/statistics.json' endpoint
I0728 07:46:56.766631 27220 slave.cpp:843] Agent terminating
[       OK ] Endpoint/SlaveEndpointTest.UnauthorizedRequest/1 (26 ms)
[ RUN      ] Endpoint/SlaveEndpointTest.UnauthorizedRequest/2
I0728 07:46:56.777094  6611 containerizer.cpp:230] Using isolation: posix/cpu,posix/mem,filesystem/posix,network/cni,environment_secret
W0728 07:46:56.777606  6611 backend.cpp:76] Failed to create 'aufs' backend: AufsBackend requires
root privileges
W0728 07:46:56.777698  6611 backend.cpp:76] Failed to create 'bind' backend: BindBackend requires
root privileges
I0728 07:46:56.777740  6611 provisioner.cpp:255] Using default backend 'copy'
I0728 07:46:56.780791 27208 slave.cpp:250] Mesos agent started on (805)@172.17.0.6:37974
I0728 07:46:56.780830 27208 slave.cpp:251] Flags at startup: --acls="" --appc_simple_discovery_uri_prefix="http://"
--appc_store_dir="/tmp/Endpoint_SlaveEndpointTest_UnauthorizedRequest_2_fdWj1j/store/appc"
--authenticate_http_executors="true" --authenticate_http_readonly="true" --authenticate_http_readwrite="true"
--authenticatee="crammd5" --authentication_backoff_factor="1secs" --authorizer="local" --cgroups_cpu_enable_pids_and_tids_count="false"
--cgroups_enable_cfs="false" --cgroups_hierarchy="/sys/fs/cgroup" --cgroups_limit_swap="false"
--cgroups_root="mesos" --container_disk_watch_interval="15secs" --containerizers="mesos" --credential="/tmp/Endpoint_SlaveEndpointTest_UnauthorizedRequest_2_fdWj1j/credential"
--default_role="*" --disk_watch_interval="1mins" --docker="docker" --docker_kill_orphans="true"
--docker_registry="https://registry-1.docker.io" --docker_remove_delay="6hrs" --docker_socket="/var/run/docker.sock"
--docker_stop_timeout="0ns" --docker_store_dir="/tmp/Endpoint_SlaveEndpointTest_UnauthorizedRequest_2_fdWj1j/store/docker"
--docker_volume_checkpoint_dir="/var/run/mesos/isolators/docker/volume" --enforce_container_disk_quota="false"
--executor_registration_timeout="1mins" --executor_reregistration_timeout="2secs" --executor_secret_key="/tmp/Endpoint_SlaveEndpointTest_UnauthorizedRequest_2_fdWj1j/executor_secret_key"
--executor_shutdown_grace_period="5secs" --fetcher_cache_dir="/tmp/Endpoint_SlaveEndpointTest_UnauthorizedRequest_2_fdWj1j/fetch"
--fetcher_cache_size="2GB" --frameworks_home="" --gc_delay="1weeks" --gc_disk_headroom="0.1"
--hadoop_home="" --help="false" --hostname_lookup="true" --http_command_executor="false" --http_credentials="/tmp/Endpoint_SlaveEndpointTest_UnauthorizedRequest_2_fdWj1j/http_credentials"
--http_heartbeat_interval="30secs" --initialize_driver_logging="true" --isolation="posix/cpu,posix/mem"
--launcher="posix" --launcher_dir="/mesos/mesos-1.4.0/_build/src" --logbufsecs="0" --logging_level="INFO"
--max_completed_executors_per_framework="150" --oversubscribed_resources_interval="15secs"
--perf_duration="10secs" --perf_interval="1mins" --port="5051" --qos_correction_interval_min="0ns"
--quiet="false" --recover="reconnect" --recovery_timeout="15mins" --registration_backoff_factor="10ms"
--resources="cpus:2;gpus:0;mem:1024;disk:1024;ports:[31000-32000]" --revocable_cpu_low_priority="true"
--runtime_dir="/tmp/Endpoint_SlaveEndpointTest_UnauthorizedRequest_2_fdWj1j" --sandbox_directory="/mnt/mesos/sandbox"
--strict="true" --switch_user="true" --systemd_enable_support="true" --systemd_runtime_directory="/run/systemd/system"
--version="false" --work_dir="/tmp/Endpoint_SlaveEndpointTest_UnauthorizedRequest_2_8UeXP1"
I0728 07:46:56.781168 27208 credentials.hpp:86] Loading credential for authentication from
'/tmp/Endpoint_SlaveEndpointTest_UnauthorizedRequest_2_fdWj1j/credential'
I0728 07:46:56.781314 27208 slave.cpp:283] Agent using credential for: test-principal
I0728 07:46:56.781337 27208 credentials.hpp:37] Loading credentials for authentication from
'/tmp/Endpoint_SlaveEndpointTest_UnauthorizedRequest_2_fdWj1j/http_credentials'
I0728 07:46:56.781600 27208 http.cpp:993] Creating default 'basic' HTTP authenticator for
realm 'mesos-agent-executor'
I0728 07:46:56.781785 27208 http.cpp:1014] Creating default 'jwt' HTTP authenticator for realm
'mesos-agent-executor'
I0728 07:46:56.781992 27208 http.cpp:993] Creating default 'basic' HTTP authenticator for
realm 'mesos-agent-readonly'
I0728 07:46:56.782079 27208 http.cpp:1014] Creating default 'jwt' HTTP authenticator for realm
'mesos-agent-readonly'
I0728 07:46:56.782227 27208 http.cpp:993] Creating default 'basic' HTTP authenticator for
realm 'mesos-agent-readwrite'
I0728 07:46:56.782311 27208 http.cpp:1014] Creating default 'jwt' HTTP authenticator for realm
'mesos-agent-readwrite'
I0728 07:46:56.783866 27208 slave.cpp:565] Agent resources: [{"name":"cpus","scalar":{"value":2.0},"type":"SCALAR"},{"name":"mem","scalar":{"value":1024.0},"type":"SCALAR"},{"name":"disk","scalar":{"value":1024.0},"type":"SCALAR"},{"name":"ports","ranges":{"range":[{"begin":31000,"end":32000}]},"type":"RANGES"}]
I0728 07:46:56.784262 27208 slave.cpp:573] Agent attributes: [  ]
I0728 07:46:56.784291 27208 slave.cpp:582] Agent hostname: 738f89b9c788
I0728 07:46:56.784471 27205 status_update_manager.cpp:177] Pausing sending status updates
I0728 07:46:56.785861 27214 state.cpp:64] Recovering state from '/tmp/Endpoint_SlaveEndpointTest_UnauthorizedRequest_2_8UeXP1/meta'
I0728 07:46:56.786083 27225 status_update_manager.cpp:203] Recovering status update manager
I0728 07:46:56.786267 27222 containerizer.cpp:582] Recovering containerizer
I0728 07:46:56.787469 27204 provisioner.cpp:416] Provisioner recovery complete
I0728 07:46:56.787802 27218 slave.cpp:6207] Finished recovery
I0728 07:46:56.788218 27218 slave.cpp:6389] Querying resource estimator for oversubscribable
resources
I0728 07:46:56.788422 27219 slave.cpp:6403] Received oversubscribable resources {} from the
resource estimator
I0728 07:46:56.790360 27206 process.cpp:3837] Handling HTTP event for process 'slave(805)'
with path: '/slave(805)/containers'
I0728 07:46:56.791891 27225 http.cpp:1133] HTTP GET for /slave(805)/containers from 172.17.0.6:45110
I0728 07:46:56.791959 27225 http.cpp:957] Authorizing principal 'test-principal' to GET the
'/containers' endpoint
I0728 07:46:56.793584 27225 slave.cpp:843] Agent terminating
[       OK ] Endpoint/SlaveEndpointTest.UnauthorizedRequest/2 (26 ms)
[ RUN      ] Endpoint/SlaveEndpointTest.NoAuthorizer/0
I0728 07:46:56.804121  6611 containerizer.cpp:230] Using isolation: posix/cpu,posix/mem,filesystem/posix,network/cni,environment_secret
W0728 07:46:56.804639  6611 backend.cpp:76] Failed to create 'aufs' backend: AufsBackend requires
root privileges
W0728 07:46:56.804749  6611 backend.cpp:76] Failed to create 'bind' backend: BindBackend requires
root privileges
I0728 07:46:56.804810  6611 provisioner.cpp:255] Using default backend 'copy'
I0728 07:46:56.806406  6611 cluster.cpp:448] Creating default 'local' authorizer
I0728 07:46:56.808013 27216 slave.cpp:250] Mesos agent started on (806)@172.17.0.6:37974
I0728 07:46:56.808049 27216 slave.cpp:251] Flags at startup: --acls="" --appc_simple_discovery_uri_prefix="http://"
--appc_store_dir="/tmp/Endpoint_SlaveEndpointTest_NoAuthorizer_0_7ivrYu/store/appc" --authenticate_http_executors="true"
--authenticate_http_readonly="true" --authenticate_http_readwrite="true" --authenticatee="crammd5"
--authentication_backoff_factor="1secs" --authorizer="local" --cgroups_cpu_enable_pids_and_tids_count="false"
--cgroups_enable_cfs="false" --cgroups_hierarchy="/sys/fs/cgroup" --cgroups_limit_swap="false"
--cgroups_root="mesos" --container_disk_watch_interval="15secs" --containerizers="mesos" --credential="/tmp/Endpoint_SlaveEndpointTest_NoAuthorizer_0_7ivrYu/credential"
--default_role="*" --disk_watch_interval="1mins" --docker="docker" --docker_kill_orphans="true"
--docker_registry="https://registry-1.docker.io" --docker_remove_delay="6hrs" --docker_socket="/var/run/docker.sock"
--docker_stop_timeout="0ns" --docker_store_dir="/tmp/Endpoint_SlaveEndpointTest_NoAuthorizer_0_7ivrYu/store/docker"
--docker_volume_checkpoint_dir="/var/run/mesos/isolators/docker/volume" --enforce_container_disk_quota="false"
--executor_registration_timeout="1mins" --executor_reregistration_timeout="2secs" --executor_secret_key="/tmp/Endpoint_SlaveEndpointTest_NoAuthorizer_0_7ivrYu/executor_secret_key"
--executor_shutdown_grace_period="5secs" --fetcher_cache_dir="/tmp/Endpoint_SlaveEndpointTest_NoAuthorizer_0_7ivrYu/fetch"
--fetcher_cache_size="2GB" --frameworks_home="" --gc_delay="1weeks" --gc_disk_headroom="0.1"
--hadoop_home="" --help="false" --hostname_lookup="true" --http_command_executor="false" --http_credentials="/tmp/Endpoint_SlaveEndpointTest_NoAuthorizer_0_7ivrYu/http_credentials"
--http_heartbeat_interval="30secs" --initialize_driver_logging="true" --isolation="posix/cpu,posix/mem"
--launcher="posix" --launcher_dir="/mesos/mesos-1.4.0/_build/src" --logbufsecs="0" --logging_level="INFO"
--max_completed_executors_per_framework="150" --oversubscribed_resources_interval="15secs"
--perf_duration="10secs" --perf_interval="1mins" --port="5051" --qos_correction_interval_min="0ns"
--quiet="false" --recover="reconnect" --recovery_timeout="15mins" --registration_backoff_factor="10ms"
--resources="cpus:2;gpus:0;mem:1024;disk:1024;ports:[31000-32000]" --revocable_cpu_low_priority="true"
--runtime_dir="/tmp/Endpoint_SlaveEndpointTest_NoAuthorizer_0_7ivrYu" --sandbox_directory="/mnt/mesos/sandbox"
--strict="true" --switch_user="true" --systemd_enable_support="true" --systemd_runtime_directory="/run/systemd/system"
--version="false" --work_dir="/tmp/Endpoint_SlaveEndpointTest_NoAuthorizer_0_Qpi6Ic"
I0728 07:46:56.808421 27216 credentials.hpp:86] Loading credential for authentication from
'/tmp/Endpoint_SlaveEndpointTest_NoAuthorizer_0_7ivrYu/credential'
I0728 07:46:56.808573 27216 slave.cpp:283] Agent using credential for: test-principal
I0728 07:46:56.808593 27216 credentials.hpp:37] Loading credentials for authentication from
'/tmp/Endpoint_SlaveEndpointTest_NoAuthorizer_0_7ivrYu/http_credentials'
I0728 07:46:56.808886 27216 http.cpp:993] Creating default 'basic' HTTP authenticator for
realm 'mesos-agent-executor'
I0728 07:46:56.808986 27216 http.cpp:1014] Creating default 'jwt' HTTP authenticator for realm
'mesos-agent-executor'
I0728 07:46:56.809140 27216 http.cpp:993] Creating default 'basic' HTTP authenticator for
realm 'mesos-agent-readonly'
I0728 07:46:56.809221 27216 http.cpp:1014] Creating default 'jwt' HTTP authenticator for realm
'mesos-agent-readonly'
I0728 07:46:56.809361 27216 http.cpp:993] Creating default 'basic' HTTP authenticator for
realm 'mesos-agent-readwrite'
I0728 07:46:56.809440 27216 http.cpp:1014] Creating default 'jwt' HTTP authenticator for realm
'mesos-agent-readwrite'
I0728 07:46:56.810714 27216 slave.cpp:565] Agent resources: [{"name":"cpus","scalar":{"value":2.0},"type":"SCALAR"},{"name":"mem","scalar":{"value":1024.0},"type":"SCALAR"},{"name":"disk","scalar":{"value":1024.0},"type":"SCALAR"},{"name":"ports","ranges":{"range":[{"begin":31000,"end":32000}]},"type":"RANGES"}]
I0728 07:46:56.810936 27216 slave.cpp:573] Agent attributes: [  ]
I0728 07:46:56.810950 27216 slave.cpp:582] Agent hostname: 738f89b9c788
I0728 07:46:56.811065 27220 status_update_manager.cpp:177] Pausing sending status updates
I0728 07:46:56.812419 27207 state.cpp:64] Recovering state from '/tmp/Endpoint_SlaveEndpointTest_NoAuthorizer_0_Qpi6Ic/meta'
I0728 07:46:56.812650 27204 status_update_manager.cpp:203] Recovering status update manager
I0728 07:46:56.812846 27218 containerizer.cpp:582] Recovering containerizer
I0728 07:46:56.814043 27206 provisioner.cpp:416] Provisioner recovery complete
I0728 07:46:56.814370 27214 slave.cpp:6207] Finished recovery
I0728 07:46:56.814795 27214 slave.cpp:6389] Querying resource estimator for oversubscribable
resources
I0728 07:46:56.815009 27215 slave.cpp:6403] Received oversubscribable resources {} from the
resource estimator
I0728 07:46:56.816998 27224 process.cpp:3837] Handling HTTP event for process 'slave(806)'
with path: '/slave(806)/monitor/statistics'
I0728 07:46:56.818548 27211 http.cpp:1133] HTTP GET for /slave(806)/monitor/statistics from
172.17.0.6:45112
I0728 07:46:56.818615 27211 http.cpp:957] Authorizing principal 'test-principal' to GET the
'/monitor/statistics' endpoint
I0728 07:46:56.821315 27217 slave.cpp:843] Agent terminating
[       OK ] Endpoint/SlaveEndpointTest.NoAuthorizer/0 (28 ms)
[ RUN      ] Endpoint/SlaveEndpointTest.NoAuthorizer/1
I0728 07:46:56.832089  6611 containerizer.cpp:230] Using isolation: posix/cpu,posix/mem,filesystem/posix,network/cni,environment_secret
W0728 07:46:56.832562  6611 backend.cpp:76] Failed to create 'aufs' backend: AufsBackend requires
root privileges
W0728 07:46:56.832655  6611 backend.cpp:76] Failed to create 'bind' backend: BindBackend requires
root privileges
I0728 07:46:56.832687  6611 provisioner.cpp:255] Using default backend 'copy'
I0728 07:46:56.834319  6611 cluster.cpp:448] Creating default 'local' authorizer
I0728 07:46:56.835836 27221 slave.cpp:250] Mesos agent started on (807)@172.17.0.6:37974
I0728 07:46:56.835872 27221 slave.cpp:251] Flags at startup: --acls="" --appc_simple_discovery_uri_prefix="http://"
--appc_store_dir="/tmp/Endpoint_SlaveEndpointTest_NoAuthorizer_1_NWh3bG/store/appc" --authenticate_http_executors="true"
--authenticate_http_readonly="true" --authenticate_http_readwrite="true" --authenticatee="crammd5"
--authentication_backoff_factor="1secs" --authorizer="local" --cgroups_cpu_enable_pids_and_tids_count="false"
--cgroups_enable_cfs="false" --cgroups_hierarchy="/sys/fs/cgroup" --cgroups_limit_swap="false"
--cgroups_root="mesos" --container_disk_watch_interval="15secs" --containerizers="mesos" --credential="/tmp/Endpoint_SlaveEndpointTest_NoAuthorizer_1_NWh3bG/credential"
--default_role="*" --disk_watch_interval="1mins" --docker="docker" --docker_kill_orphans="true"
--docker_registry="https://registry-1.docker.io" --docker_remove_delay="6hrs" --docker_socket="/var/run/docker.sock"
--docker_stop_timeout="0ns" --docker_store_dir="/tmp/Endpoint_SlaveEndpointTest_NoAuthorizer_1_NWh3bG/store/docker"
--docker_volume_checkpoint_dir="/var/run/mesos/isolators/docker/volume" --enforce_container_disk_quota="false"
--executor_registration_timeout="1mins" --executor_reregistration_timeout="2secs" --executor_secret_key="/tmp/Endpoint_SlaveEndpointTest_NoAuthorizer_1_NWh3bG/executor_secret_key"
--executor_shutdown_grace_period="5secs" --fetcher_cache_dir="/tmp/Endpoint_SlaveEndpointTest_NoAuthorizer_1_NWh3bG/fetch"
--fetcher_cache_size="2GB" --frameworks_home="" --gc_delay="1weeks" --gc_disk_headroom="0.1"
--hadoop_home="" --help="false" --hostname_lookup="true" --http_command_executor="false" --http_credentials="/tmp/Endpoint_SlaveEndpointTest_NoAuthorizer_1_NWh3bG/http_credentials"
--http_heartbeat_interval="30secs" --initialize_driver_logging="true" --isolation="posix/cpu,posix/mem"
--launcher="posix" --launcher_dir="/mesos/mesos-1.4.0/_build/src" --logbufsecs="0" --logging_level="INFO"
--max_completed_executors_per_framework="150" --oversubscribed_resources_interval="15secs"
--perf_duration="10secs" --perf_interval="1mins" --port="5051" --qos_correction_interval_min="0ns"
--quiet="false" --recover="reconnect" --recovery_timeout="15mins" --registration_backoff_factor="10ms"
--resources="cpus:2;gpus:0;mem:1024;disk:1024;ports:[31000-32000]" --revocable_cpu_low_priority="true"
--runtime_dir="/tmp/Endpoint_SlaveEndpointTest_NoAuthorizer_1_NWh3bG" --sandbox_directory="/mnt/mesos/sandbox"
--strict="true" --switch_user="true" --systemd_enable_support="true" --systemd_runtime_directory="/run/systemd/system"
--version="false" --work_dir="/tmp/Endpoint_SlaveEndpointTest_NoAuthorizer_1_ALbxSn"
I0728 07:46:56.836249 27221 credentials.hpp:86] Loading credential for authentication from
'/tmp/Endpoint_SlaveEndpointTest_NoAuthorizer_1_NWh3bG/credential'
I0728 07:46:56.836419 27221 slave.cpp:283] Agent using credential for: test-principal
I0728 07:46:56.836442 27221 credentials.hpp:37] Loading credentials for authentication from
'/tmp/Endpoint_SlaveEndpointTest_NoAuthorizer_1_NWh3bG/http_credentials'
I0728 07:46:56.836715 27221 http.cpp:993] Creating default 'basic' HTTP authenticator for
realm 'mesos-agent-executor'
I0728 07:46:56.836839 27221 http.cpp:1014] Creating default 'jwt' HTTP authenticator for realm
'mesos-agent-executor'
I0728 07:46:56.837004 27221 http.cpp:993] Creating default 'basic' HTTP authenticator for
realm 'mesos-agent-readonly'
I0728 07:46:56.837087 27221 http.cpp:1014] Creating default 'jwt' HTTP authenticator for realm
'mesos-agent-readonly'
I0728 07:46:56.837229 27221 http.cpp:993] Creating default 'basic' HTTP authenticator for
realm 'mesos-agent-readwrite'
I0728 07:46:56.837311 27221 http.cpp:1014] Creating default 'jwt' HTTP authenticator for realm
'mesos-agent-readwrite'
I0728 07:46:56.838575 27221 slave.cpp:565] Agent resources: [{"name":"cpus","scalar":{"value":2.0},"type":"SCALAR"},{"name":"mem","scalar":{"value":1024.0},"type":"SCALAR"},{"name":"disk","scalar":{"value":1024.0},"type":"SCALAR"},{"name":"ports","ranges":{"range":[{"begin":31000,"end":32000}]},"type":"RANGES"}]
I0728 07:46:56.838796 27221 slave.cpp:573] Agent attributes: [  ]
I0728 07:46:56.838810 27221 slave.cpp:582] Agent hostname: 738f89b9c788
I0728 07:46:56.838935 27205 status_update_manager.cpp:177] Pausing sending status updates
I0728 07:46:56.840278 27217 state.cpp:64] Recovering state from '/tmp/Endpoint_SlaveEndpointTest_NoAuthorizer_1_ALbxSn/meta'
I0728 07:46:56.840543 27222 status_update_manager.cpp:203] Recovering status update manager
I0728 07:46:56.840706 27203 containerizer.cpp:582] Recovering containerizer
I0728 07:46:56.841882 27225 provisioner.cpp:416] Provisioner recovery complete
I0728 07:46:56.842176 27219 slave.cpp:6207] Finished recovery
I0728 07:46:56.842622 27219 slave.cpp:6389] Querying resource estimator for oversubscribable
resources
I0728 07:46:56.842816 27204 slave.cpp:6403] Received oversubscribable resources {} from the
resource estimator
I0728 07:46:56.844622 27203 process.cpp:3837] Handling HTTP event for process 'slave(807)'
with path: '/slave(807)/monitor/statistics.json'
I0728 07:46:56.846523 27209 http.cpp:1133] HTTP GET for /slave(807)/monitor/statistics.json
from 172.17.0.6:45114
I0728 07:46:56.846590 27209 http.cpp:957] Authorizing principal 'test-principal' to GET the
'/monitor/statistics.json' endpoint
I0728 07:46:56.849427 27219 slave.cpp:843] Agent terminating
[       OK ] Endpoint/SlaveEndpointTest.NoAuthorizer/1 (28 ms)
[ RUN      ] Endpoint/SlaveEndpointTest.NoAuthorizer/2
I0728 07:46:56.860211  6611 containerizer.cpp:230] Using isolation: posix/cpu,posix/mem,filesystem/posix,network/cni,environment_secret
W0728 07:46:56.860679  6611 backend.cpp:76] Failed to create 'aufs' backend: AufsBackend requires
root privileges
W0728 07:46:56.860800  6611 backend.cpp:76] Failed to create 'bind' backend: BindBackend requires
root privileges
I0728 07:46:56.860841  6611 provisioner.cpp:255] Using default backend 'copy'
I0728 07:46:56.862397  6611 cluster.cpp:448] Creating default 'local' authorizer
I0728 07:46:56.863929 27216 slave.cpp:250] Mesos agent started on (808)@172.17.0.6:37974
I0728 07:46:56.863968 27216 slave.cpp:251] Flags at startup: --acls="" --appc_simple_discovery_uri_prefix="http://"
--appc_store_dir="/tmp/Endpoint_SlaveEndpointTest_NoAuthorizer_2_dWVgGR/store/appc" --authenticate_http_executors="true"
--authenticate_http_readonly="true" --authenticate_http_readwrite="true" --authenticatee="crammd5"
--authentication_backoff_factor="1secs" --authorizer="local" --cgroups_cpu_enable_pids_and_tids_count="false"
--cgroups_enable_cfs="false" --cgroups_hierarchy="/sys/fs/cgroup" --cgroups_limit_swap="false"
--cgroups_root="mesos" --container_disk_watch_interval="15secs" --containerizers="mesos" --credential="/tmp/Endpoint_SlaveEndpointTest_NoAuthorizer_2_dWVgGR/credential"
--default_role="*" --disk_watch_interval="1mins" --docker="docker" --docker_kill_orphans="true"
--docker_registry="https://registry-1.docker.io" --docker_remove_delay="6hrs" --docker_socket="/var/run/docker.sock"
--docker_stop_timeout="0ns" --docker_store_dir="/tmp/Endpoint_SlaveEndpointTest_NoAuthorizer_2_dWVgGR/store/docker"
--docker_volume_checkpoint_dir="/var/run/mesos/isolators/docker/volume" --enforce_container_disk_quota="false"
--executor_registration_timeout="1mins" --executor_reregistration_timeout="2secs" --executor_secret_key="/tmp/Endpoint_SlaveEndpointTest_NoAuthorizer_2_dWVgGR/executor_secret_key"
--executor_shutdown_grace_period="5secs" --fetcher_cache_dir="/tmp/Endpoint_SlaveEndpointTest_NoAuthorizer_2_dWVgGR/fetch"
--fetcher_cache_size="2GB" --frameworks_home="" --gc_delay="1weeks" --gc_disk_headroom="0.1"
--hadoop_home="" --help="false" --hostname_lookup="true" --http_command_executor="false" --http_credentials="/tmp/Endpoint_SlaveEndpointTest_NoAuthorizer_2_dWVgGR/http_credentials"
--http_heartbeat_interval="30secs" --initialize_driver_logging="true" --isolation="posix/cpu,posix/mem"
--launcher="posix" --launcher_dir="/mesos/mesos-1.4.0/_build/src" --logbufsecs="0" --logging_level="INFO"
--max_completed_executors_per_framework="150" --oversubscribed_resources_interval="15secs"
--perf_duration="10secs" --perf_interval="1mins" --port="5051" --qos_correction_interval_min="0ns"
--quiet="false" --recover="reconnect" --recovery_timeout="15mins" --registration_backoff_factor="10ms"
--resources="cpus:2;gpus:0;mem:1024;disk:1024;ports:[31000-32000]" --revocable_cpu_low_priority="true"
--runtime_dir="/tmp/Endpoint_SlaveEndpointTest_NoAuthorizer_2_dWVgGR" --sandbox_directory="/mnt/mesos/sandbox"
--strict="true" --switch_user="true" --systemd_enable_support="true" --systemd_runtime_directory="/run/systemd/system"
--version="false" --work_dir="/tmp/Endpoint_SlaveEndpointTest_NoAuthorizer_2_yybBiz"
I0728 07:46:56.864354 27216 credentials.hpp:86] Loading credential for authentication from
'/tmp/Endpoint_SlaveEndpointTest_NoAuthorizer_2_dWVgGR/credential'
I0728 07:46:56.864504 27216 slave.cpp:283] Agent using credential for: test-principal
I0728 07:46:56.864526 27216 credentials.hpp:37] Loading credentials for authentication from
'/tmp/Endpoint_SlaveEndpointTest_NoAuthorizer_2_dWVgGR/http_credentials'
I0728 07:46:56.864804 27216 http.cpp:993] Creating default 'basic' HTTP authenticator for
realm 'mesos-agent-executor'
I0728 07:46:56.864910 27216 http.cpp:1014] Creating default 'jwt' HTTP authenticator for realm
'mesos-agent-executor'
I0728 07:46:56.865068 27216 http.cpp:993] Creating default 'basic' HTTP authenticator for
realm 'mesos-agent-readonly'
I0728 07:46:56.865151 27216 http.cpp:1014] Creating default 'jwt' HTTP authenticator for realm
'mesos-agent-readonly'
I0728 07:46:56.865294 27216 http.cpp:993] Creating default 'basic' HTTP authenticator for
realm 'mesos-agent-readwrite'
I0728 07:46:56.865375 27216 http.cpp:1014] Creating default 'jwt' HTTP authenticator for realm
'mesos-agent-readwrite'
I0728 07:46:56.866606 27216 slave.cpp:565] Agent resources: [{"name":"cpus","scalar":{"value":2.0},"type":"SCALAR"},{"name":"mem","scalar":{"value":1024.0},"type":"SCALAR"},{"name":"disk","scalar":{"value":1024.0},"type":"SCALAR"},{"name":"ports","ranges":{"range":[{"begin":31000,"end":32000}]},"type":"RANGES"}]
I0728 07:46:56.866821 27216 slave.cpp:573] Agent attributes: [  ]
I0728 07:46:56.866834 27216 slave.cpp:582] Agent hostname: 738f89b9c788
I0728 07:46:56.866946 27223 status_update_manager.cpp:177] Pausing sending status updates
I0728 07:46:56.868271 27220 state.cpp:64] Recovering state from '/tmp/Endpoint_SlaveEndpointTest_NoAuthorizer_2_yybBiz/meta'
I0728 07:46:56.868515 27212 status_update_manager.cpp:203] Recovering status update manager
I0728 07:46:56.868705 27208 containerizer.cpp:582] Recovering containerizer
I0728 07:46:56.869899 27209 provisioner.cpp:416] Provisioner recovery complete
I0728 07:46:56.870211 27219 slave.cpp:6207] Finished recovery
I0728 07:46:56.870625 27219 slave.cpp:6389] Querying resource estimator for oversubscribable
resources
I0728 07:46:56.870820 27218 slave.cpp:6403] Received oversubscribable resources {} from the
resource estimator
I0728 07:46:56.872673 27221 process.cpp:3837] Handling HTTP event for process 'slave(808)'
with path: '/slave(808)/containers'
I0728 07:46:56.874399 27202 http.cpp:1133] HTTP GET for /slave(808)/containers from 172.17.0.6:45116
I0728 07:46:56.874476 27202 http.cpp:957] Authorizing principal 'test-principal' to GET the
'/containers' endpoint
I0728 07:46:56.877732  6611 slave.cpp:843] Agent terminating
[       OK ] Endpoint/SlaveEndpointTest.NoAuthorizer/2 (28 ms)
[----------] 9 tests from Endpoint/SlaveEndpointTest (253 ms total)

[----------] Global test environment tear-down
[==========] 1659 tests from 183 test cases ran. (483526 ms total)
[  PASSED  ] 1658 tests.
[  FAILED  ] 1 test, listed below:
[  FAILED  ] ExamplesTest.PersistentVolumeFramework

 1 FAILED TEST
  YOU HAVE 20 DISABLED TESTS

I0728 07:46:56.955533 27226 process.cpp:1006] Failed to accept socket: future discarded
make[4]: *** [check-local] Error 1
make[4]: Leaving directory `/mesos/mesos-1.4.0/_build/src'
make[3]: *** [check-am] Error 2
make[3]: Leaving directory `/mesos/mesos-1.4.0/_build/src'
make[2]: *** [check] Error 2
make[2]: Leaving directory `/mesos/mesos-1.4.0/_build/src'
make[1]: *** [check-recursive] Error 1
make[1]: Leaving directory `/mesos/mesos-1.4.0/_build'
make: *** [distcheck] Error 1
+ docker rmi mesos-1501225237-10268
Untagged: mesos-1501225237-10268:latest
Deleted: sha256:ac474d8ce0b71321c7d416f7410134bf7a0a5c7f4df0f79801f1e0ca7efc29ce
Deleted: sha256:abe2de1c9325fe0337ee3d0838770aadc1d40d260bf25af7fe1cc73e4e933836
Deleted: sha256:5ecef84fbf047e485285edc41467018d513c7f77c13f63d1a75c1b0cca7c4479
Deleted: sha256:61672486036a5731afff0035a63b636b2ad666a1b0bc94bb5817d46f72eb8861
Deleted: sha256:bc7361dd98792621e29a63cd2893d192e69ee7760239f0e5a75db9983f678c85
Deleted: sha256:4ac30b1f34afd79c079718024e96f5cb64c0437340343f3cbb25b5935df78195
Deleted: sha256:1d25d38ded8c9911765b35fdb234fb05fa1443fcc8b8892bd1388e6abc8db0f1
Deleted: sha256:ccb62118c0ec215415d361f9cc7b346c25a9fab379ff79e64b230b6a255765d0
Deleted: sha256:7bbd86c75225d5073615ce7ad3be486ca84d7bfeece21b98ca41f6de28cdb84c
Deleted: sha256:dacf44e4c1bc4befe6107d45dfad41a06fd0e55067e52c9191b4e09e9186f283
Deleted: sha256:6a846b0a76377f6e35d301d315ebec3711e2408c93b45686cbd03fe73f885732
Deleted: sha256:3cc0964c122b3283ed56adf244969dabda231026999c569b1dc9ade21994648b
Deleted: sha256:bc78ca9bab933a4888ca48e81813151763af44de80cff26b7e616fa0806c089d
Deleted: sha256:c40b6bace58d3211571f293e60bdbd16a1fdd69dd13ec9b2e5b6b0fafd728232
Deleted: sha256:420278641aa2ad01ef207e1f357fd1308737b8921997757679f2d83809dcdae5
Deleted: sha256:9e942b56236764fb7db23a320b77e8bd8ded2015a072c57ffd14b4029325838e
Deleted: sha256:3328e05ca4892b33d2db932bfaf4a3777c19af944e955172f584208bc0666b93
Deleted: sha256:74a9227442b9bf023037fda8265af71f45f571d979a415844590a8ef200c375d
Deleted: sha256:e2bb6b6474d2737dae5911de9796d13638e407f19108eaeb0ff738cefb7fb6b1
Deleted: sha256:f2e4ab0831f7e16fd37658da84f6c3a20897df96743fae035928a164ad62d443
Deleted: sha256:3ab706001aa728f600bab578113c3f9c6944bdfc84b969ab70df476397331ab0
Deleted: sha256:28a03433304c7966fc7a5b19b4c821b72f6ee61af0f9822e4623792e6afaaa39
Deleted: sha256:b2b94fce769e844e6133081e3a6887f7ef9fa896a5cbf2ca7769084e60fe340c
Deleted: sha256:e5678f95596dc99727e8a85019e1915b643f6ffa7e8ae9a3e066e97b6d1d34bd
Build step 'Execute shell' marked build as failure
Not sending mail to unregistered user songzihao1990@gmail.com

Mime
View raw message