mesos-builds mailing list archives

Site index · List index
Message view « Date » · « Thread »
Top « Date » · « Thread »
From Apache Jenkins Server <jenk...@builds.apache.org>
Subject Build failed in Jenkins: Mesos-Buildbot » cmake,clang,--verbose,GLOG_v=1 MESOS_VERBOSE=1,ubuntu:14.04,(ubuntu)&&(!ubuntu-us1)&&(!ubuntu-eu2) #3902
Date Wed, 12 Jul 2017 05:03:37 GMT
See <https://builds.apache.org/job/Mesos-Buildbot/BUILDTOOL=cmake,COMPILER=clang,CONFIGURATION=--verbose,ENVIRONMENT=GLOG_v=1%20MESOS_VERBOSE=1,OS=ubuntu%3A14.04,label_exp=(ubuntu)&&(!ubuntu-us1)&&(!ubuntu-eu2)/3902/display/redirect?page=changes>

Changes:

[yujie.jay] Fixed persistent volume and host volume conflict issue.

[yujie.jay] Added MESOS-7770 to 1.3.1 CHANGELOG.

------------------------------------------
[...truncated 24.85 MB...]
I0712 05:03:31.215294 23912 http.cpp:936] Authorizing principal 'test-principal' to GET the
'/monitor/statistics.json' endpoint
I0712 05:03:31.218014 23904 slave.cpp:796] Agent terminating
[       OK ] Endpoint/SlaveEndpointTest.AuthorizedRequest/1 (17 ms)
[ RUN      ] Endpoint/SlaveEndpointTest.AuthorizedRequest/2
I0712 05:03:31.225422 23904 containerizer.cpp:221] Using isolation: posix/cpu,posix/mem,filesystem/posix,network/cni
W0712 05:03:31.225852 23904 backend.cpp:76] Failed to create 'overlay' backend: OverlayBackend
requires root privileges
W0712 05:03:31.225913 23904 backend.cpp:76] Failed to create 'bind' backend: BindBackend requires
root privileges
I0712 05:03:31.225935 23904 provisioner.cpp:249] Using default backend 'copy'
I0712 05:03:31.227607 23906 slave.cpp:231] Mesos agent started on (737)@172.17.0.2:42981
I0712 05:03:31.227659 23906 slave.cpp:232] Flags at startup: --acls="" --appc_simple_discovery_uri_prefix="http://"
--appc_store_dir="/tmp/mesos/store/appc" --authenticate_http_readonly="true" --authenticate_http_readwrite="true"
--authenticatee="crammd5" --authentication_backoff_factor="1secs" --authorizer="local" --cgroups_cpu_enable_pids_and_tids_count="false"
--cgroups_enable_cfs="false" --cgroups_hierarchy="/sys/fs/cgroup" --cgroups_limit_swap="false"
--cgroups_root="mesos" --container_disk_watch_interval="15secs" --containerizers="mesos" --credential="/tmp/Endpoint_SlaveEndpointTest_AuthorizedRequest_2_lgKGeF/credential"
--default_role="*" --disk_watch_interval="1mins" --docker="docker" --docker_kill_orphans="true"
--docker_registry="https://registry-1.docker.io" --docker_remove_delay="6hrs" --docker_socket="/var/run/docker.sock"
--docker_stop_timeout="0ns" --docker_store_dir="/tmp/mesos/store/docker" --docker_volume_checkpoint_dir="/var/run/mesos/isolators/docker/volume"
--enforce_container_disk_quota="false" --executor_registration_timeout="1mins" --executor_reregistration_timeout="2secs"
--executor_shutdown_grace_period="5secs" --fetcher_cache_dir="/tmp/Endpoint_SlaveEndpointTest_AuthorizedRequest_2_lgKGeF/fetch"
--fetcher_cache_size="2GB" --frameworks_home="" --gc_delay="1weeks" --gc_disk_headroom="0.1"
--hadoop_home="" --help="false" --hostname_lookup="true" --http_command_executor="false" --http_credentials="/tmp/Endpoint_SlaveEndpointTest_AuthorizedRequest_2_lgKGeF/http_credentials"
--http_heartbeat_interval="30secs" --initialize_driver_logging="true" --isolation="posix/cpu,posix/mem"
--launcher="posix" --launcher_dir="/mesos/build/src" --logbufsecs="0" --logging_level="INFO"
--max_completed_executors_per_framework="150" --oversubscribed_resources_interval="15secs"
--perf_duration="10secs" --perf_interval="1mins" --port="5051" --qos_correction_interval_min="0ns"
--quiet="false" --recover="reconnect" --recovery_timeout="15mins" --registration_backoff_factor="10ms"
--resources="cpus:2;gpus:0;mem:1024;disk:1024;ports:[31000-32000]" --revocable_cpu_low_priority="true"
--runtime_dir="/tmp/Endpoint_SlaveEndpointTest_AuthorizedRequest_2_lgKGeF" --sandbox_directory="/mnt/mesos/sandbox"
--strict="true" --switch_user="true" --systemd_enable_support="true" --systemd_runtime_directory="/run/systemd/system"
--version="false" --work_dir="/tmp/Endpoint_SlaveEndpointTest_AuthorizedRequest_2_zLaLYC"
I0712 05:03:31.227999 23906 credentials.hpp:86] Loading credential for authentication from
'/tmp/Endpoint_SlaveEndpointTest_AuthorizedRequest_2_lgKGeF/credential'
I0712 05:03:31.228148 23906 slave.cpp:264] Agent using credential for: test-principal
I0712 05:03:31.228163 23906 credentials.hpp:37] Loading credentials for authentication from
'/tmp/Endpoint_SlaveEndpointTest_AuthorizedRequest_2_lgKGeF/http_credentials'
I0712 05:03:31.228292 23906 http.cpp:975] Creating default 'basic' HTTP authenticator for
realm 'mesos-agent-readonly'
I0712 05:03:31.228364 23906 http.cpp:975] Creating default 'basic' HTTP authenticator for
realm 'mesos-agent-readwrite'
I0712 05:03:31.228978 23906 slave.cpp:531] Agent resources: cpus(*):2; mem(*):1024; disk(*):1024;
ports(*):[31000-32000]
I0712 05:03:31.229034 23906 slave.cpp:539] Agent attributes: [  ]
I0712 05:03:31.229046 23906 slave.cpp:544] Agent hostname: 99c99af9aa60
I0712 05:03:31.229209 23912 status_update_manager.cpp:177] Pausing sending status updates
I0712 05:03:31.229545 23905 state.cpp:62] Recovering state from '/tmp/Endpoint_SlaveEndpointTest_AuthorizedRequest_2_zLaLYC/meta'
I0712 05:03:31.229707 23905 status_update_manager.cpp:203] Recovering status update manager
I0712 05:03:31.229796 23905 containerizer.cpp:608] Recovering containerizer
I0712 05:03:31.230898 23910 provisioner.cpp:410] Provisioner recovery complete
I0712 05:03:31.231154 23909 slave.cpp:6075] Finished recovery
I0712 05:03:31.231672 23909 slave.cpp:6257] Querying resource estimator for oversubscribable
resources
I0712 05:03:31.231842 23911 slave.cpp:6271] Received oversubscribable resources {} from the
resource estimator
I0712 05:03:31.233033 23908 process.cpp:3741] Handling HTTP event for process 'slave(737)'
with path: '/slave(737)/containers'
I0712 05:03:31.233757 23908 http.cpp:1115] HTTP GET for /slave(737)/containers from 172.17.0.2:41468
I0712 05:03:31.233816 23908 http.cpp:936] Authorizing principal 'test-principal' to GET the
'/containers' endpoint
I0712 05:03:31.235646 23904 slave.cpp:796] Agent terminating
[       OK ] Endpoint/SlaveEndpointTest.AuthorizedRequest/2 (17 ms)
[ RUN      ] Endpoint/SlaveEndpointTest.UnauthorizedRequest/0
I0712 05:03:31.242604 23904 containerizer.cpp:221] Using isolation: posix/cpu,posix/mem,filesystem/posix,network/cni
W0712 05:03:31.243017 23904 backend.cpp:76] Failed to create 'overlay' backend: OverlayBackend
requires root privileges
W0712 05:03:31.243093 23904 backend.cpp:76] Failed to create 'bind' backend: BindBackend requires
root privileges
I0712 05:03:31.243115 23904 provisioner.cpp:249] Using default backend 'copy'
I0712 05:03:31.244874 23912 slave.cpp:231] Mesos agent started on (738)@172.17.0.2:42981
I0712 05:03:31.244926 23912 slave.cpp:232] Flags at startup: --acls="" --appc_simple_discovery_uri_prefix="http://"
--appc_store_dir="/tmp/mesos/store/appc" --authenticate_http_readonly="true" --authenticate_http_readwrite="true"
--authenticatee="crammd5" --authentication_backoff_factor="1secs" --authorizer="local" --cgroups_cpu_enable_pids_and_tids_count="false"
--cgroups_enable_cfs="false" --cgroups_hierarchy="/sys/fs/cgroup" --cgroups_limit_swap="false"
--cgroups_root="mesos" --container_disk_watch_interval="15secs" --containerizers="mesos" --credential="/tmp/Endpoint_SlaveEndpointTest_UnauthorizedRequest_0_DFiRpO/credential"
--default_role="*" --disk_watch_interval="1mins" --docker="docker" --docker_kill_orphans="true"
--docker_registry="https://registry-1.docker.io" --docker_remove_delay="6hrs" --docker_socket="/var/run/docker.sock"
--docker_stop_timeout="0ns" --docker_store_dir="/tmp/mesos/store/docker" --docker_volume_checkpoint_dir="/var/run/mesos/isolators/docker/volume"
--enforce_container_disk_quota="false" --executor_registration_timeout="1mins" --executor_reregistration_timeout="2secs"
--executor_shutdown_grace_period="5secs" --fetcher_cache_dir="/tmp/Endpoint_SlaveEndpointTest_UnauthorizedRequest_0_DFiRpO/fetch"
--fetcher_cache_size="2GB" --frameworks_home="" --gc_delay="1weeks" --gc_disk_headroom="0.1"
--hadoop_home="" --help="false" --hostname_lookup="true" --http_command_executor="false" --http_credentials="/tmp/Endpoint_SlaveEndpointTest_UnauthorizedRequest_0_DFiRpO/http_credentials"
--http_heartbeat_interval="30secs" --initialize_driver_logging="true" --isolation="posix/cpu,posix/mem"
--launcher="posix" --launcher_dir="/mesos/build/src" --logbufsecs="0" --logging_level="INFO"
--max_completed_executors_per_framework="150" --oversubscribed_resources_interval="15secs"
--perf_duration="10secs" --perf_interval="1mins" --port="5051" --qos_correction_interval_min="0ns"
--quiet="false" --recover="reconnect" --recovery_timeout="15mins" --registration_backoff_factor="10ms"
--resources="cpus:2;gpus:0;mem:1024;disk:1024;ports:[31000-32000]" --revocable_cpu_low_priority="true"
--runtime_dir="/tmp/Endpoint_SlaveEndpointTest_UnauthorizedRequest_0_DFiRpO" --sandbox_directory="/mnt/mesos/sandbox"
--strict="true" --switch_user="true" --systemd_enable_support="true" --systemd_runtime_directory="/run/systemd/system"
--version="false" --work_dir="/tmp/Endpoint_SlaveEndpointTest_UnauthorizedRequest_0_VqQ76L"
I0712 05:03:31.245414 23912 credentials.hpp:86] Loading credential for authentication from
'/tmp/Endpoint_SlaveEndpointTest_UnauthorizedRequest_0_DFiRpO/credential'
I0712 05:03:31.245563 23912 slave.cpp:264] Agent using credential for: test-principal
I0712 05:03:31.245579 23912 credentials.hpp:37] Loading credentials for authentication from
'/tmp/Endpoint_SlaveEndpointTest_UnauthorizedRequest_0_DFiRpO/http_credentials'
I0712 05:03:31.245851 23912 http.cpp:975] Creating default 'basic' HTTP authenticator for
realm 'mesos-agent-readonly'
I0712 05:03:31.245940 23912 http.cpp:975] Creating default 'basic' HTTP authenticator for
realm 'mesos-agent-readwrite'
I0712 05:03:31.246784 23912 slave.cpp:531] Agent resources: cpus(*):2; mem(*):1024; disk(*):1024;
ports(*):[31000-32000]
I0712 05:03:31.246852 23912 slave.cpp:539] Agent attributes: [  ]
I0712 05:03:31.246866 23912 slave.cpp:544] Agent hostname: 99c99af9aa60
I0712 05:03:31.246999 23906 status_update_manager.cpp:177] Pausing sending status updates
I0712 05:03:31.247505 23911 state.cpp:62] Recovering state from '/tmp/Endpoint_SlaveEndpointTest_UnauthorizedRequest_0_VqQ76L/meta'
I0712 05:03:31.247704 23908 status_update_manager.cpp:203] Recovering status update manager
I0712 05:03:31.247819 23909 containerizer.cpp:608] Recovering containerizer
I0712 05:03:31.248816 23911 provisioner.cpp:410] Provisioner recovery complete
I0712 05:03:31.249213 23911 slave.cpp:6075] Finished recovery
I0712 05:03:31.249845 23911 slave.cpp:6257] Querying resource estimator for oversubscribable
resources
I0712 05:03:31.250217 23911 slave.cpp:6271] Received oversubscribable resources {} from the
resource estimator
I0712 05:03:31.251471 23908 process.cpp:3741] Handling HTTP event for process 'slave(738)'
with path: '/slave(738)/monitor/statistics'
I0712 05:03:31.252065 23907 http.cpp:1115] HTTP GET for /slave(738)/monitor/statistics from
172.17.0.2:41470
I0712 05:03:31.252223 23907 http.cpp:936] Authorizing principal 'test-principal' to GET the
'/monitor/statistics' endpoint
I0712 05:03:31.253940 23904 slave.cpp:796] Agent terminating
[       OK ] Endpoint/SlaveEndpointTest.UnauthorizedRequest/0 (18 ms)
[ RUN      ] Endpoint/SlaveEndpointTest.UnauthorizedRequest/1
I0712 05:03:31.260843 23904 containerizer.cpp:221] Using isolation: posix/cpu,posix/mem,filesystem/posix,network/cni
W0712 05:03:31.261255 23904 backend.cpp:76] Failed to create 'overlay' backend: OverlayBackend
requires root privileges
W0712 05:03:31.261320 23904 backend.cpp:76] Failed to create 'bind' backend: BindBackend requires
root privileges
I0712 05:03:31.261343 23904 provisioner.cpp:249] Using default backend 'copy'
I0712 05:03:31.262876 23908 slave.cpp:231] Mesos agent started on (739)@172.17.0.2:42981
I0712 05:03:31.262923 23908 slave.cpp:232] Flags at startup: --acls="" --appc_simple_discovery_uri_prefix="http://"
--appc_store_dir="/tmp/mesos/store/appc" --authenticate_http_readonly="true" --authenticate_http_readwrite="true"
--authenticatee="crammd5" --authentication_backoff_factor="1secs" --authorizer="local" --cgroups_cpu_enable_pids_and_tids_count="false"
--cgroups_enable_cfs="false" --cgroups_hierarchy="/sys/fs/cgroup" --cgroups_limit_swap="false"
--cgroups_root="mesos" --container_disk_watch_interval="15secs" --containerizers="mesos" --credential="/tmp/Endpoint_SlaveEndpointTest_UnauthorizedRequest_1_BiNOMX/credential"
--default_role="*" --disk_watch_interval="1mins" --docker="docker" --docker_kill_orphans="true"
--docker_registry="https://registry-1.docker.io" --docker_remove_delay="6hrs" --docker_socket="/var/run/docker.sock"
--docker_stop_timeout="0ns" --docker_store_dir="/tmp/mesos/store/docker" --docker_volume_checkpoint_dir="/var/run/mesos/isolators/docker/volume"
--enforce_container_disk_quota="false" --executor_registration_timeout="1mins" --executor_reregistration_timeout="2secs"
--executor_shutdown_grace_period="5secs" --fetcher_cache_dir="/tmp/Endpoint_SlaveEndpointTest_UnauthorizedRequest_1_BiNOMX/fetch"
--fetcher_cache_size="2GB" --frameworks_home="" --gc_delay="1weeks" --gc_disk_headroom="0.1"
--hadoop_home="" --help="false" --hostname_lookup="true" --http_command_executor="false" --http_credentials="/tmp/Endpoint_SlaveEndpointTest_UnauthorizedRequest_1_BiNOMX/http_credentials"
--http_heartbeat_interval="30secs" --initialize_driver_logging="true" --isolation="posix/cpu,posix/mem"
--launcher="posix" --launcher_dir="/mesos/build/src" --logbufsecs="0" --logging_level="INFO"
--max_completed_executors_per_framework="150" --oversubscribed_resources_interval="15secs"
--perf_duration="10secs" --perf_interval="1mins" --port="5051" --qos_correction_interval_min="0ns"
--quiet="false" --recover="reconnect" --recovery_timeout="15mins" --registration_backoff_factor="10ms"
--resources="cpus:2;gpus:0;mem:1024;disk:1024;ports:[31000-32000]" --revocable_cpu_low_priority="true"
--runtime_dir="/tmp/Endpoint_SlaveEndpointTest_UnauthorizedRequest_1_BiNOMX" --sandbox_directory="/mnt/mesos/sandbox"
--strict="true" --switch_user="true" --systemd_enable_support="true" --systemd_runtime_directory="/run/systemd/system"
--version="false" --work_dir="/tmp/Endpoint_SlaveEndpointTest_UnauthorizedRequest_1_x0A8qV"
I0712 05:03:31.263273 23908 credentials.hpp:86] Loading credential for authentication from
'/tmp/Endpoint_SlaveEndpointTest_UnauthorizedRequest_1_BiNOMX/credential'
I0712 05:03:31.263403 23908 slave.cpp:264] Agent using credential for: test-principal
I0712 05:03:31.263418 23908 credentials.hpp:37] Loading credentials for authentication from
'/tmp/Endpoint_SlaveEndpointTest_UnauthorizedRequest_1_BiNOMX/http_credentials'
I0712 05:03:31.263542 23908 http.cpp:975] Creating default 'basic' HTTP authenticator for
realm 'mesos-agent-readonly'
I0712 05:03:31.263620 23908 http.cpp:975] Creating default 'basic' HTTP authenticator for
realm 'mesos-agent-readwrite'
I0712 05:03:31.264250 23908 slave.cpp:531] Agent resources: cpus(*):2; mem(*):1024; disk(*):1024;
ports(*):[31000-32000]
I0712 05:03:31.264309 23908 slave.cpp:539] Agent attributes: [  ]
I0712 05:03:31.264323 23908 slave.cpp:544] Agent hostname: 99c99af9aa60
I0712 05:03:31.264626 23907 status_update_manager.cpp:177] Pausing sending status updates
I0712 05:03:31.265115 23912 state.cpp:62] Recovering state from '/tmp/Endpoint_SlaveEndpointTest_UnauthorizedRequest_1_x0A8qV/meta'
I0712 05:03:31.265296 23908 status_update_manager.cpp:203] Recovering status update manager
I0712 05:03:31.265411 23909 containerizer.cpp:608] Recovering containerizer
I0712 05:03:31.266191 23905 provisioner.cpp:410] Provisioner recovery complete
I0712 05:03:31.266419 23909 slave.cpp:6075] Finished recovery
I0712 05:03:31.266933 23909 slave.cpp:6257] Querying resource estimator for oversubscribable
resources
I0712 05:03:31.267060 23905 slave.cpp:6271] Received oversubscribable resources {} from the
resource estimator
I0712 05:03:31.268231 23910 process.cpp:3741] Handling HTTP event for process 'slave(739)'
with path: '/slave(739)/monitor/statistics.json'
I0712 05:03:31.268827 23905 http.cpp:1115] HTTP GET for /slave(739)/monitor/statistics.json
from 172.17.0.2:41472
I0712 05:03:31.268887 23905 http.cpp:936] Authorizing principal 'test-principal' to GET the
'/monitor/statistics.json' endpoint
I0712 05:03:31.270913 23904 slave.cpp:796] Agent terminating
[       OK ] Endpoint/SlaveEndpointTest.UnauthorizedRequest/1 (17 ms)
[ RUN      ] Endpoint/SlaveEndpointTest.UnauthorizedRequest/2
I0712 05:03:31.278349 23904 containerizer.cpp:221] Using isolation: posix/cpu,posix/mem,filesystem/posix,network/cni
W0712 05:03:31.278764 23904 backend.cpp:76] Failed to create 'overlay' backend: OverlayBackend
requires root privileges
W0712 05:03:31.278834 23904 backend.cpp:76] Failed to create 'bind' backend: BindBackend requires
root privileges
I0712 05:03:31.278856 23904 provisioner.cpp:249] Using default backend 'copy'
I0712 05:03:31.280484 23908 slave.cpp:231] Mesos agent started on (740)@172.17.0.2:42981
I0712 05:03:31.280532 23908 slave.cpp:232] Flags at startup: --acls="" --appc_simple_discovery_uri_prefix="http://"
--appc_store_dir="/tmp/mesos/store/appc" --authenticate_http_readonly="true" --authenticate_http_readwrite="true"
--authenticatee="crammd5" --authentication_backoff_factor="1secs" --authorizer="local" --cgroups_cpu_enable_pids_and_tids_count="false"
--cgroups_enable_cfs="false" --cgroups_hierarchy="/sys/fs/cgroup" --cgroups_limit_swap="false"
--cgroups_root="mesos" --container_disk_watch_interval="15secs" --containerizers="mesos" --credential="/tmp/Endpoint_SlaveEndpointTest_UnauthorizedRequest_2_7U01k7/credential"
--default_role="*" --disk_watch_interval="1mins" --docker="docker" --docker_kill_orphans="true"
--docker_registry="https://registry-1.docker.io" --docker_remove_delay="6hrs" --docker_socket="/var/run/docker.sock"
--docker_stop_timeout="0ns" --docker_store_dir="/tmp/mesos/store/docker" --docker_volume_checkpoint_dir="/var/run/mesos/isolators/docker/volume"
--enforce_container_disk_quota="false" --executor_registration_timeout="1mins" --executor_reregistration_timeout="2secs"
--executor_shutdown_grace_period="5secs" --fetcher_cache_dir="/tmp/Endpoint_SlaveEndpointTest_UnauthorizedRequest_2_7U01k7/fetch"
--fetcher_cache_size="2GB" --frameworks_home="" --gc_delay="1weeks" --gc_disk_headroom="0.1"
--hadoop_home="" --help="false" --hostname_lookup="true" --http_command_executor="false" --http_credentials="/tmp/Endpoint_SlaveEndpointTest_UnauthorizedRequest_2_7U01k7/http_credentials"
--http_heartbeat_interval="30secs" --initialize_driver_logging="true" --isolation="posix/cpu,posix/mem"
--launcher="posix" --launcher_dir="/mesos/build/src" --logbufsecs="0" --logging_level="INFO"
--max_completed_executors_per_framework="150" --oversubscribed_resources_interval="15secs"
--perf_duration="10secs" --perf_interval="1mins" --port="5051" --qos_correction_interval_min="0ns"
--quiet="false" --recover="reconnect" --recovery_timeout="15mins" --registration_backoff_factor="10ms"
--resources="cpus:2;gpus:0;mem:1024;disk:1024;ports:[31000-32000]" --revocable_cpu_low_priority="true"
--runtime_dir="/tmp/Endpoint_SlaveEndpointTest_UnauthorizedRequest_2_7U01k7" --sandbox_directory="/mnt/mesos/sandbox"
--strict="true" --switch_user="true" --systemd_enable_support="true" --systemd_runtime_directory="/run/systemd/system"
--version="false" --work_dir="/tmp/Endpoint_SlaveEndpointTest_UnauthorizedRequest_2_1XBwW4"
I0712 05:03:31.280881 23908 credentials.hpp:86] Loading credential for authentication from
'/tmp/Endpoint_SlaveEndpointTest_UnauthorizedRequest_2_7U01k7/credential'
I0712 05:03:31.281011 23908 slave.cpp:264] Agent using credential for: test-principal
I0712 05:03:31.281026 23908 credentials.hpp:37] Loading credentials for authentication from
'/tmp/Endpoint_SlaveEndpointTest_UnauthorizedRequest_2_7U01k7/http_credentials'
I0712 05:03:31.281148 23908 http.cpp:975] Creating default 'basic' HTTP authenticator for
realm 'mesos-agent-readonly'
I0712 05:03:31.281226 23908 http.cpp:975] Creating default 'basic' HTTP authenticator for
realm 'mesos-agent-readwrite'
I0712 05:03:31.281864 23908 slave.cpp:531] Agent resources: cpus(*):2; mem(*):1024; disk(*):1024;
ports(*):[31000-32000]
I0712 05:03:31.281919 23908 slave.cpp:539] Agent attributes: [  ]
I0712 05:03:31.281932 23908 slave.cpp:544] Agent hostname: 99c99af9aa60
I0712 05:03:31.282017 23906 status_update_manager.cpp:177] Pausing sending status updates
I0712 05:03:31.282457 23910 state.cpp:62] Recovering state from '/tmp/Endpoint_SlaveEndpointTest_UnauthorizedRequest_2_1XBwW4/meta'
I0712 05:03:31.282661 23905 status_update_manager.cpp:203] Recovering status update manager
I0712 05:03:31.282747 23905 containerizer.cpp:608] Recovering containerizer
I0712 05:03:31.283615 23907 provisioner.cpp:410] Provisioner recovery complete
I0712 05:03:31.284029 23906 slave.cpp:6075] Finished recovery
I0712 05:03:31.284523 23906 slave.cpp:6257] Querying resource estimator for oversubscribable
resources
I0712 05:03:31.284657 23905 slave.cpp:6271] Received oversubscribable resources {} from the
resource estimator
I0712 05:03:31.285789 23911 process.cpp:3741] Handling HTTP event for process 'slave(740)'
with path: '/slave(740)/containers'
I0712 05:03:31.286526 23907 http.cpp:1115] HTTP GET for /slave(740)/containers from 172.17.0.2:41474
I0712 05:03:31.286598 23907 http.cpp:936] Authorizing principal 'test-principal' to GET the
'/containers' endpoint
I0712 05:03:31.288056 23908 slave.cpp:796] Agent terminating
[       OK ] Endpoint/SlaveEndpointTest.UnauthorizedRequest/2 (16 ms)
[ RUN      ] Endpoint/SlaveEndpointTest.NoAuthorizer/0
I0712 05:03:31.295336 23904 containerizer.cpp:221] Using isolation: posix/cpu,posix/mem,filesystem/posix,network/cni
W0712 05:03:31.295752 23904 backend.cpp:76] Failed to create 'overlay' backend: OverlayBackend
requires root privileges
W0712 05:03:31.295817 23904 backend.cpp:76] Failed to create 'bind' backend: BindBackend requires
root privileges
I0712 05:03:31.295840 23904 provisioner.cpp:249] Using default backend 'copy'
I0712 05:03:31.296588 23904 cluster.cpp:448] Creating default 'local' authorizer
I0712 05:03:31.297346 23910 slave.cpp:231] Mesos agent started on (741)@172.17.0.2:42981
I0712 05:03:31.297392 23910 slave.cpp:232] Flags at startup: --acls="" --appc_simple_discovery_uri_prefix="http://"
--appc_store_dir="/tmp/mesos/store/appc" --authenticate_http_readonly="true" --authenticate_http_readwrite="true"
--authenticatee="crammd5" --authentication_backoff_factor="1secs" --authorizer="local" --cgroups_cpu_enable_pids_and_tids_count="false"
--cgroups_enable_cfs="false" --cgroups_hierarchy="/sys/fs/cgroup" --cgroups_limit_swap="false"
--cgroups_root="mesos" --container_disk_watch_interval="15secs" --containerizers="mesos" --credential="/tmp/Endpoint_SlaveEndpointTest_NoAuthorizer_0_dgGi4g/credential"
--default_role="*" --disk_watch_interval="1mins" --docker="docker" --docker_kill_orphans="true"
--docker_registry="https://registry-1.docker.io" --docker_remove_delay="6hrs" --docker_socket="/var/run/docker.sock"
--docker_stop_timeout="0ns" --docker_store_dir="/tmp/mesos/store/docker" --docker_volume_checkpoint_dir="/var/run/mesos/isolators/docker/volume"
--enforce_container_disk_quota="false" --executor_registration_timeout="1mins" --executor_reregistration_timeout="2secs"
--executor_shutdown_grace_period="5secs" --fetcher_cache_dir="/tmp/Endpoint_SlaveEndpointTest_NoAuthorizer_0_dgGi4g/fetch"
--fetcher_cache_size="2GB" --frameworks_home="" --gc_delay="1weeks" --gc_disk_headroom="0.1"
--hadoop_home="" --help="false" --hostname_lookup="true" --http_command_executor="false" --http_credentials="/tmp/Endpoint_SlaveEndpointTest_NoAuthorizer_0_dgGi4g/http_credentials"
--http_heartbeat_interval="30secs" --initialize_driver_logging="true" --isolation="posix/cpu,posix/mem"
--launcher="posix" --launcher_dir="/mesos/build/src" --logbufsecs="0" --logging_level="INFO"
--max_completed_executors_per_framework="150" --oversubscribed_resources_interval="15secs"
--perf_duration="10secs" --perf_interval="1mins" --port="5051" --qos_correction_interval_min="0ns"
--quiet="false" --recover="reconnect" --recovery_timeout="15mins" --registration_backoff_factor="10ms"
--resources="cpus:2;gpus:0;mem:1024;disk:1024;ports:[31000-32000]" --revocable_cpu_low_priority="true"
--runtime_dir="/tmp/Endpoint_SlaveEndpointTest_NoAuthorizer_0_dgGi4g" --sandbox_directory="/mnt/mesos/sandbox"
--strict="true" --switch_user="true" --systemd_enable_support="true" --systemd_runtime_directory="/run/systemd/system"
--version="false" --work_dir="/tmp/Endpoint_SlaveEndpointTest_NoAuthorizer_0_tMw3Ce"
I0712 05:03:31.297771 23910 credentials.hpp:86] Loading credential for authentication from
'/tmp/Endpoint_SlaveEndpointTest_NoAuthorizer_0_dgGi4g/credential'
I0712 05:03:31.297914 23910 slave.cpp:264] Agent using credential for: test-principal
I0712 05:03:31.297929 23910 credentials.hpp:37] Loading credentials for authentication from
'/tmp/Endpoint_SlaveEndpointTest_NoAuthorizer_0_dgGi4g/http_credentials'
I0712 05:03:31.298061 23910 http.cpp:975] Creating default 'basic' HTTP authenticator for
realm 'mesos-agent-readonly'
I0712 05:03:31.298138 23910 http.cpp:975] Creating default 'basic' HTTP authenticator for
realm 'mesos-agent-readwrite'
I0712 05:03:31.298753 23910 slave.cpp:531] Agent resources: cpus(*):2; mem(*):1024; disk(*):1024;
ports(*):[31000-32000]
I0712 05:03:31.298805 23910 slave.cpp:539] Agent attributes: [  ]
I0712 05:03:31.298818 23910 slave.cpp:544] Agent hostname: 99c99af9aa60
I0712 05:03:31.298929 23906 status_update_manager.cpp:177] Pausing sending status updates
I0712 05:03:31.299336 23910 state.cpp:62] Recovering state from '/tmp/Endpoint_SlaveEndpointTest_NoAuthorizer_0_tMw3Ce/meta'
I0712 05:03:31.299499 23909 status_update_manager.cpp:203] Recovering status update manager
I0712 05:03:31.299583 23909 containerizer.cpp:608] Recovering containerizer
I0712 05:03:31.300361 23906 provisioner.cpp:410] Provisioner recovery complete
I0712 05:03:31.300570 23906 slave.cpp:6075] Finished recovery
I0712 05:03:31.301148 23906 slave.cpp:6257] Querying resource estimator for oversubscribable
resources
I0712 05:03:31.301360 23907 slave.cpp:6271] Received oversubscribable resources {} from the
resource estimator
I0712 05:03:31.302448 23910 process.cpp:3741] Handling HTTP event for process 'slave(741)'
with path: '/slave(741)/monitor/statistics'
I0712 05:03:31.303056 23908 http.cpp:1115] HTTP GET for /slave(741)/monitor/statistics from
172.17.0.2:41476
I0712 05:03:31.303127 23908 http.cpp:936] Authorizing principal 'test-principal' to GET the
'/monitor/statistics' endpoint
I0712 05:03:31.304877 23904 slave.cpp:796] Agent terminating
[       OK ] Endpoint/SlaveEndpointTest.NoAuthorizer/0 (16 ms)
[ RUN      ] Endpoint/SlaveEndpointTest.NoAuthorizer/1
I0712 05:03:31.311887 23904 containerizer.cpp:221] Using isolation: posix/cpu,posix/mem,filesystem/posix,network/cni
W0712 05:03:31.312310 23904 backend.cpp:76] Failed to create 'overlay' backend: OverlayBackend
requires root privileges
W0712 05:03:31.312381 23904 backend.cpp:76] Failed to create 'bind' backend: BindBackend requires
root privileges
I0712 05:03:31.312405 23904 provisioner.cpp:249] Using default backend 'copy'
I0712 05:03:31.313195 23904 cluster.cpp:448] Creating default 'local' authorizer
I0712 05:03:31.313987 23910 slave.cpp:231] Mesos agent started on (742)@172.17.0.2:42981
I0712 05:03:31.314033 23910 slave.cpp:232] Flags at startup: --acls="" --appc_simple_discovery_uri_prefix="http://"
--appc_store_dir="/tmp/mesos/store/appc" --authenticate_http_readonly="true" --authenticate_http_readwrite="true"
--authenticatee="crammd5" --authentication_backoff_factor="1secs" --authorizer="local" --cgroups_cpu_enable_pids_and_tids_count="false"
--cgroups_enable_cfs="false" --cgroups_hierarchy="/sys/fs/cgroup" --cgroups_limit_swap="false"
--cgroups_root="mesos" --container_disk_watch_interval="15secs" --containerizers="mesos" --credential="/tmp/Endpoint_SlaveEndpointTest_NoAuthorizer_1_peWfYq/credential"
--default_role="*" --disk_watch_interval="1mins" --docker="docker" --docker_kill_orphans="true"
--docker_registry="https://registry-1.docker.io" --docker_remove_delay="6hrs" --docker_socket="/var/run/docker.sock"
--docker_stop_timeout="0ns" --docker_store_dir="/tmp/mesos/store/docker" --docker_volume_checkpoint_dir="/var/run/mesos/isolators/docker/volume"
--enforce_container_disk_quota="false" --executor_registration_timeout="1mins" --executor_reregistration_timeout="2secs"
--executor_shutdown_grace_period="5secs" --fetcher_cache_dir="/tmp/Endpoint_SlaveEndpointTest_NoAuthorizer_1_peWfYq/fetch"
--fetcher_cache_size="2GB" --frameworks_home="" --gc_delay="1weeks" --gc_disk_headroom="0.1"
--hadoop_home="" --help="false" --hostname_lookup="true" --http_command_executor="false" --http_credentials="/tmp/Endpoint_SlaveEndpointTest_NoAuthorizer_1_peWfYq/http_credentials"
--http_heartbeat_interval="30secs" --initialize_driver_logging="true" --isolation="posix/cpu,posix/mem"
--launcher="posix" --launcher_dir="/mesos/build/src" --logbufsecs="0" --logging_level="INFO"
--max_completed_executors_per_framework="150" --oversubscribed_resources_interval="15secs"
--perf_duration="10secs" --perf_interval="1mins" --port="5051" --qos_correction_interval_min="0ns"
--quiet="false" --recover="reconnect" --recovery_timeout="15mins" --registration_backoff_factor="10ms"
--resources="cpus:2;gpus:0;mem:1024;disk:1024;ports:[31000-32000]" --revocable_cpu_low_priority="true"
--runtime_dir="/tmp/Endpoint_SlaveEndpointTest_NoAuthorizer_1_peWfYq" --sandbox_directory="/mnt/mesos/sandbox"
--strict="true" --switch_user="true" --systemd_enable_support="true" --systemd_runtime_directory="/run/systemd/system"
--version="false" --work_dir="/tmp/Endpoint_SlaveEndpointTest_NoAuthorizer_1_N2Fluo"
I0712 05:03:31.314379 23910 credentials.hpp:86] Loading credential for authentication from
'/tmp/Endpoint_SlaveEndpointTest_NoAuthorizer_1_peWfYq/credential'
I0712 05:03:31.314525 23910 slave.cpp:264] Agent using credential for: test-principal
I0712 05:03:31.314538 23910 credentials.hpp:37] Loading credentials for authentication from
'/tmp/Endpoint_SlaveEndpointTest_NoAuthorizer_1_peWfYq/http_credentials'
I0712 05:03:31.314677 23910 http.cpp:975] Creating default 'basic' HTTP authenticator for
realm 'mesos-agent-readonly'
I0712 05:03:31.314749 23910 http.cpp:975] Creating default 'basic' HTTP authenticator for
realm 'mesos-agent-readwrite'
I0712 05:03:31.315368 23910 slave.cpp:531] Agent resources: cpus(*):2; mem(*):1024; disk(*):1024;
ports(*):[31000-32000]
I0712 05:03:31.315423 23910 slave.cpp:539] Agent attributes: [  ]
I0712 05:03:31.315435 23910 slave.cpp:544] Agent hostname: 99c99af9aa60
I0712 05:03:31.315604 23909 status_update_manager.cpp:177] Pausing sending status updates
I0712 05:03:31.316151 23911 state.cpp:62] Recovering state from '/tmp/Endpoint_SlaveEndpointTest_NoAuthorizer_1_N2Fluo/meta'
I0712 05:03:31.316382 23905 status_update_manager.cpp:203] Recovering status update manager
I0712 05:03:31.316465 23905 containerizer.cpp:608] Recovering containerizer
I0712 05:03:31.317469 23908 provisioner.cpp:410] Provisioner recovery complete
I0712 05:03:31.317708 23906 slave.cpp:6075] Finished recovery
I0712 05:03:31.318219 23906 slave.cpp:6257] Querying resource estimator for oversubscribable
resources
I0712 05:03:31.318409 23905 slave.cpp:6271] Received oversubscribable resources {} from the
resource estimator
I0712 05:03:31.319535 23910 process.cpp:3741] Handling HTTP event for process 'slave(742)'
with path: '/slave(742)/monitor/statistics.json'
I0712 05:03:31.320019 23905 http.cpp:1115] HTTP GET for /slave(742)/monitor/statistics.json
from 172.17.0.2:41478
I0712 05:03:31.320076 23905 http.cpp:936] Authorizing principal 'test-principal' to GET the
'/monitor/statistics.json' endpoint
I0712 05:03:31.322023 23904 slave.cpp:796] Agent terminating
[       OK ] Endpoint/SlaveEndpointTest.NoAuthorizer/1 (17 ms)
[ RUN      ] Endpoint/SlaveEndpointTest.NoAuthorizer/2
I0712 05:03:31.329476 23904 containerizer.cpp:221] Using isolation: posix/cpu,posix/mem,filesystem/posix,network/cni
W0712 05:03:31.329905 23904 backend.cpp:76] Failed to create 'overlay' backend: OverlayBackend
requires root privileges
W0712 05:03:31.329972 23904 backend.cpp:76] Failed to create 'bind' backend: BindBackend requires
root privileges
I0712 05:03:31.329993 23904 provisioner.cpp:249] Using default backend 'copy'
I0712 05:03:31.330740 23904 cluster.cpp:448] Creating default 'local' authorizer
I0712 05:03:31.331470 23910 slave.cpp:231] Mesos agent started on (743)@172.17.0.2:42981
I0712 05:03:31.331513 23910 slave.cpp:232] Flags at startup: --acls="" --appc_simple_discovery_uri_prefix="http://"
--appc_store_dir="/tmp/mesos/store/appc" --authenticate_http_readonly="true" --authenticate_http_readwrite="true"
--authenticatee="crammd5" --authentication_backoff_factor="1secs" --authorizer="local" --cgroups_cpu_enable_pids_and_tids_count="false"
--cgroups_enable_cfs="false" --cgroups_hierarchy="/sys/fs/cgroup" --cgroups_limit_swap="false"
--cgroups_root="mesos" --container_disk_watch_interval="15secs" --containerizers="mesos" --credential="/tmp/Endpoint_SlaveEndpointTest_NoAuthorizer_2_nBqv3A/credential"
--default_role="*" --disk_watch_interval="1mins" --docker="docker" --docker_kill_orphans="true"
--docker_registry="https://registry-1.docker.io" --docker_remove_delay="6hrs" --docker_socket="/var/run/docker.sock"
--docker_stop_timeout="0ns" --docker_store_dir="/tmp/mesos/store/docker" --docker_volume_checkpoint_dir="/var/run/mesos/isolators/docker/volume"
--enforce_container_disk_quota="false" --executor_registration_timeout="1mins" --executor_reregistration_timeout="2secs"
--executor_shutdown_grace_period="5secs" --fetcher_cache_dir="/tmp/Endpoint_SlaveEndpointTest_NoAuthorizer_2_nBqv3A/fetch"
--fetcher_cache_size="2GB" --frameworks_home="" --gc_delay="1weeks" --gc_disk_headroom="0.1"
--hadoop_home="" --help="false" --hostname_lookup="true" --http_command_executor="false" --http_credentials="/tmp/Endpoint_SlaveEndpointTest_NoAuthorizer_2_nBqv3A/http_credentials"
--http_heartbeat_interval="30secs" --initialize_driver_logging="true" --isolation="posix/cpu,posix/mem"
--launcher="posix" --launcher_dir="/mesos/build/src" --logbufsecs="0" --logging_level="INFO"
--max_completed_executors_per_framework="150" --oversubscribed_resources_interval="15secs"
--perf_duration="10secs" --perf_interval="1mins" --port="5051" --qos_correction_interval_min="0ns"
--quiet="false" --recover="reconnect" --recovery_timeout="15mins" --registration_backoff_factor="10ms"
--resources="cpus:2;gpus:0;mem:1024;disk:1024;ports:[31000-32000]" --revocable_cpu_low_priority="true"
--runtime_dir="/tmp/Endpoint_SlaveEndpointTest_NoAuthorizer_2_nBqv3A" --sandbox_directory="/mnt/mesos/sandbox"
--strict="true" --switch_user="true" --systemd_enable_support="true" --systemd_runtime_directory="/run/systemd/system"
--version="false" --work_dir="/tmp/Endpoint_SlaveEndpointTest_NoAuthorizer_2_lC5Kwy"
I0712 05:03:31.331863 23910 credentials.hpp:86] Loading credential for authentication from
'/tmp/Endpoint_SlaveEndpointTest_NoAuthorizer_2_nBqv3A/credential'
I0712 05:03:31.331992 23910 slave.cpp:264] Agent using credential for: test-principal
I0712 05:03:31.332007 23910 credentials.hpp:37] Loading credentials for authentication from
'/tmp/Endpoint_SlaveEndpointTest_NoAuthorizer_2_nBqv3A/http_credentials'
I0712 05:03:31.332132 23910 http.cpp:975] Creating default 'basic' HTTP authenticator for
realm 'mesos-agent-readonly'
I0712 05:03:31.332208 23910 http.cpp:975] Creating default 'basic' HTTP authenticator for
realm 'mesos-agent-readwrite'
I0712 05:03:31.333026 23910 slave.cpp:531] Agent resources: cpus(*):2; mem(*):1024; disk(*):1024;
ports(*):[31000-32000]
I0712 05:03:31.333084 23910 slave.cpp:539] Agent attributes: [  ]
I0712 05:03:31.333098 23910 slave.cpp:544] Agent hostname: 99c99af9aa60
I0712 05:03:31.333235 23908 status_update_manager.cpp:177] Pausing sending status updates
I0712 05:03:31.333750 23905 state.cpp:62] Recovering state from '/tmp/Endpoint_SlaveEndpointTest_NoAuthorizer_2_lC5Kwy/meta'
I0712 05:03:31.334100 23905 status_update_manager.cpp:203] Recovering status update manager
I0712 05:03:31.334194 23906 containerizer.cpp:608] Recovering containerizer
I0712 05:03:31.334939 23907 provisioner.cpp:410] Provisioner recovery complete
I0712 05:03:31.335171 23906 slave.cpp:6075] Finished recovery
I0712 05:03:31.335659 23906 slave.cpp:6257] Querying resource estimator for oversubscribable
resources
I0712 05:03:31.335882 23906 slave.cpp:6271] Received oversubscribable resources {} from the
resource estimator
I0712 05:03:31.336992 23909 process.cpp:3741] Handling HTTP event for process 'slave(743)'
with path: '/slave(743)/containers'
I0712 05:03:31.337466 23909 http.cpp:1115] HTTP GET for /slave(743)/containers from 172.17.0.2:41480
I0712 05:03:31.337522 23909 http.cpp:936] Authorizing principal 'test-principal' to GET the
'/containers' endpoint
I0712 05:03:31.339193 23911 slave.cpp:796] Agent terminating
[       OK ] Endpoint/SlaveEndpointTest.NoAuthorizer/2 (16 ms)
[----------] 9 tests from Endpoint/SlaveEndpointTest (158 ms total)

[----------] Global test environment tear-down
[==========] 1520 tests from 167 test cases ran. (267810 ms total)
[  PASSED  ] 1519 tests.
[  FAILED  ] 1 test, listed below:
[  FAILED  ] RegisterSlaveValidationTest.DropInvalidRegistration

 1 FAILED TEST
  YOU HAVE 22 DISABLED TESTS

E0712 05:03:31.465296 23913 process.cpp:956] Failed to accept socket: future discarded
make[3]: Leaving directory `/mesos/build'
make[3]: *** [CMakeFiles/check] Error 1
make[2]: *** [CMakeFiles/check.dir/all] Error 2
make[2]: Leaving directory `/mesos/build'
make[1]: Leaving directory `/mesos/build'
make[1]: *** [CMakeFiles/check.dir/rule] Error 2
make: *** [check] Error 2
+ docker rmi mesos-1499831828-19497
Untagged: mesos-1499831828-19497:latest
Deleted: sha256:7dece22de308861defb53502e7abd9114041156268a74405d55b8bb20f13fad5
Deleted: sha256:959719527cf132aad8ec2b23ba0e2a903008dcaf6a459adf1d22e59d27644ca7
Deleted: sha256:92365174967891096b546db0ff6f533968a6bab22737db6a14f768c07cd767c8
Deleted: sha256:272bd55e30d7f2043cc466fce40e4ada0f85428291c0a6466c0ceecc4d8922d6
Deleted: sha256:9ba5de5826a07f1494f23e5898d579e0e42345490c648051b804c1774eb921b6
Deleted: sha256:a7b5a6c4a4e4daafa8894dda49ef19a7df4be392b661d448bb829f89b1520f65
Deleted: sha256:5152055cce28face8f01a2958f47c5de1df09ebcc2ebd83c620a65bacb91aecd
Deleted: sha256:8c071407dd0b4c16bc9cca817263ff4153b6ea96d96e90f424539dc5c0df10e1
Deleted: sha256:f67f479d199b7680ab0b830556c9f10b9a72dd55c79764e6ffc131d5f738c2a1
Deleted: sha256:3447645a9ce72215305558849fc499a4c89aa415540439c2c33630665da5705a
Deleted: sha256:bdcc6851c411afe234481d610f50fadd5dd6dc7979751aa87ff4a13e6183d93b
Deleted: sha256:b83139deda6e3fd08ccc0a52a9b75f0954ecf4566fea1be50f69243a2796f4ce
Deleted: sha256:5a801e0b56730a211a3abaefdf6cad5beeb19813dac93172177f7849dab31b1a
Deleted: sha256:41ea216cb60221c02d3df777833547b61e7c11bb72cf4e508dda6c0bfc93fe5f
Deleted: sha256:2c4f348a632e5a3f32c1e9f4650019de237933e140c5966debb3a85721c31102
Deleted: sha256:5c4a020411c6c19b649c85fa0bce48d0f657c994d7a07e071bc918ad5d4bdb0c
Deleted: sha256:065a0f068917cf64dccdf39f303b97ea8b89438399db97d9c930070a4594cf4c
Deleted: sha256:741046c67d602d5ce8351df15d4eb5b6b6179e62a547938e1af1597206edd395
Deleted: sha256:7b0295d59e49262d5a15208742a90f4952217d7aa5e83aeb3356a0b33f6cf116
Deleted: sha256:5de3670f57c6fe05fa7417a83184fdb0d21e6b61fe7ca1cd77f9693925909c9d
Deleted: sha256:47b9e3833ea66663d45ef70eab59b7dae467da6207ec6e6b86daae973d0e52c2
Deleted: sha256:b2a9ba7849b5605075d5e4177c1e4c80d79ff1b447d2f1d477eab9e38ef61a18
Deleted: sha256:08417cb23008dc5231e808740c9b01be42921a9f9d1960ab7f51f07b8b1c9288
Deleted: sha256:503076199d9ae7d5bcc04d9d885cbbb03d1b4eabd2a54d3a9940683ec0d3bb00
Build step 'Execute shell' marked build as failure
Not sending mail to unregistered user yujie.jay@gmail.com

Mime
View raw message