mesos-builds mailing list archives

Site index · List index
Message view « Date » · « Thread »
Top « Date » · « Thread »
From Apache Jenkins Server <jenk...@builds.apache.org>
Subject Build failed in Jenkins: Mesos-Reviewbot #18645
Date Sun, 30 Jul 2017 05:18:46 GMT
See <https://builds.apache.org/job/Mesos-Reviewbot/18645/display/redirect>

------------------------------------------
[...truncated 30.50 MB...]
I0730 05:18:39.159724  5095 containerizer.cpp:230] Using isolation: posix/cpu,posix/mem,filesystem/posix,network/cni,environment_secret
W0730 05:18:39.160506  5095 backend.cpp:76] Failed to create 'overlay' backend: OverlayBackend
requires root privileges
W0730 05:18:39.160675  5095 backend.cpp:76] Failed to create 'bind' backend: BindBackend requires
root privileges
I0730 05:18:39.160720  5095 provisioner.cpp:255] Using default backend 'copy'
I0730 05:18:39.165935  5117 slave.cpp:250] Mesos agent started on (795)@172.17.0.3:46531
I0730 05:18:39.165978  5117 slave.cpp:251] Flags at startup: --acls="" --appc_simple_discovery_uri_prefix="http://"
--appc_store_dir="/tmp/Endpoint_SlaveEndpointTest_AuthorizedRequest_2_q75EPr/store/appc" --authenticate_http_readonly="true"
--authenticate_http_readwrite="true" --authenticatee="crammd5" --authentication_backoff_factor="1secs"
--authorizer="local" --cgroups_cpu_enable_pids_and_tids_count="false" --cgroups_enable_cfs="false"
--cgroups_hierarchy="/sys/fs/cgroup" --cgroups_limit_swap="false" --cgroups_root="mesos" --container_disk_watch_interval="15secs"
--containerizers="mesos" --credential="/tmp/Endpoint_SlaveEndpointTest_AuthorizedRequest_2_q75EPr/credential"
--default_role="*" --disk_watch_interval="1mins" --docker="docker" --docker_kill_orphans="true"
--docker_registry="https://registry-1.docker.io" --docker_remove_delay="6hrs" --docker_socket="/var/run/docker.sock"
--docker_stop_timeout="0ns" --docker_store_dir="/tmp/Endpoint_SlaveEndpointTest_AuthorizedRequest_2_q75EPr/store/docker"
--docker_volume_checkpoint_dir="/var/run/mesos/isolators/docker/volume" --enforce_container_disk_quota="false"
--executor_registration_timeout="1mins" --executor_reregistration_timeout="2secs" --executor_shutdown_grace_period="5secs"
--fetcher_cache_dir="/tmp/Endpoint_SlaveEndpointTest_AuthorizedRequest_2_q75EPr/fetch" --fetcher_cache_size="2GB"
--frameworks_home="" --gc_delay="1weeks" --gc_disk_headroom="0.1" --hadoop_home="" --help="false"
--hostname_lookup="true" --http_command_executor="false" --http_credentials="/tmp/Endpoint_SlaveEndpointTest_AuthorizedRequest_2_q75EPr/http_credentials"
--http_heartbeat_interval="30secs" --initialize_driver_logging="true" --isolation="posix/cpu,posix/mem"
--launcher="posix" --launcher_dir="/mesos/mesos-1.4.0/_build/src" --logbufsecs="0" --logging_level="INFO"
--max_completed_executors_per_framework="150" --oversubscribed_resources_interval="15secs"
--perf_duration="10secs" --perf_interval="1mins" --port="5051" --qos_correction_interval_min="0ns"
--quiet="false" --recover="reconnect" --recovery_timeout="15mins" --registration_backoff_factor="10ms"
--resources="cpus:2;gpus:0;mem:1024;disk:1024;ports:[31000-32000]" --revocable_cpu_low_priority="true"
--runtime_dir="/tmp/Endpoint_SlaveEndpointTest_AuthorizedRequest_2_q75EPr" --sandbox_directory="/mnt/mesos/sandbox"
--strict="true" --switch_user="true" --systemd_enable_support="true" --systemd_runtime_directory="/run/systemd/system"
--version="false" --work_dir="/tmp/Endpoint_SlaveEndpointTest_AuthorizedRequest_2_D9pv7l"
I0730 05:18:39.166852  5117 credentials.hpp:86] Loading credential for authentication from
'/tmp/Endpoint_SlaveEndpointTest_AuthorizedRequest_2_q75EPr/credential'
I0730 05:18:39.167269  5117 slave.cpp:283] Agent using credential for: test-principal
I0730 05:18:39.167307  5117 credentials.hpp:37] Loading credentials for authentication from
'/tmp/Endpoint_SlaveEndpointTest_AuthorizedRequest_2_q75EPr/http_credentials'
I0730 05:18:39.167819  5117 http.cpp:993] Creating default 'basic' HTTP authenticator for
realm 'mesos-agent-readonly'
I0730 05:18:39.168169  5117 http.cpp:993] Creating default 'basic' HTTP authenticator for
realm 'mesos-agent-readwrite'
I0730 05:18:39.170543  5117 slave.cpp:565] Agent resources: [{"name":"cpus","scalar":{"value":2.0},"type":"SCALAR"},{"name":"mem","scalar":{"value":1024.0},"type":"SCALAR"},{"name":"disk","scalar":{"value":1024.0},"type":"SCALAR"},{"name":"ports","ranges":{"range":[{"begin":31000,"end":32000}]},"type":"RANGES"}]
I0730 05:18:39.170970  5117 slave.cpp:573] Agent attributes: [  ]
I0730 05:18:39.170992  5117 slave.cpp:582] Agent hostname: 562c4cb38d58
I0730 05:18:39.171245  5115 status_update_manager.cpp:177] Pausing sending status updates
I0730 05:18:39.173283  5118 state.cpp:64] Recovering state from '/tmp/Endpoint_SlaveEndpointTest_AuthorizedRequest_2_D9pv7l/meta'
I0730 05:18:39.173820  5121 status_update_manager.cpp:203] Recovering status update manager
I0730 05:18:39.174283  5120 containerizer.cpp:582] Recovering containerizer
I0730 05:18:39.176443  5120 provisioner.cpp:416] Provisioner recovery complete
I0730 05:18:39.177031  5118 slave.cpp:6207] Finished recovery
I0730 05:18:39.177670  5118 slave.cpp:6389] Querying resource estimator for oversubscribable
resources
I0730 05:18:39.178059  5116 slave.cpp:6403] Received oversubscribable resources {} from the
resource estimator
I0730 05:18:39.182634  5117 process.cpp:3836] Handling HTTP event for process 'slave(795)'
with path: '/slave(795)/containers'
I0730 05:18:39.184582  5119 http.cpp:1133] HTTP GET for /slave(795)/containers from 172.17.0.3:46874
I0730 05:18:39.184718  5119 http.cpp:957] Authorizing principal 'test-principal' to GET the
'/containers' endpoint
I0730 05:18:39.191551  5095 slave.cpp:843] Agent terminating
[       OK ] Endpoint/SlaveEndpointTest.AuthorizedRequest/2 (49 ms)
[ RUN      ] Endpoint/SlaveEndpointTest.UnauthorizedRequest/0
I0730 05:18:39.208683  5095 containerizer.cpp:230] Using isolation: posix/cpu,posix/mem,filesystem/posix,network/cni,environment_secret
W0730 05:18:39.209476  5095 backend.cpp:76] Failed to create 'overlay' backend: OverlayBackend
requires root privileges
W0730 05:18:39.209643  5095 backend.cpp:76] Failed to create 'bind' backend: BindBackend requires
root privileges
I0730 05:18:39.209687  5095 provisioner.cpp:255] Using default backend 'copy'
I0730 05:18:39.214803  5117 slave.cpp:250] Mesos agent started on (796)@172.17.0.3:46531
I0730 05:18:39.214848  5117 slave.cpp:251] Flags at startup: --acls="" --appc_simple_discovery_uri_prefix="http://"
--appc_store_dir="/tmp/Endpoint_SlaveEndpointTest_UnauthorizedRequest_0_E2056O/store/appc"
--authenticate_http_readonly="true" --authenticate_http_readwrite="true" --authenticatee="crammd5"
--authentication_backoff_factor="1secs" --authorizer="local" --cgroups_cpu_enable_pids_and_tids_count="false"
--cgroups_enable_cfs="false" --cgroups_hierarchy="/sys/fs/cgroup" --cgroups_limit_swap="false"
--cgroups_root="mesos" --container_disk_watch_interval="15secs" --containerizers="mesos" --credential="/tmp/Endpoint_SlaveEndpointTest_UnauthorizedRequest_0_E2056O/credential"
--default_role="*" --disk_watch_interval="1mins" --docker="docker" --docker_kill_orphans="true"
--docker_registry="https://registry-1.docker.io" --docker_remove_delay="6hrs" --docker_socket="/var/run/docker.sock"
--docker_stop_timeout="0ns" --docker_store_dir="/tmp/Endpoint_SlaveEndpointTest_UnauthorizedRequest_0_E2056O/store/docker"
--docker_volume_checkpoint_dir="/var/run/mesos/isolators/docker/volume" --enforce_container_disk_quota="false"
--executor_registration_timeout="1mins" --executor_reregistration_timeout="2secs" --executor_shutdown_grace_period="5secs"
--fetcher_cache_dir="/tmp/Endpoint_SlaveEndpointTest_UnauthorizedRequest_0_E2056O/fetch" --fetcher_cache_size="2GB"
--frameworks_home="" --gc_delay="1weeks" --gc_disk_headroom="0.1" --hadoop_home="" --help="false"
--hostname_lookup="true" --http_command_executor="false" --http_credentials="/tmp/Endpoint_SlaveEndpointTest_UnauthorizedRequest_0_E2056O/http_credentials"
--http_heartbeat_interval="30secs" --initialize_driver_logging="true" --isolation="posix/cpu,posix/mem"
--launcher="posix" --launcher_dir="/mesos/mesos-1.4.0/_build/src" --logbufsecs="0" --logging_level="INFO"
--max_completed_executors_per_framework="150" --oversubscribed_resources_interval="15secs"
--perf_duration="10secs" --perf_interval="1mins" --port="5051" --qos_correction_interval_min="0ns"
--quiet="false" --recover="reconnect" --recovery_timeout="15mins" --registration_backoff_factor="10ms"
--resources="cpus:2;gpus:0;mem:1024;disk:1024;ports:[31000-32000]" --revocable_cpu_low_priority="true"
--runtime_dir="/tmp/Endpoint_SlaveEndpointTest_UnauthorizedRequest_0_E2056O" --sandbox_directory="/mnt/mesos/sandbox"
--strict="true" --switch_user="true" --systemd_enable_support="true" --systemd_runtime_directory="/run/systemd/system"
--version="false" --work_dir="/tmp/Endpoint_SlaveEndpointTest_UnauthorizedRequest_0_7od1gJ"
I0730 05:18:39.215605  5117 credentials.hpp:86] Loading credential for authentication from
'/tmp/Endpoint_SlaveEndpointTest_UnauthorizedRequest_0_E2056O/credential'
I0730 05:18:39.215893  5117 slave.cpp:283] Agent using credential for: test-principal
I0730 05:18:39.215919  5117 credentials.hpp:37] Loading credentials for authentication from
'/tmp/Endpoint_SlaveEndpointTest_UnauthorizedRequest_0_E2056O/http_credentials'
I0730 05:18:39.216307  5117 http.cpp:993] Creating default 'basic' HTTP authenticator for
realm 'mesos-agent-readonly'
I0730 05:18:39.216564  5117 http.cpp:993] Creating default 'basic' HTTP authenticator for
realm 'mesos-agent-readwrite'
I0730 05:18:39.218793  5117 slave.cpp:565] Agent resources: [{"name":"cpus","scalar":{"value":2.0},"type":"SCALAR"},{"name":"mem","scalar":{"value":1024.0},"type":"SCALAR"},{"name":"disk","scalar":{"value":1024.0},"type":"SCALAR"},{"name":"ports","ranges":{"range":[{"begin":31000,"end":32000}]},"type":"RANGES"}]
I0730 05:18:39.219218  5117 slave.cpp:573] Agent attributes: [  ]
I0730 05:18:39.219239  5117 slave.cpp:582] Agent hostname: 562c4cb38d58
I0730 05:18:39.219501  5121 status_update_manager.cpp:177] Pausing sending status updates
I0730 05:18:39.221470  5114 state.cpp:64] Recovering state from '/tmp/Endpoint_SlaveEndpointTest_UnauthorizedRequest_0_7od1gJ/meta'
I0730 05:18:39.222136  5121 status_update_manager.cpp:203] Recovering status update manager
I0730 05:18:39.222440  5117 containerizer.cpp:582] Recovering containerizer
I0730 05:18:39.224647  5115 provisioner.cpp:416] Provisioner recovery complete
I0730 05:18:39.225281  5121 slave.cpp:6207] Finished recovery
I0730 05:18:39.225905  5121 slave.cpp:6389] Querying resource estimator for oversubscribable
resources
I0730 05:18:39.226269  5120 slave.cpp:6403] Received oversubscribable resources {} from the
resource estimator
I0730 05:18:39.230574  5120 process.cpp:3836] Handling HTTP event for process 'slave(796)'
with path: '/slave(796)/monitor/statistics'
I0730 05:18:39.232543  5115 http.cpp:1133] HTTP GET for /slave(796)/monitor/statistics from
172.17.0.3:46876
I0730 05:18:39.232712  5115 http.cpp:957] Authorizing principal 'test-principal' to GET the
'/monitor/statistics' endpoint
I0730 05:18:39.236425  5119 slave.cpp:843] Agent terminating
[       OK ] Endpoint/SlaveEndpointTest.UnauthorizedRequest/0 (45 ms)
[ RUN      ] Endpoint/SlaveEndpointTest.UnauthorizedRequest/1
I0730 05:18:39.253798  5095 containerizer.cpp:230] Using isolation: posix/cpu,posix/mem,filesystem/posix,network/cni,environment_secret
W0730 05:18:39.254622  5095 backend.cpp:76] Failed to create 'overlay' backend: OverlayBackend
requires root privileges
W0730 05:18:39.254804  5095 backend.cpp:76] Failed to create 'bind' backend: BindBackend requires
root privileges
I0730 05:18:39.254851  5095 provisioner.cpp:255] Using default backend 'copy'
I0730 05:18:39.259986  5119 slave.cpp:250] Mesos agent started on (797)@172.17.0.3:46531
I0730 05:18:39.260030  5119 slave.cpp:251] Flags at startup: --acls="" --appc_simple_discovery_uri_prefix="http://"
--appc_store_dir="/tmp/Endpoint_SlaveEndpointTest_UnauthorizedRequest_1_2cpfSc/store/appc"
--authenticate_http_readonly="true" --authenticate_http_readwrite="true" --authenticatee="crammd5"
--authentication_backoff_factor="1secs" --authorizer="local" --cgroups_cpu_enable_pids_and_tids_count="false"
--cgroups_enable_cfs="false" --cgroups_hierarchy="/sys/fs/cgroup" --cgroups_limit_swap="false"
--cgroups_root="mesos" --container_disk_watch_interval="15secs" --containerizers="mesos" --credential="/tmp/Endpoint_SlaveEndpointTest_UnauthorizedRequest_1_2cpfSc/credential"
--default_role="*" --disk_watch_interval="1mins" --docker="docker" --docker_kill_orphans="true"
--docker_registry="https://registry-1.docker.io" --docker_remove_delay="6hrs" --docker_socket="/var/run/docker.sock"
--docker_stop_timeout="0ns" --docker_store_dir="/tmp/Endpoint_SlaveEndpointTest_UnauthorizedRequest_1_2cpfSc/store/docker"
--docker_volume_checkpoint_dir="/var/run/mesos/isolators/docker/volume" --enforce_container_disk_quota="false"
--executor_registration_timeout="1mins" --executor_reregistration_timeout="2secs" --executor_shutdown_grace_period="5secs"
--fetcher_cache_dir="/tmp/Endpoint_SlaveEndpointTest_UnauthorizedRequest_1_2cpfSc/fetch" --fetcher_cache_size="2GB"
--frameworks_home="" --gc_delay="1weeks" --gc_disk_headroom="0.1" --hadoop_home="" --help="false"
--hostname_lookup="true" --http_command_executor="false" --http_credentials="/tmp/Endpoint_SlaveEndpointTest_UnauthorizedRequest_1_2cpfSc/http_credentials"
--http_heartbeat_interval="30secs" --initialize_driver_logging="true" --isolation="posix/cpu,posix/mem"
--launcher="posix" --launcher_dir="/mesos/mesos-1.4.0/_build/src" --logbufsecs="0" --logging_level="INFO"
--max_completed_executors_per_framework="150" --oversubscribed_resources_interval="15secs"
--perf_duration="10secs" --perf_interval="1mins" --port="5051" --qos_correction_interval_min="0ns"
--quiet="false" --recover="reconnect" --recovery_timeout="15mins" --registration_backoff_factor="10ms"
--resources="cpus:2;gpus:0;mem:1024;disk:1024;ports:[31000-32000]" --revocable_cpu_low_priority="true"
--runtime_dir="/tmp/Endpoint_SlaveEndpointTest_UnauthorizedRequest_1_2cpfSc" --sandbox_directory="/mnt/mesos/sandbox"
--strict="true" --switch_user="true" --systemd_enable_support="true" --systemd_runtime_directory="/run/systemd/system"
--version="false" --work_dir="/tmp/Endpoint_SlaveEndpointTest_UnauthorizedRequest_1_vDjSU6"
I0730 05:18:39.261013  5119 credentials.hpp:86] Loading credential for authentication from
'/tmp/Endpoint_SlaveEndpointTest_UnauthorizedRequest_1_2cpfSc/credential'
I0730 05:18:39.261518  5119 slave.cpp:283] Agent using credential for: test-principal
I0730 05:18:39.261554  5119 credentials.hpp:37] Loading credentials for authentication from
'/tmp/Endpoint_SlaveEndpointTest_UnauthorizedRequest_1_2cpfSc/http_credentials'
I0730 05:18:39.262109  5119 http.cpp:993] Creating default 'basic' HTTP authenticator for
realm 'mesos-agent-readonly'
I0730 05:18:39.262496  5119 http.cpp:993] Creating default 'basic' HTTP authenticator for
realm 'mesos-agent-readwrite'
I0730 05:18:39.264916  5119 slave.cpp:565] Agent resources: [{"name":"cpus","scalar":{"value":2.0},"type":"SCALAR"},{"name":"mem","scalar":{"value":1024.0},"type":"SCALAR"},{"name":"disk","scalar":{"value":1024.0},"type":"SCALAR"},{"name":"ports","ranges":{"range":[{"begin":31000,"end":32000}]},"type":"RANGES"}]
I0730 05:18:39.265346  5119 slave.cpp:573] Agent attributes: [  ]
I0730 05:18:39.265367  5119 slave.cpp:582] Agent hostname: 562c4cb38d58
I0730 05:18:39.265851  5117 status_update_manager.cpp:177] Pausing sending status updates
I0730 05:18:39.268004  5114 state.cpp:64] Recovering state from '/tmp/Endpoint_SlaveEndpointTest_UnauthorizedRequest_1_vDjSU6/meta'
I0730 05:18:39.268553  5116 status_update_manager.cpp:203] Recovering status update manager
I0730 05:18:39.268911  5119 containerizer.cpp:582] Recovering containerizer
I0730 05:18:39.271113  5121 provisioner.cpp:416] Provisioner recovery complete
I0730 05:18:39.271843  5120 slave.cpp:6207] Finished recovery
I0730 05:18:39.272490  5120 slave.cpp:6389] Querying resource estimator for oversubscribable
resources
I0730 05:18:39.273001  5114 slave.cpp:6403] Received oversubscribable resources {} from the
resource estimator
I0730 05:18:39.277448  5121 process.cpp:3836] Handling HTTP event for process 'slave(797)'
with path: '/slave(797)/monitor/statistics.json'
I0730 05:18:39.279368  5119 http.cpp:1133] HTTP GET for /slave(797)/monitor/statistics.json
from 172.17.0.3:46878
I0730 05:18:39.279690  5119 http.cpp:957] Authorizing principal 'test-principal' to GET the
'/monitor/statistics.json' endpoint
I0730 05:18:39.283342  5121 slave.cpp:843] Agent terminating
[       OK ] Endpoint/SlaveEndpointTest.UnauthorizedRequest/1 (46 ms)
[ RUN      ] Endpoint/SlaveEndpointTest.UnauthorizedRequest/2
I0730 05:18:39.300017  5095 containerizer.cpp:230] Using isolation: posix/cpu,posix/mem,filesystem/posix,network/cni,environment_secret
W0730 05:18:39.300820  5095 backend.cpp:76] Failed to create 'overlay' backend: OverlayBackend
requires root privileges
W0730 05:18:39.300997  5095 backend.cpp:76] Failed to create 'bind' backend: BindBackend requires
root privileges
I0730 05:18:39.301046  5095 provisioner.cpp:255] Using default backend 'copy'
I0730 05:18:39.306128  5114 slave.cpp:250] Mesos agent started on (798)@172.17.0.3:46531
I0730 05:18:39.306169  5114 slave.cpp:251] Flags at startup: --acls="" --appc_simple_discovery_uri_prefix="http://"
--appc_store_dir="/tmp/Endpoint_SlaveEndpointTest_UnauthorizedRequest_2_wSrt7A/store/appc"
--authenticate_http_readonly="true" --authenticate_http_readwrite="true" --authenticatee="crammd5"
--authentication_backoff_factor="1secs" --authorizer="local" --cgroups_cpu_enable_pids_and_tids_count="false"
--cgroups_enable_cfs="false" --cgroups_hierarchy="/sys/fs/cgroup" --cgroups_limit_swap="false"
--cgroups_root="mesos" --container_disk_watch_interval="15secs" --containerizers="mesos" --credential="/tmp/Endpoint_SlaveEndpointTest_UnauthorizedRequest_2_wSrt7A/credential"
--default_role="*" --disk_watch_interval="1mins" --docker="docker" --docker_kill_orphans="true"
--docker_registry="https://registry-1.docker.io" --docker_remove_delay="6hrs" --docker_socket="/var/run/docker.sock"
--docker_stop_timeout="0ns" --docker_store_dir="/tmp/Endpoint_SlaveEndpointTest_UnauthorizedRequest_2_wSrt7A/store/docker"
--docker_volume_checkpoint_dir="/var/run/mesos/isolators/docker/volume" --enforce_container_disk_quota="false"
--executor_registration_timeout="1mins" --executor_reregistration_timeout="2secs" --executor_shutdown_grace_period="5secs"
--fetcher_cache_dir="/tmp/Endpoint_SlaveEndpointTest_UnauthorizedRequest_2_wSrt7A/fetch" --fetcher_cache_size="2GB"
--frameworks_home="" --gc_delay="1weeks" --gc_disk_headroom="0.1" --hadoop_home="" --help="false"
--hostname_lookup="true" --http_command_executor="false" --http_credentials="/tmp/Endpoint_SlaveEndpointTest_UnauthorizedRequest_2_wSrt7A/http_credentials"
--http_heartbeat_interval="30secs" --initialize_driver_logging="true" --isolation="posix/cpu,posix/mem"
--launcher="posix" --launcher_dir="/mesos/mesos-1.4.0/_build/src" --logbufsecs="0" --logging_level="INFO"
--max_completed_executors_per_framework="150" --oversubscribed_resources_interval="15secs"
--perf_duration="10secs" --perf_interval="1mins" --port="5051" --qos_correction_interval_min="0ns"
--quiet="false" --recover="reconnect" --recovery_timeout="15mins" --registration_backoff_factor="10ms"
--resources="cpus:2;gpus:0;mem:1024;disk:1024;ports:[31000-32000]" --revocable_cpu_low_priority="true"
--runtime_dir="/tmp/Endpoint_SlaveEndpointTest_UnauthorizedRequest_2_wSrt7A" --sandbox_directory="/mnt/mesos/sandbox"
--strict="true" --switch_user="true" --systemd_enable_support="true" --systemd_runtime_directory="/run/systemd/system"
--version="false" --work_dir="/tmp/Endpoint_SlaveEndpointTest_UnauthorizedRequest_2_h8TA2u"
I0730 05:18:39.306972  5114 credentials.hpp:86] Loading credential for authentication from
'/tmp/Endpoint_SlaveEndpointTest_UnauthorizedRequest_2_wSrt7A/credential'
I0730 05:18:39.307361  5114 slave.cpp:283] Agent using credential for: test-principal
I0730 05:18:39.307387  5114 credentials.hpp:37] Loading credentials for authentication from
'/tmp/Endpoint_SlaveEndpointTest_UnauthorizedRequest_2_wSrt7A/http_credentials'
I0730 05:18:39.307818  5114 http.cpp:993] Creating default 'basic' HTTP authenticator for
realm 'mesos-agent-readonly'
I0730 05:18:39.308118  5114 http.cpp:993] Creating default 'basic' HTTP authenticator for
realm 'mesos-agent-readwrite'
I0730 05:18:39.310356  5114 slave.cpp:565] Agent resources: [{"name":"cpus","scalar":{"value":2.0},"type":"SCALAR"},{"name":"mem","scalar":{"value":1024.0},"type":"SCALAR"},{"name":"disk","scalar":{"value":1024.0},"type":"SCALAR"},{"name":"ports","ranges":{"range":[{"begin":31000,"end":32000}]},"type":"RANGES"}]
I0730 05:18:39.310781  5114 slave.cpp:573] Agent attributes: [  ]
I0730 05:18:39.310801  5114 slave.cpp:582] Agent hostname: 562c4cb38d58
I0730 05:18:39.311030  5116 status_update_manager.cpp:177] Pausing sending status updates
I0730 05:18:39.313158  5117 state.cpp:64] Recovering state from '/tmp/Endpoint_SlaveEndpointTest_UnauthorizedRequest_2_h8TA2u/meta'
I0730 05:18:39.313565  5118 status_update_manager.cpp:203] Recovering status update manager
I0730 05:18:39.313946  5121 containerizer.cpp:582] Recovering containerizer
I0730 05:18:39.315915  5116 provisioner.cpp:416] Provisioner recovery complete
I0730 05:18:39.316519  5121 slave.cpp:6207] Finished recovery
I0730 05:18:39.317149  5121 slave.cpp:6389] Querying resource estimator for oversubscribable
resources
I0730 05:18:39.317636  5114 slave.cpp:6403] Received oversubscribable resources {} from the
resource estimator
I0730 05:18:39.321662  5118 process.cpp:3836] Handling HTTP event for process 'slave(798)'
with path: '/slave(798)/containers'
I0730 05:18:39.323631  5114 http.cpp:1133] HTTP GET for /slave(798)/containers from 172.17.0.3:46880
I0730 05:18:39.323768  5114 http.cpp:957] Authorizing principal 'test-principal' to GET the
'/containers' endpoint
I0730 05:18:39.327685  5118 slave.cpp:843] Agent terminating
[       OK ] Endpoint/SlaveEndpointTest.UnauthorizedRequest/2 (44 ms)
[ RUN      ] Endpoint/SlaveEndpointTest.NoAuthorizer/0
I0730 05:18:39.345338  5095 containerizer.cpp:230] Using isolation: posix/cpu,posix/mem,filesystem/posix,network/cni,environment_secret
W0730 05:18:39.346129  5095 backend.cpp:76] Failed to create 'overlay' backend: OverlayBackend
requires root privileges
W0730 05:18:39.346302  5095 backend.cpp:76] Failed to create 'bind' backend: BindBackend requires
root privileges
I0730 05:18:39.346349  5095 provisioner.cpp:255] Using default backend 'copy'
I0730 05:18:39.348810  5095 cluster.cpp:448] Creating default 'local' authorizer
I0730 05:18:39.351595  5118 slave.cpp:250] Mesos agent started on (799)@172.17.0.3:46531
I0730 05:18:39.351634  5118 slave.cpp:251] Flags at startup: --acls="" --appc_simple_discovery_uri_prefix="http://"
--appc_store_dir="/tmp/Endpoint_SlaveEndpointTest_NoAuthorizer_0_4P2LPZ/store/appc" --authenticate_http_readonly="true"
--authenticate_http_readwrite="true" --authenticatee="crammd5" --authentication_backoff_factor="1secs"
--authorizer="local" --cgroups_cpu_enable_pids_and_tids_count="false" --cgroups_enable_cfs="false"
--cgroups_hierarchy="/sys/fs/cgroup" --cgroups_limit_swap="false" --cgroups_root="mesos" --container_disk_watch_interval="15secs"
--containerizers="mesos" --credential="/tmp/Endpoint_SlaveEndpointTest_NoAuthorizer_0_4P2LPZ/credential"
--default_role="*" --disk_watch_interval="1mins" --docker="docker" --docker_kill_orphans="true"
--docker_registry="https://registry-1.docker.io" --docker_remove_delay="6hrs" --docker_socket="/var/run/docker.sock"
--docker_stop_timeout="0ns" --docker_store_dir="/tmp/Endpoint_SlaveEndpointTest_NoAuthorizer_0_4P2LPZ/store/docker"
--docker_volume_checkpoint_dir="/var/run/mesos/isolators/docker/volume" --enforce_container_disk_quota="false"
--executor_registration_timeout="1mins" --executor_reregistration_timeout="2secs" --executor_shutdown_grace_period="5secs"
--fetcher_cache_dir="/tmp/Endpoint_SlaveEndpointTest_NoAuthorizer_0_4P2LPZ/fetch" --fetcher_cache_size="2GB"
--frameworks_home="" --gc_delay="1weeks" --gc_disk_headroom="0.1" --hadoop_home="" --help="false"
--hostname_lookup="true" --http_command_executor="false" --http_credentials="/tmp/Endpoint_SlaveEndpointTest_NoAuthorizer_0_4P2LPZ/http_credentials"
--http_heartbeat_interval="30secs" --initialize_driver_logging="true" --isolation="posix/cpu,posix/mem"
--launcher="posix" --launcher_dir="/mesos/mesos-1.4.0/_build/src" --logbufsecs="0" --logging_level="INFO"
--max_completed_executors_per_framework="150" --oversubscribed_resources_interval="15secs"
--perf_duration="10secs" --perf_interval="1mins" --port="5051" --qos_correction_interval_min="0ns"
--quiet="false" --recover="reconnect" --recovery_timeout="15mins" --registration_backoff_factor="10ms"
--resources="cpus:2;gpus:0;mem:1024;disk:1024;ports:[31000-32000]" --revocable_cpu_low_priority="true"
--runtime_dir="/tmp/Endpoint_SlaveEndpointTest_NoAuthorizer_0_4P2LPZ" --sandbox_directory="/mnt/mesos/sandbox"
--strict="true" --switch_user="true" --systemd_enable_support="true" --systemd_runtime_directory="/run/systemd/system"
--version="false" --work_dir="/tmp/Endpoint_SlaveEndpointTest_NoAuthorizer_0_1pECDT"
I0730 05:18:39.352368  5118 credentials.hpp:86] Loading credential for authentication from
'/tmp/Endpoint_SlaveEndpointTest_NoAuthorizer_0_4P2LPZ/credential'
I0730 05:18:39.352628  5118 slave.cpp:283] Agent using credential for: test-principal
I0730 05:18:39.352653  5118 credentials.hpp:37] Loading credentials for authentication from
'/tmp/Endpoint_SlaveEndpointTest_NoAuthorizer_0_4P2LPZ/http_credentials'
I0730 05:18:39.353019  5118 http.cpp:993] Creating default 'basic' HTTP authenticator for
realm 'mesos-agent-readonly'
I0730 05:18:39.353245  5118 http.cpp:993] Creating default 'basic' HTTP authenticator for
realm 'mesos-agent-readwrite'
I0730 05:18:39.355474  5118 slave.cpp:565] Agent resources: [{"name":"cpus","scalar":{"value":2.0},"type":"SCALAR"},{"name":"mem","scalar":{"value":1024.0},"type":"SCALAR"},{"name":"disk","scalar":{"value":1024.0},"type":"SCALAR"},{"name":"ports","ranges":{"range":[{"begin":31000,"end":32000}]},"type":"RANGES"}]
I0730 05:18:39.355898  5118 slave.cpp:573] Agent attributes: [  ]
I0730 05:18:39.355919  5118 slave.cpp:582] Agent hostname: 562c4cb38d58
I0730 05:18:39.356149  5117 status_update_manager.cpp:177] Pausing sending status updates
I0730 05:18:39.358042  5120 state.cpp:64] Recovering state from '/tmp/Endpoint_SlaveEndpointTest_NoAuthorizer_0_1pECDT/meta'
I0730 05:18:39.358656  5117 status_update_manager.cpp:203] Recovering status update manager
I0730 05:18:39.359045  5115 containerizer.cpp:582] Recovering containerizer
I0730 05:18:39.361171  5118 provisioner.cpp:416] Provisioner recovery complete
I0730 05:18:39.361835  5121 slave.cpp:6207] Finished recovery
I0730 05:18:39.362479  5121 slave.cpp:6389] Querying resource estimator for oversubscribable
resources
I0730 05:18:39.362839  5117 slave.cpp:6403] Received oversubscribable resources {} from the
resource estimator
I0730 05:18:39.367249  5116 process.cpp:3836] Handling HTTP event for process 'slave(799)'
with path: '/slave(799)/monitor/statistics'
I0730 05:18:39.369484  5117 http.cpp:1133] HTTP GET for /slave(799)/monitor/statistics from
172.17.0.3:46882
I0730 05:18:39.369616  5117 http.cpp:957] Authorizing principal 'test-principal' to GET the
'/monitor/statistics' endpoint
I0730 05:18:39.374734  5119 slave.cpp:843] Agent terminating
[       OK ] Endpoint/SlaveEndpointTest.NoAuthorizer/0 (46 ms)
[ RUN      ] Endpoint/SlaveEndpointTest.NoAuthorizer/1
I0730 05:18:39.391944  5095 containerizer.cpp:230] Using isolation: posix/cpu,posix/mem,filesystem/posix,network/cni,environment_secret
W0730 05:18:39.392731  5095 backend.cpp:76] Failed to create 'overlay' backend: OverlayBackend
requires root privileges
W0730 05:18:39.392906  5095 backend.cpp:76] Failed to create 'bind' backend: BindBackend requires
root privileges
I0730 05:18:39.392951  5095 provisioner.cpp:255] Using default backend 'copy'
I0730 05:18:39.395519  5095 cluster.cpp:448] Creating default 'local' authorizer
I0730 05:18:39.398340  5115 slave.cpp:250] Mesos agent started on (800)@172.17.0.3:46531
I0730 05:18:39.398416  5115 slave.cpp:251] Flags at startup: --acls="" --appc_simple_discovery_uri_prefix="http://"
--appc_store_dir="/tmp/Endpoint_SlaveEndpointTest_NoAuthorizer_1_M2031o/store/appc" --authenticate_http_readonly="true"
--authenticate_http_readwrite="true" --authenticatee="crammd5" --authentication_backoff_factor="1secs"
--authorizer="local" --cgroups_cpu_enable_pids_and_tids_count="false" --cgroups_enable_cfs="false"
--cgroups_hierarchy="/sys/fs/cgroup" --cgroups_limit_swap="false" --cgroups_root="mesos" --container_disk_watch_interval="15secs"
--containerizers="mesos" --credential="/tmp/Endpoint_SlaveEndpointTest_NoAuthorizer_1_M2031o/credential"
--default_role="*" --disk_watch_interval="1mins" --docker="docker" --docker_kill_orphans="true"
--docker_registry="https://registry-1.docker.io" --docker_remove_delay="6hrs" --docker_socket="/var/run/docker.sock"
--docker_stop_timeout="0ns" --docker_store_dir="/tmp/Endpoint_SlaveEndpointTest_NoAuthorizer_1_M2031o/store/docker"
--docker_volume_checkpoint_dir="/var/run/mesos/isolators/docker/volume" --enforce_container_disk_quota="false"
--executor_registration_timeout="1mins" --executor_reregistration_timeout="2secs" --executor_shutdown_grace_period="5secs"
--fetcher_cache_dir="/tmp/Endpoint_SlaveEndpointTest_NoAuthorizer_1_M2031o/fetch" --fetcher_cache_size="2GB"
--frameworks_home="" --gc_delay="1weeks" --gc_disk_headroom="0.1" --hadoop_home="" --help="false"
--hostname_lookup="true" --http_command_executor="false" --http_credentials="/tmp/Endpoint_SlaveEndpointTest_NoAuthorizer_1_M2031o/http_credentials"
--http_heartbeat_interval="30secs" --initialize_driver_logging="true" --isolation="posix/cpu,posix/mem"
--launcher="posix" --launcher_dir="/mesos/mesos-1.4.0/_build/src" --logbufsecs="0" --logging_level="INFO"
--max_completed_executors_per_framework="150" --oversubscribed_resources_interval="15secs"
--perf_duration="10secs" --perf_interval="1mins" --port="5051" --qos_correction_interval_min="0ns"
--quiet="false" --recover="reconnect" --recovery_timeout="15mins" --registration_backoff_factor="10ms"
--resources="cpus:2;gpus:0;mem:1024;disk:1024;ports:[31000-32000]" --revocable_cpu_low_priority="true"
--runtime_dir="/tmp/Endpoint_SlaveEndpointTest_NoAuthorizer_1_M2031o" --sandbox_directory="/mnt/mesos/sandbox"
--strict="true" --switch_user="true" --systemd_enable_support="true" --systemd_runtime_directory="/run/systemd/system"
--version="false" --work_dir="/tmp/Endpoint_SlaveEndpointTest_NoAuthorizer_1_pKzmIi"
I0730 05:18:39.399224  5115 credentials.hpp:86] Loading credential for authentication from
'/tmp/Endpoint_SlaveEndpointTest_NoAuthorizer_1_M2031o/credential'
I0730 05:18:39.399529  5115 slave.cpp:283] Agent using credential for: test-principal
I0730 05:18:39.399591  5115 credentials.hpp:37] Loading credentials for authentication from
'/tmp/Endpoint_SlaveEndpointTest_NoAuthorizer_1_M2031o/http_credentials'
I0730 05:18:39.400015  5115 http.cpp:993] Creating default 'basic' HTTP authenticator for
realm 'mesos-agent-readonly'
I0730 05:18:39.400279  5115 http.cpp:993] Creating default 'basic' HTTP authenticator for
realm 'mesos-agent-readwrite'
I0730 05:18:39.402501  5115 slave.cpp:565] Agent resources: [{"name":"cpus","scalar":{"value":2.0},"type":"SCALAR"},{"name":"mem","scalar":{"value":1024.0},"type":"SCALAR"},{"name":"disk","scalar":{"value":1024.0},"type":"SCALAR"},{"name":"ports","ranges":{"range":[{"begin":31000,"end":32000}]},"type":"RANGES"}]
I0730 05:18:39.402968  5115 slave.cpp:573] Agent attributes: [  ]
I0730 05:18:39.403019  5115 slave.cpp:582] Agent hostname: 562c4cb38d58
I0730 05:18:39.403367  5118 status_update_manager.cpp:177] Pausing sending status updates
I0730 05:18:39.405499  5120 state.cpp:64] Recovering state from '/tmp/Endpoint_SlaveEndpointTest_NoAuthorizer_1_pKzmIi/meta'
I0730 05:18:39.405956  5121 status_update_manager.cpp:203] Recovering status update manager
I0730 05:18:39.406195  5121 containerizer.cpp:582] Recovering containerizer
I0730 05:18:39.408198  5121 provisioner.cpp:416] Provisioner recovery complete
I0730 05:18:39.408723  5120 slave.cpp:6207] Finished recovery
I0730 05:18:39.409421  5120 slave.cpp:6389] Querying resource estimator for oversubscribable
resources
I0730 05:18:39.409919  5114 slave.cpp:6403] Received oversubscribable resources {} from the
resource estimator
I0730 05:18:39.413826  5119 process.cpp:3836] Handling HTTP event for process 'slave(800)'
with path: '/slave(800)/monitor/statistics.json'
I0730 05:18:39.416082  5115 http.cpp:1133] HTTP GET for /slave(800)/monitor/statistics.json
from 172.17.0.3:46884
I0730 05:18:39.416465  5115 http.cpp:957] Authorizing principal 'test-principal' to GET the
'/monitor/statistics.json' endpoint
I0730 05:18:39.422415  5117 slave.cpp:843] Agent terminating
[       OK ] Endpoint/SlaveEndpointTest.NoAuthorizer/1 (47 ms)
[ RUN      ] Endpoint/SlaveEndpointTest.NoAuthorizer/2
I0730 05:18:39.439723  5095 containerizer.cpp:230] Using isolation: posix/cpu,posix/mem,filesystem/posix,network/cni,environment_secret
W0730 05:18:39.440503  5095 backend.cpp:76] Failed to create 'overlay' backend: OverlayBackend
requires root privileges
W0730 05:18:39.440678  5095 backend.cpp:76] Failed to create 'bind' backend: BindBackend requires
root privileges
I0730 05:18:39.440722  5095 provisioner.cpp:255] Using default backend 'copy'
I0730 05:18:39.443166  5095 cluster.cpp:448] Creating default 'local' authorizer
I0730 05:18:39.445971  5118 slave.cpp:250] Mesos agent started on (801)@172.17.0.3:46531
I0730 05:18:39.446013  5118 slave.cpp:251] Flags at startup: --acls="" --appc_simple_discovery_uri_prefix="http://"
--appc_store_dir="/tmp/Endpoint_SlaveEndpointTest_NoAuthorizer_2_iVvbJO/store/appc" --authenticate_http_readonly="true"
--authenticate_http_readwrite="true" --authenticatee="crammd5" --authentication_backoff_factor="1secs"
--authorizer="local" --cgroups_cpu_enable_pids_and_tids_count="false" --cgroups_enable_cfs="false"
--cgroups_hierarchy="/sys/fs/cgroup" --cgroups_limit_swap="false" --cgroups_root="mesos" --container_disk_watch_interval="15secs"
--containerizers="mesos" --credential="/tmp/Endpoint_SlaveEndpointTest_NoAuthorizer_2_iVvbJO/credential"
--default_role="*" --disk_watch_interval="1mins" --docker="docker" --docker_kill_orphans="true"
--docker_registry="https://registry-1.docker.io" --docker_remove_delay="6hrs" --docker_socket="/var/run/docker.sock"
--docker_stop_timeout="0ns" --docker_store_dir="/tmp/Endpoint_SlaveEndpointTest_NoAuthorizer_2_iVvbJO/store/docker"
--docker_volume_checkpoint_dir="/var/run/mesos/isolators/docker/volume" --enforce_container_disk_quota="false"
--executor_registration_timeout="1mins" --executor_reregistration_timeout="2secs" --executor_shutdown_grace_period="5secs"
--fetcher_cache_dir="/tmp/Endpoint_SlaveEndpointTest_NoAuthorizer_2_iVvbJO/fetch" --fetcher_cache_size="2GB"
--frameworks_home="" --gc_delay="1weeks" --gc_disk_headroom="0.1" --hadoop_home="" --help="false"
--hostname_lookup="true" --http_command_executor="false" --http_credentials="/tmp/Endpoint_SlaveEndpointTest_NoAuthorizer_2_iVvbJO/http_credentials"
--http_heartbeat_interval="30secs" --initialize_driver_logging="true" --isolation="posix/cpu,posix/mem"
--launcher="posix" --launcher_dir="/mesos/mesos-1.4.0/_build/src" --logbufsecs="0" --logging_level="INFO"
--max_completed_executors_per_framework="150" --oversubscribed_resources_interval="15secs"
--perf_duration="10secs" --perf_interval="1mins" --port="5051" --qos_correction_interval_min="0ns"
--quiet="false" --recover="reconnect" --recovery_timeout="15mins" --registration_backoff_factor="10ms"
--resources="cpus:2;gpus:0;mem:1024;disk:1024;ports:[31000-32000]" --revocable_cpu_low_priority="true"
--runtime_dir="/tmp/Endpoint_SlaveEndpointTest_NoAuthorizer_2_iVvbJO" --sandbox_directory="/mnt/mesos/sandbox"
--strict="true" --switch_user="true" --systemd_enable_support="true" --systemd_runtime_directory="/run/systemd/system"
--version="false" --work_dir="/tmp/Endpoint_SlaveEndpointTest_NoAuthorizer_2_vh2JhI"
I0730 05:18:39.446848  5118 credentials.hpp:86] Loading credential for authentication from
'/tmp/Endpoint_SlaveEndpointTest_NoAuthorizer_2_iVvbJO/credential'
I0730 05:18:39.447257  5118 slave.cpp:283] Agent using credential for: test-principal
I0730 05:18:39.447285  5118 credentials.hpp:37] Loading credentials for authentication from
'/tmp/Endpoint_SlaveEndpointTest_NoAuthorizer_2_iVvbJO/http_credentials'
I0730 05:18:39.447731  5118 http.cpp:993] Creating default 'basic' HTTP authenticator for
realm 'mesos-agent-readonly'
I0730 05:18:39.448041  5118 http.cpp:993] Creating default 'basic' HTTP authenticator for
realm 'mesos-agent-readwrite'
I0730 05:18:39.450333  5118 slave.cpp:565] Agent resources: [{"name":"cpus","scalar":{"value":2.0},"type":"SCALAR"},{"name":"mem","scalar":{"value":1024.0},"type":"SCALAR"},{"name":"disk","scalar":{"value":1024.0},"type":"SCALAR"},{"name":"ports","ranges":{"range":[{"begin":31000,"end":32000}]},"type":"RANGES"}]
I0730 05:18:39.450758  5118 slave.cpp:573] Agent attributes: [  ]
I0730 05:18:39.450780  5118 slave.cpp:582] Agent hostname: 562c4cb38d58
I0730 05:18:39.451126  5115 status_update_manager.cpp:177] Pausing sending status updates
I0730 05:18:39.452841  5117 state.cpp:64] Recovering state from '/tmp/Endpoint_SlaveEndpointTest_NoAuthorizer_2_vh2JhI/meta'
I0730 05:18:39.453374  5116 status_update_manager.cpp:203] Recovering status update manager
I0730 05:18:39.453968  5119 containerizer.cpp:582] Recovering containerizer
I0730 05:18:39.456424  5117 provisioner.cpp:416] Provisioner recovery complete
I0730 05:18:39.456925  5116 slave.cpp:6207] Finished recovery
I0730 05:18:39.457586  5116 slave.cpp:6389] Querying resource estimator for oversubscribable
resources
I0730 05:18:39.458068  5117 slave.cpp:6403] Received oversubscribable resources {} from the
resource estimator
I0730 05:18:39.462481  5120 process.cpp:3836] Handling HTTP event for process 'slave(801)'
with path: '/slave(801)/containers'
I0730 05:18:39.464483  5117 http.cpp:1133] HTTP GET for /slave(801)/containers from 172.17.0.3:46886
I0730 05:18:39.464612  5117 http.cpp:957] Authorizing principal 'test-principal' to GET the
'/containers' endpoint
I0730 05:18:39.470597  5117 slave.cpp:843] Agent terminating
[       OK ] Endpoint/SlaveEndpointTest.NoAuthorizer/2 (50 ms)
[----------] 9 tests from Endpoint/SlaveEndpointTest (429 ms total)

[----------] Global test environment tear-down
[==========] 1649 tests from 181 test cases ran. (713328 ms total)
[  PASSED  ] 1645 tests.
[  FAILED  ] 4 tests, listed below:
[  FAILED  ] DefaultExecutorCheckTest.CommandCheckDeliveredAndReconciled
[  FAILED  ] DefaultExecutorCheckTest.CommandCheckStatusChange
[  FAILED  ] DefaultExecutorCheckTest.CommandCheckSeesParentsEnv
[  FAILED  ] DefaultExecutorCheckTest.CommandCheckSharesWorkDirWithTask

 4 FAILED TESTS
  YOU HAVE 20 DISABLED TESTS

I0730 05:18:39.620342  5122 process.cpp:1006] Failed to accept socket: future discarded
make[4]: *** [check-local] Error 1
make[4]: Leaving directory `/mesos/mesos-1.4.0/_build/src'
make[3]: *** [check-am] Error 2
make[3]: Leaving directory `/mesos/mesos-1.4.0/_build/src'
make[2]: *** [check] Error 2
make[2]: Leaving directory `/mesos/mesos-1.4.0/_build/src'
make[1]: *** [check-recursive] Error 1
make[1]: Leaving directory `/mesos/mesos-1.4.0/_build'
make: *** [distcheck] Error 1
+ docker rmi mesos-1501386274-9103
Untagged: mesos-1501386274-9103:latest
Deleted: sha256:d232d4d8e9ccb8eef2a6f5932d620065c6df8e28bcd1fa8ab6718cffe466e414
Deleted: sha256:b41ed65ec9d238f49a4051a5e7066ff3211611b3eb946df277d338fcfa28f26b
Deleted: sha256:601bba053027b6d21c6aac77778455946b5c75d2f4c306bb6802f3fa74207c7e
Deleted: sha256:beb450094fb6b9ff7ebf50c8de4fef1c2cc5bef506840474dde678bf2c68fc90
Deleted: sha256:2eb6ebee4525225c9b842fec31e9e4bebc9b7bf50424fc14e198729de0853d56
Deleted: sha256:66f21b9cf1363aba4c22f97c0185f78f47cf6f856514b4bc60f92f16cd38482f
Deleted: sha256:10f3420f37778a1f264cdd04ad7101fd927892fe4afa1422bee4f4394f1dbc2c
Deleted: sha256:9cf44ec772e7b4510b0c76c85aeea4af837f4e5cd32706902ea983b8b218b33e
Deleted: sha256:eae3541bda32986324c1cd297cff506dd970c45fdb4df76fea024bac171dfff9
Deleted: sha256:f9a03058aed6b5ac2424d7d771a8188a06b4a9db71895ce7a7847e719fe583da
Deleted: sha256:0b0983840f7e26fcf0033dcbf5eee7333f1e30f32e136177d58950c865c13a33
Deleted: sha256:e64bb9e85f416384e8e79cf96c97eeba6e56c69fa1bf7d520b866a203f20c958
Deleted: sha256:053d496bd647f06b89d12bc9b8f1bcd55afbf3518e5bdcd0770fee0815fdba0b
Deleted: sha256:79c67254c4a9e320761342ef4e11387b6bbf141c250f750316ce21e7e7855570
Deleted: sha256:3fc08b78afa480db1ba8427be79c0d3e858f870df3612d4efafc3aad1867f918
Deleted: sha256:d0b0a04de3f1f134cc9963f21b386f11998874e1dd46501f336311d8753ab5e4
Deleted: sha256:50e10fc20c5c5d488251132a2f11826fb75afaf44b77c99ee0c11570f176976f
Deleted: sha256:55fa05dceb49a595919df0968564af13d495fa3e08eae26074674f7090a0411a
Deleted: sha256:2e34dd1b8c0f89054465f3f87b84557991bf7a42d0cc7e6837b97855a447f041
Deleted: sha256:cb8295132c4d7579dce9c4a4489208ebb434c7a8aa65a4f21d08b7ef30bcb657
Deleted: sha256:de83c637ca45c37602ea30756ad93b76a37200d89da81cb4224ab10c02c5856e
Deleted: sha256:dc150bb799b0ffbf6d5630d6228fb40a1c46302de51e818d84426351aa687c8c
Deleted: sha256:2262eb23f4d511b9cc7888910595e76d107ee70e6c6e02d9e0d0aa3edca7fd8a
Deleted: sha256:4122358a2aeef0f97c768e0eb3560bc8bb832b3a8dd7def00e4d802287169042
Build step 'Execute shell' marked build as failure

Mime
View raw message