mesos-builds mailing list archives

Site index · List index
Message view « Date » · « Thread »
Top « Date » · « Thread »
From Apache Jenkins Server <jenk...@builds.apache.org>
Subject Build failed in Jenkins: Mesos-Buildbot » autotools,clang,--verbose --enable-libevent --enable-ssl,GLOG_v=1 MESOS_VERBOSE=1,ubuntu:14.04,(ubuntu)&&(!ubuntu-us1)&&(!ubuntu-eu2) #3944
Date Fri, 21 Jul 2017 05:29:44 GMT
See <https://builds.apache.org/job/Mesos-Buildbot/BUILDTOOL=autotools,COMPILER=clang,CONFIGURATION=--verbose%20--enable-libevent%20--enable-ssl,ENVIRONMENT=GLOG_v=1%20MESOS_VERBOSE=1,OS=ubuntu%3A14.04,label_exp=(ubuntu)&&(!ubuntu-us1)&&(!ubuntu-eu2)/3944/display/redirect?page=changes>

Changes:

[xujyan] Print the `resource` that fails CHECK.

------------------------------------------
[...truncated 31.55 MB...]
I0721 05:29:29.368726 24510 http.cpp:1133] HTTP GET for /slave(798)/containers from 172.17.0.5:58944
I0721 05:29:29.368794 24510 http.cpp:957] Authorizing principal 'test-principal' to GET the
'/containers' endpoint
I0721 05:29:29.372601 24516 slave.cpp:843] Agent terminating
[       OK ] Endpoint/SlaveEndpointTest.AuthorizedRequest/2 (30 ms)
[ RUN      ] Endpoint/SlaveEndpointTest.UnauthorizedRequest/0
I0721 05:29:29.381866  5685 containerizer.cpp:230] Using isolation: posix/cpu,posix/mem,filesystem/posix,network/cni,environment_secret
W0721 05:29:29.382313  5685 backend.cpp:76] Failed to create 'aufs' backend: AufsBackend requires
root privileges
W0721 05:29:29.382401  5685 backend.cpp:76] Failed to create 'bind' backend: BindBackend requires
root privileges
I0721 05:29:29.382439  5685 provisioner.cpp:255] Using default backend 'copy'
I0721 05:29:29.385107 24510 slave.cpp:250] Mesos agent started on (799)@172.17.0.5:40309
I0721 05:29:29.385141 24510 slave.cpp:251] Flags at startup: --acls="" --appc_simple_discovery_uri_prefix="http://"
--appc_store_dir="/tmp/Endpoint_SlaveEndpointTest_UnauthorizedRequest_0_qtYn1e/store/appc"
--authenticate_http_executors="true" --authenticate_http_readonly="true" --authenticate_http_readwrite="true"
--authenticatee="crammd5" --authentication_backoff_factor="1secs" --authorizer="local" --cgroups_cpu_enable_pids_and_tids_count="false"
--cgroups_enable_cfs="false" --cgroups_hierarchy="/sys/fs/cgroup" --cgroups_limit_swap="false"
--cgroups_root="mesos" --container_disk_watch_interval="15secs" --containerizers="mesos" --credential="/tmp/Endpoint_SlaveEndpointTest_UnauthorizedRequest_0_qtYn1e/credential"
--default_role="*" --disk_watch_interval="1mins" --docker="docker" --docker_kill_orphans="true"
--docker_registry="https://registry-1.docker.io" --docker_remove_delay="6hrs" --docker_socket="/var/run/docker.sock"
--docker_stop_timeout="0ns" --docker_store_dir="/tmp/Endpoint_SlaveEndpointTest_UnauthorizedRequest_0_qtYn1e/store/docker"
--docker_volume_checkpoint_dir="/var/run/mesos/isolators/docker/volume" --enforce_container_disk_quota="false"
--executor_registration_timeout="1mins" --executor_reregistration_timeout="2secs" --executor_secret_key="/tmp/Endpoint_SlaveEndpointTest_UnauthorizedRequest_0_qtYn1e/executor_secret_key"
--executor_shutdown_grace_period="5secs" --fetcher_cache_dir="/tmp/Endpoint_SlaveEndpointTest_UnauthorizedRequest_0_qtYn1e/fetch"
--fetcher_cache_size="2GB" --frameworks_home="" --gc_delay="1weeks" --gc_disk_headroom="0.1"
--hadoop_home="" --help="false" --hostname_lookup="true" --http_command_executor="false" --http_credentials="/tmp/Endpoint_SlaveEndpointTest_UnauthorizedRequest_0_qtYn1e/http_credentials"
--http_heartbeat_interval="30secs" --initialize_driver_logging="true" --isolation="posix/cpu,posix/mem"
--launcher="posix" --launcher_dir="/mesos/mesos-1.4.0/_build/src" --logbufsecs="0" --logging_level="INFO"
--max_completed_executors_per_framework="150" --oversubscribed_resources_interval="15secs"
--perf_duration="10secs" --perf_interval="1mins" --port="5051" --qos_correction_interval_min="0ns"
--quiet="false" --recover="reconnect" --recovery_timeout="15mins" --registration_backoff_factor="10ms"
--resources="cpus:2;gpus:0;mem:1024;disk:1024;ports:[31000-32000]" --revocable_cpu_low_priority="true"
--runtime_dir="/tmp/Endpoint_SlaveEndpointTest_UnauthorizedRequest_0_qtYn1e" --sandbox_directory="/mnt/mesos/sandbox"
--strict="true" --switch_user="true" --systemd_enable_support="true" --systemd_runtime_directory="/run/systemd/system"
--version="false" --work_dir="/tmp/Endpoint_SlaveEndpointTest_UnauthorizedRequest_0_jCSvC8"
I0721 05:29:29.385562 24510 credentials.hpp:86] Loading credential for authentication from
'/tmp/Endpoint_SlaveEndpointTest_UnauthorizedRequest_0_qtYn1e/credential'
I0721 05:29:29.385709 24510 slave.cpp:283] Agent using credential for: test-principal
I0721 05:29:29.385730 24510 credentials.hpp:37] Loading credentials for authentication from
'/tmp/Endpoint_SlaveEndpointTest_UnauthorizedRequest_0_qtYn1e/http_credentials'
I0721 05:29:29.385996 24510 http.cpp:993] Creating default 'basic' HTTP authenticator for
realm 'mesos-agent-executor'
I0721 05:29:29.386113 24510 http.cpp:1014] Creating default 'jwt' HTTP authenticator for realm
'mesos-agent-executor'
I0721 05:29:29.386276 24510 http.cpp:993] Creating default 'basic' HTTP authenticator for
realm 'mesos-agent-readonly'
I0721 05:29:29.386371 24510 http.cpp:1014] Creating default 'jwt' HTTP authenticator for realm
'mesos-agent-readonly'
I0721 05:29:29.386526 24510 http.cpp:993] Creating default 'basic' HTTP authenticator for
realm 'mesos-agent-readwrite'
I0721 05:29:29.386623 24510 http.cpp:1014] Creating default 'jwt' HTTP authenticator for realm
'mesos-agent-readwrite'
I0721 05:29:29.387800 24510 slave.cpp:565] Agent resources: [{"name":"cpus","scalar":{"value":2.0},"type":"SCALAR"},{"name":"mem","scalar":{"value":1024.0},"type":"SCALAR"},{"name":"disk","scalar":{"value":1024.0},"type":"SCALAR"},{"name":"ports","ranges":{"range":[{"begin":31000,"end":32000}]},"type":"RANGES"}]
I0721 05:29:29.387992 24510 slave.cpp:573] Agent attributes: [  ]
I0721 05:29:29.388007 24510 slave.cpp:582] Agent hostname: 90913c4e99d0
I0721 05:29:29.388109 24501 status_update_manager.cpp:177] Pausing sending status updates
I0721 05:29:29.389220 24507 state.cpp:64] Recovering state from '/tmp/Endpoint_SlaveEndpointTest_UnauthorizedRequest_0_jCSvC8/meta'
I0721 05:29:29.389499 24512 status_update_manager.cpp:203] Recovering status update manager
I0721 05:29:29.389688 24506 containerizer.cpp:582] Recovering containerizer
I0721 05:29:29.390781 24512 provisioner.cpp:416] Provisioner recovery complete
I0721 05:29:29.391100 24511 slave.cpp:6207] Finished recovery
I0721 05:29:29.391544 24511 slave.cpp:6389] Querying resource estimator for oversubscribable
resources
I0721 05:29:29.391747 24508 slave.cpp:6403] Received oversubscribable resources {} from the
resource estimator
I0721 05:29:29.393821 24513 process.cpp:3837] Handling HTTP event for process 'slave(799)'
with path: '/slave(799)/monitor/statistics'
I0721 05:29:29.395217 24509 http.cpp:1133] HTTP GET for /slave(799)/monitor/statistics from
172.17.0.5:58945
I0721 05:29:29.395289 24509 http.cpp:957] Authorizing principal 'test-principal' to GET the
'/monitor/statistics' endpoint
I0721 05:29:29.397068 24513 slave.cpp:843] Agent terminating
[       OK ] Endpoint/SlaveEndpointTest.UnauthorizedRequest/0 (24 ms)
[ RUN      ] Endpoint/SlaveEndpointTest.UnauthorizedRequest/1
I0721 05:29:29.405931  5685 containerizer.cpp:230] Using isolation: posix/cpu,posix/mem,filesystem/posix,network/cni,environment_secret
W0721 05:29:29.406368  5685 backend.cpp:76] Failed to create 'aufs' backend: AufsBackend requires
root privileges
W0721 05:29:29.406455  5685 backend.cpp:76] Failed to create 'bind' backend: BindBackend requires
root privileges
I0721 05:29:29.406486  5685 provisioner.cpp:255] Using default backend 'copy'
I0721 05:29:29.409471 24515 slave.cpp:250] Mesos agent started on (800)@172.17.0.5:40309
I0721 05:29:29.409505 24515 slave.cpp:251] Flags at startup: --acls="" --appc_simple_discovery_uri_prefix="http://"
--appc_store_dir="/tmp/Endpoint_SlaveEndpointTest_UnauthorizedRequest_1_ySRaQE/store/appc"
--authenticate_http_executors="true" --authenticate_http_readonly="true" --authenticate_http_readwrite="true"
--authenticatee="crammd5" --authentication_backoff_factor="1secs" --authorizer="local" --cgroups_cpu_enable_pids_and_tids_count="false"
--cgroups_enable_cfs="false" --cgroups_hierarchy="/sys/fs/cgroup" --cgroups_limit_swap="false"
--cgroups_root="mesos" --container_disk_watch_interval="15secs" --containerizers="mesos" --credential="/tmp/Endpoint_SlaveEndpointTest_UnauthorizedRequest_1_ySRaQE/credential"
--default_role="*" --disk_watch_interval="1mins" --docker="docker" --docker_kill_orphans="true"
--docker_registry="https://registry-1.docker.io" --docker_remove_delay="6hrs" --docker_socket="/var/run/docker.sock"
--docker_stop_timeout="0ns" --docker_store_dir="/tmp/Endpoint_SlaveEndpointTest_UnauthorizedRequest_1_ySRaQE/store/docker"
--docker_volume_checkpoint_dir="/var/run/mesos/isolators/docker/volume" --enforce_container_disk_quota="false"
--executor_registration_timeout="1mins" --executor_reregistration_timeout="2secs" --executor_secret_key="/tmp/Endpoint_SlaveEndpointTest_UnauthorizedRequest_1_ySRaQE/executor_secret_key"
--executor_shutdown_grace_period="5secs" --fetcher_cache_dir="/tmp/Endpoint_SlaveEndpointTest_UnauthorizedRequest_1_ySRaQE/fetch"
--fetcher_cache_size="2GB" --frameworks_home="" --gc_delay="1weeks" --gc_disk_headroom="0.1"
--hadoop_home="" --help="false" --hostname_lookup="true" --http_command_executor="false" --http_credentials="/tmp/Endpoint_SlaveEndpointTest_UnauthorizedRequest_1_ySRaQE/http_credentials"
--http_heartbeat_interval="30secs" --initialize_driver_logging="true" --isolation="posix/cpu,posix/mem"
--launcher="posix" --launcher_dir="/mesos/mesos-1.4.0/_build/src" --logbufsecs="0" --logging_level="INFO"
--max_completed_executors_per_framework="150" --oversubscribed_resources_interval="15secs"
--perf_duration="10secs" --perf_interval="1mins" --port="5051" --qos_correction_interval_min="0ns"
--quiet="false" --recover="reconnect" --recovery_timeout="15mins" --registration_backoff_factor="10ms"
--resources="cpus:2;gpus:0;mem:1024;disk:1024;ports:[31000-32000]" --revocable_cpu_low_priority="true"
--runtime_dir="/tmp/Endpoint_SlaveEndpointTest_UnauthorizedRequest_1_ySRaQE" --sandbox_directory="/mnt/mesos/sandbox"
--strict="true" --switch_user="true" --systemd_enable_support="true" --systemd_runtime_directory="/run/systemd/system"
--version="false" --work_dir="/tmp/Endpoint_SlaveEndpointTest_UnauthorizedRequest_1_hLCpny"
I0721 05:29:29.409883 24515 credentials.hpp:86] Loading credential for authentication from
'/tmp/Endpoint_SlaveEndpointTest_UnauthorizedRequest_1_ySRaQE/credential'
I0721 05:29:29.410027 24515 slave.cpp:283] Agent using credential for: test-principal
I0721 05:29:29.410048 24515 credentials.hpp:37] Loading credentials for authentication from
'/tmp/Endpoint_SlaveEndpointTest_UnauthorizedRequest_1_ySRaQE/http_credentials'
I0721 05:29:29.410302 24515 http.cpp:993] Creating default 'basic' HTTP authenticator for
realm 'mesos-agent-executor'
I0721 05:29:29.410409 24515 http.cpp:1014] Creating default 'jwt' HTTP authenticator for realm
'mesos-agent-executor'
I0721 05:29:29.410607 24515 http.cpp:993] Creating default 'basic' HTTP authenticator for
realm 'mesos-agent-readonly'
I0721 05:29:29.410775 24515 http.cpp:1014] Creating default 'jwt' HTTP authenticator for realm
'mesos-agent-readonly'
I0721 05:29:29.410935 24515 http.cpp:993] Creating default 'basic' HTTP authenticator for
realm 'mesos-agent-readwrite'
I0721 05:29:29.411054 24515 http.cpp:1014] Creating default 'jwt' HTTP authenticator for realm
'mesos-agent-readwrite'
I0721 05:29:29.412268 24515 slave.cpp:565] Agent resources: [{"name":"cpus","scalar":{"value":2.0},"type":"SCALAR"},{"name":"mem","scalar":{"value":1024.0},"type":"SCALAR"},{"name":"disk","scalar":{"value":1024.0},"type":"SCALAR"},{"name":"ports","ranges":{"range":[{"begin":31000,"end":32000}]},"type":"RANGES"}]
I0721 05:29:29.412462 24515 slave.cpp:573] Agent attributes: [  ]
I0721 05:29:29.412482 24515 slave.cpp:582] Agent hostname: 90913c4e99d0
I0721 05:29:29.412686 24504 status_update_manager.cpp:177] Pausing sending status updates
I0721 05:29:29.413864 24506 state.cpp:64] Recovering state from '/tmp/Endpoint_SlaveEndpointTest_UnauthorizedRequest_1_hLCpny/meta'
I0721 05:29:29.414113 24508 status_update_manager.cpp:203] Recovering status update manager
I0721 05:29:29.414263 24501 containerizer.cpp:582] Recovering containerizer
I0721 05:29:29.415402 24508 provisioner.cpp:416] Provisioner recovery complete
I0721 05:29:29.415756 24502 slave.cpp:6207] Finished recovery
I0721 05:29:29.416195 24502 slave.cpp:6389] Querying resource estimator for oversubscribable
resources
I0721 05:29:29.416388 24510 slave.cpp:6403] Received oversubscribable resources {} from the
resource estimator
I0721 05:29:29.418655 24509 process.cpp:3837] Handling HTTP event for process 'slave(800)'
with path: '/slave(800)/monitor/statistics.json'
I0721 05:29:29.420215 24515 http.cpp:1133] HTTP GET for /slave(800)/monitor/statistics.json
from 172.17.0.5:58946
I0721 05:29:29.420290 24515 http.cpp:957] Authorizing principal 'test-principal' to GET the
'/monitor/statistics.json' endpoint
I0721 05:29:29.422174 24501 slave.cpp:843] Agent terminating
[       OK ] Endpoint/SlaveEndpointTest.UnauthorizedRequest/1 (25 ms)
[ RUN      ] Endpoint/SlaveEndpointTest.UnauthorizedRequest/2
I0721 05:29:29.430958  5685 containerizer.cpp:230] Using isolation: posix/cpu,posix/mem,filesystem/posix,network/cni,environment_secret
W0721 05:29:29.431360  5685 backend.cpp:76] Failed to create 'aufs' backend: AufsBackend requires
root privileges
W0721 05:29:29.431443  5685 backend.cpp:76] Failed to create 'bind' backend: BindBackend requires
root privileges
I0721 05:29:29.431473  5685 provisioner.cpp:255] Using default backend 'copy'
I0721 05:29:29.434090 24515 slave.cpp:250] Mesos agent started on (801)@172.17.0.5:40309
I0721 05:29:29.434128 24515 slave.cpp:251] Flags at startup: --acls="" --appc_simple_discovery_uri_prefix="http://"
--appc_store_dir="/tmp/Endpoint_SlaveEndpointTest_UnauthorizedRequest_2_yfQdV4/store/appc"
--authenticate_http_executors="true" --authenticate_http_readonly="true" --authenticate_http_readwrite="true"
--authenticatee="crammd5" --authentication_backoff_factor="1secs" --authorizer="local" --cgroups_cpu_enable_pids_and_tids_count="false"
--cgroups_enable_cfs="false" --cgroups_hierarchy="/sys/fs/cgroup" --cgroups_limit_swap="false"
--cgroups_root="mesos" --container_disk_watch_interval="15secs" --containerizers="mesos" --credential="/tmp/Endpoint_SlaveEndpointTest_UnauthorizedRequest_2_yfQdV4/credential"
--default_role="*" --disk_watch_interval="1mins" --docker="docker" --docker_kill_orphans="true"
--docker_registry="https://registry-1.docker.io" --docker_remove_delay="6hrs" --docker_socket="/var/run/docker.sock"
--docker_stop_timeout="0ns" --docker_store_dir="/tmp/Endpoint_SlaveEndpointTest_UnauthorizedRequest_2_yfQdV4/store/docker"
--docker_volume_checkpoint_dir="/var/run/mesos/isolators/docker/volume" --enforce_container_disk_quota="false"
--executor_registration_timeout="1mins" --executor_reregistration_timeout="2secs" --executor_secret_key="/tmp/Endpoint_SlaveEndpointTest_UnauthorizedRequest_2_yfQdV4/executor_secret_key"
--executor_shutdown_grace_period="5secs" --fetcher_cache_dir="/tmp/Endpoint_SlaveEndpointTest_UnauthorizedRequest_2_yfQdV4/fetch"
--fetcher_cache_size="2GB" --frameworks_home="" --gc_delay="1weeks" --gc_disk_headroom="0.1"
--hadoop_home="" --help="false" --hostname_lookup="true" --http_command_executor="false" --http_credentials="/tmp/Endpoint_SlaveEndpointTest_UnauthorizedRequest_2_yfQdV4/http_credentials"
--http_heartbeat_interval="30secs" --initialize_driver_logging="true" --isolation="posix/cpu,posix/mem"
--launcher="posix" --launcher_dir="/mesos/mesos-1.4.0/_build/src" --logbufsecs="0" --logging_level="INFO"
--max_completed_executors_per_framework="150" --oversubscribed_resources_interval="15secs"
--perf_duration="10secs" --perf_interval="1mins" --port="5051" --qos_correction_interval_min="0ns"
--quiet="false" --recover="reconnect" --recovery_timeout="15mins" --registration_backoff_factor="10ms"
--resources="cpus:2;gpus:0;mem:1024;disk:1024;ports:[31000-32000]" --revocable_cpu_low_priority="true"
--runtime_dir="/tmp/Endpoint_SlaveEndpointTest_UnauthorizedRequest_2_yfQdV4" --sandbox_directory="/mnt/mesos/sandbox"
--strict="true" --switch_user="true" --systemd_enable_support="true" --systemd_runtime_directory="/run/systemd/system"
--version="false" --work_dir="/tmp/Endpoint_SlaveEndpointTest_UnauthorizedRequest_2_xK0moY"
I0721 05:29:29.434499 24515 credentials.hpp:86] Loading credential for authentication from
'/tmp/Endpoint_SlaveEndpointTest_UnauthorizedRequest_2_yfQdV4/credential'
I0721 05:29:29.434631 24515 slave.cpp:283] Agent using credential for: test-principal
I0721 05:29:29.434654 24515 credentials.hpp:37] Loading credentials for authentication from
'/tmp/Endpoint_SlaveEndpointTest_UnauthorizedRequest_2_yfQdV4/http_credentials'
I0721 05:29:29.434890 24515 http.cpp:993] Creating default 'basic' HTTP authenticator for
realm 'mesos-agent-executor'
I0721 05:29:29.434989 24515 http.cpp:1014] Creating default 'jwt' HTTP authenticator for realm
'mesos-agent-executor'
I0721 05:29:29.435140 24515 http.cpp:993] Creating default 'basic' HTTP authenticator for
realm 'mesos-agent-readonly'
I0721 05:29:29.435228 24515 http.cpp:1014] Creating default 'jwt' HTTP authenticator for realm
'mesos-agent-readonly'
I0721 05:29:29.435369 24515 http.cpp:993] Creating default 'basic' HTTP authenticator for
realm 'mesos-agent-readwrite'
I0721 05:29:29.435451 24515 http.cpp:1014] Creating default 'jwt' HTTP authenticator for realm
'mesos-agent-readwrite'
I0721 05:29:29.436604 24515 slave.cpp:565] Agent resources: [{"name":"cpus","scalar":{"value":2.0},"type":"SCALAR"},{"name":"mem","scalar":{"value":1024.0},"type":"SCALAR"},{"name":"disk","scalar":{"value":1024.0},"type":"SCALAR"},{"name":"ports","ranges":{"range":[{"begin":31000,"end":32000}]},"type":"RANGES"}]
I0721 05:29:29.436790 24515 slave.cpp:573] Agent attributes: [  ]
I0721 05:29:29.436810 24515 slave.cpp:582] Agent hostname: 90913c4e99d0
I0721 05:29:29.436935 24511 status_update_manager.cpp:177] Pausing sending status updates
I0721 05:29:29.438015 24514 state.cpp:64] Recovering state from '/tmp/Endpoint_SlaveEndpointTest_UnauthorizedRequest_2_xK0moY/meta'
I0721 05:29:29.438244 24516 status_update_manager.cpp:203] Recovering status update manager
I0721 05:29:29.438415 24506 containerizer.cpp:582] Recovering containerizer
I0721 05:29:29.439501 24516 provisioner.cpp:416] Provisioner recovery complete
I0721 05:29:29.439807 24510 slave.cpp:6207] Finished recovery
I0721 05:29:29.440206 24510 slave.cpp:6389] Querying resource estimator for oversubscribable
resources
I0721 05:29:29.440387 24508 slave.cpp:6403] Received oversubscribable resources {} from the
resource estimator
I0721 05:29:29.442175 24505 process.cpp:3837] Handling HTTP event for process 'slave(801)'
with path: '/slave(801)/containers'
I0721 05:29:29.443506 24512 http.cpp:1133] HTTP GET for /slave(801)/containers from 172.17.0.5:58947
I0721 05:29:29.443564 24512 http.cpp:957] Authorizing principal 'test-principal' to GET the
'/containers' endpoint
I0721 05:29:29.445139  5685 slave.cpp:843] Agent terminating
[       OK ] Endpoint/SlaveEndpointTest.UnauthorizedRequest/2 (23 ms)
[ RUN      ] Endpoint/SlaveEndpointTest.NoAuthorizer/0
I0721 05:29:29.454251  5685 containerizer.cpp:230] Using isolation: posix/cpu,posix/mem,filesystem/posix,network/cni,environment_secret
W0721 05:29:29.454654  5685 backend.cpp:76] Failed to create 'aufs' backend: AufsBackend requires
root privileges
W0721 05:29:29.454748  5685 backend.cpp:76] Failed to create 'bind' backend: BindBackend requires
root privileges
I0721 05:29:29.454784  5685 provisioner.cpp:255] Using default backend 'copy'
I0721 05:29:29.456197  5685 cluster.cpp:448] Creating default 'local' authorizer
I0721 05:29:29.457561 24505 slave.cpp:250] Mesos agent started on (802)@172.17.0.5:40309
I0721 05:29:29.457600 24505 slave.cpp:251] Flags at startup: --acls="" --appc_simple_discovery_uri_prefix="http://"
--appc_store_dir="/tmp/Endpoint_SlaveEndpointTest_NoAuthorizer_0_J3Lnfv/store/appc" --authenticate_http_executors="true"
--authenticate_http_readonly="true" --authenticate_http_readwrite="true" --authenticatee="crammd5"
--authentication_backoff_factor="1secs" --authorizer="local" --cgroups_cpu_enable_pids_and_tids_count="false"
--cgroups_enable_cfs="false" --cgroups_hierarchy="/sys/fs/cgroup" --cgroups_limit_swap="false"
--cgroups_root="mesos" --container_disk_watch_interval="15secs" --containerizers="mesos" --credential="/tmp/Endpoint_SlaveEndpointTest_NoAuthorizer_0_J3Lnfv/credential"
--default_role="*" --disk_watch_interval="1mins" --docker="docker" --docker_kill_orphans="true"
--docker_registry="https://registry-1.docker.io" --docker_remove_delay="6hrs" --docker_socket="/var/run/docker.sock"
--docker_stop_timeout="0ns" --docker_store_dir="/tmp/Endpoint_SlaveEndpointTest_NoAuthorizer_0_J3Lnfv/store/docker"
--docker_volume_checkpoint_dir="/var/run/mesos/isolators/docker/volume" --enforce_container_disk_quota="false"
--executor_registration_timeout="1mins" --executor_reregistration_timeout="2secs" --executor_secret_key="/tmp/Endpoint_SlaveEndpointTest_NoAuthorizer_0_J3Lnfv/executor_secret_key"
--executor_shutdown_grace_period="5secs" --fetcher_cache_dir="/tmp/Endpoint_SlaveEndpointTest_NoAuthorizer_0_J3Lnfv/fetch"
--fetcher_cache_size="2GB" --frameworks_home="" --gc_delay="1weeks" --gc_disk_headroom="0.1"
--hadoop_home="" --help="false" --hostname_lookup="true" --http_command_executor="false" --http_credentials="/tmp/Endpoint_SlaveEndpointTest_NoAuthorizer_0_J3Lnfv/http_credentials"
--http_heartbeat_interval="30secs" --initialize_driver_logging="true" --isolation="posix/cpu,posix/mem"
--launcher="posix" --launcher_dir="/mesos/mesos-1.4.0/_build/src" --logbufsecs="0" --logging_level="INFO"
--max_completed_executors_per_framework="150" --oversubscribed_resources_interval="15secs"
--perf_duration="10secs" --perf_interval="1mins" --port="5051" --qos_correction_interval_min="0ns"
--quiet="false" --recover="reconnect" --recovery_timeout="15mins" --registration_backoff_factor="10ms"
--resources="cpus:2;gpus:0;mem:1024;disk:1024;ports:[31000-32000]" --revocable_cpu_low_priority="true"
--runtime_dir="/tmp/Endpoint_SlaveEndpointTest_NoAuthorizer_0_J3Lnfv" --sandbox_directory="/mnt/mesos/sandbox"
--strict="true" --switch_user="true" --systemd_enable_support="true" --systemd_runtime_directory="/run/systemd/system"
--version="false" --work_dir="/tmp/Endpoint_SlaveEndpointTest_NoAuthorizer_0_jkvNEo"
I0721 05:29:29.458163 24505 credentials.hpp:86] Loading credential for authentication from
'/tmp/Endpoint_SlaveEndpointTest_NoAuthorizer_0_J3Lnfv/credential'
I0721 05:29:29.458319 24505 slave.cpp:283] Agent using credential for: test-principal
I0721 05:29:29.458346 24505 credentials.hpp:37] Loading credentials for authentication from
'/tmp/Endpoint_SlaveEndpointTest_NoAuthorizer_0_J3Lnfv/http_credentials'
I0721 05:29:29.458667 24505 http.cpp:993] Creating default 'basic' HTTP authenticator for
realm 'mesos-agent-executor'
I0721 05:29:29.458775 24505 http.cpp:1014] Creating default 'jwt' HTTP authenticator for realm
'mesos-agent-executor'
I0721 05:29:29.458940 24505 http.cpp:993] Creating default 'basic' HTTP authenticator for
realm 'mesos-agent-readonly'
I0721 05:29:29.459031 24505 http.cpp:1014] Creating default 'jwt' HTTP authenticator for realm
'mesos-agent-readonly'
I0721 05:29:29.459175 24505 http.cpp:993] Creating default 'basic' HTTP authenticator for
realm 'mesos-agent-readwrite'
I0721 05:29:29.459265 24505 http.cpp:1014] Creating default 'jwt' HTTP authenticator for realm
'mesos-agent-readwrite'
I0721 05:29:29.460417 24505 slave.cpp:565] Agent resources: [{"name":"cpus","scalar":{"value":2.0},"type":"SCALAR"},{"name":"mem","scalar":{"value":1024.0},"type":"SCALAR"},{"name":"disk","scalar":{"value":1024.0},"type":"SCALAR"},{"name":"ports","ranges":{"range":[{"begin":31000,"end":32000}]},"type":"RANGES"}]
I0721 05:29:29.460611 24505 slave.cpp:573] Agent attributes: [  ]
I0721 05:29:29.460630 24505 slave.cpp:582] Agent hostname: 90913c4e99d0
I0721 05:29:29.460767 24516 status_update_manager.cpp:177] Pausing sending status updates
I0721 05:29:29.461925 24514 state.cpp:64] Recovering state from '/tmp/Endpoint_SlaveEndpointTest_NoAuthorizer_0_jkvNEo/meta'
I0721 05:29:29.462194 24510 status_update_manager.cpp:203] Recovering status update manager
I0721 05:29:29.462347 24508 containerizer.cpp:582] Recovering containerizer
I0721 05:29:29.463527 24515 provisioner.cpp:416] Provisioner recovery complete
I0721 05:29:29.463856 24511 slave.cpp:6207] Finished recovery
I0721 05:29:29.464362 24511 slave.cpp:6389] Querying resource estimator for oversubscribable
resources
I0721 05:29:29.464546 24505 slave.cpp:6403] Received oversubscribable resources {} from the
resource estimator
I0721 05:29:29.466306 24512 process.cpp:3837] Handling HTTP event for process 'slave(802)'
with path: '/slave(802)/monitor/statistics'
I0721 05:29:29.467722 24510 http.cpp:1133] HTTP GET for /slave(802)/monitor/statistics from
172.17.0.5:58948
I0721 05:29:29.467787 24510 http.cpp:957] Authorizing principal 'test-principal' to GET the
'/monitor/statistics' endpoint
I0721 05:29:29.470283 24512 slave.cpp:843] Agent terminating
[       OK ] Endpoint/SlaveEndpointTest.NoAuthorizer/0 (25 ms)
[ RUN      ] Endpoint/SlaveEndpointTest.NoAuthorizer/1
I0721 05:29:29.479537  5685 containerizer.cpp:230] Using isolation: posix/cpu,posix/mem,filesystem/posix,network/cni,environment_secret
W0721 05:29:29.479975  5685 backend.cpp:76] Failed to create 'aufs' backend: AufsBackend requires
root privileges
W0721 05:29:29.480062  5685 backend.cpp:76] Failed to create 'bind' backend: BindBackend requires
root privileges
I0721 05:29:29.480100  5685 provisioner.cpp:255] Using default backend 'copy'
I0721 05:29:29.481540  5685 cluster.cpp:448] Creating default 'local' authorizer
I0721 05:29:29.482892 24501 slave.cpp:250] Mesos agent started on (803)@172.17.0.5:40309
I0721 05:29:29.482929 24501 slave.cpp:251] Flags at startup: --acls="" --appc_simple_discovery_uri_prefix="http://"
--appc_store_dir="/tmp/Endpoint_SlaveEndpointTest_NoAuthorizer_1_vI1IPV/store/appc" --authenticate_http_executors="true"
--authenticate_http_readonly="true" --authenticate_http_readwrite="true" --authenticatee="crammd5"
--authentication_backoff_factor="1secs" --authorizer="local" --cgroups_cpu_enable_pids_and_tids_count="false"
--cgroups_enable_cfs="false" --cgroups_hierarchy="/sys/fs/cgroup" --cgroups_limit_swap="false"
--cgroups_root="mesos" --container_disk_watch_interval="15secs" --containerizers="mesos" --credential="/tmp/Endpoint_SlaveEndpointTest_NoAuthorizer_1_vI1IPV/credential"
--default_role="*" --disk_watch_interval="1mins" --docker="docker" --docker_kill_orphans="true"
--docker_registry="https://registry-1.docker.io" --docker_remove_delay="6hrs" --docker_socket="/var/run/docker.sock"
--docker_stop_timeout="0ns" --docker_store_dir="/tmp/Endpoint_SlaveEndpointTest_NoAuthorizer_1_vI1IPV/store/docker"
--docker_volume_checkpoint_dir="/var/run/mesos/isolators/docker/volume" --enforce_container_disk_quota="false"
--executor_registration_timeout="1mins" --executor_reregistration_timeout="2secs" --executor_secret_key="/tmp/Endpoint_SlaveEndpointTest_NoAuthorizer_1_vI1IPV/executor_secret_key"
--executor_shutdown_grace_period="5secs" --fetcher_cache_dir="/tmp/Endpoint_SlaveEndpointTest_NoAuthorizer_1_vI1IPV/fetch"
--fetcher_cache_size="2GB" --frameworks_home="" --gc_delay="1weeks" --gc_disk_headroom="0.1"
--hadoop_home="" --help="false" --hostname_lookup="true" --http_command_executor="false" --http_credentials="/tmp/Endpoint_SlaveEndpointTest_NoAuthorizer_1_vI1IPV/http_credentials"
--http_heartbeat_interval="30secs" --initialize_driver_logging="true" --isolation="posix/cpu,posix/mem"
--launcher="posix" --launcher_dir="/mesos/mesos-1.4.0/_build/src" --logbufsecs="0" --logging_level="INFO"
--max_completed_executors_per_framework="150" --oversubscribed_resources_interval="15secs"
--perf_duration="10secs" --perf_interval="1mins" --port="5051" --qos_correction_interval_min="0ns"
--quiet="false" --recover="reconnect" --recovery_timeout="15mins" --registration_backoff_factor="10ms"
--resources="cpus:2;gpus:0;mem:1024;disk:1024;ports:[31000-32000]" --revocable_cpu_low_priority="true"
--runtime_dir="/tmp/Endpoint_SlaveEndpointTest_NoAuthorizer_1_vI1IPV" --sandbox_directory="/mnt/mesos/sandbox"
--strict="true" --switch_user="true" --systemd_enable_support="true" --systemd_runtime_directory="/run/systemd/system"
--version="false" --work_dir="/tmp/Endpoint_SlaveEndpointTest_NoAuthorizer_1_D7U2aP"
I0721 05:29:29.483346 24501 credentials.hpp:86] Loading credential for authentication from
'/tmp/Endpoint_SlaveEndpointTest_NoAuthorizer_1_vI1IPV/credential'
I0721 05:29:29.483484 24501 slave.cpp:283] Agent using credential for: test-principal
I0721 05:29:29.483507 24501 credentials.hpp:37] Loading credentials for authentication from
'/tmp/Endpoint_SlaveEndpointTest_NoAuthorizer_1_vI1IPV/http_credentials'
I0721 05:29:29.483817 24501 http.cpp:993] Creating default 'basic' HTTP authenticator for
realm 'mesos-agent-executor'
I0721 05:29:29.483916 24501 http.cpp:1014] Creating default 'jwt' HTTP authenticator for realm
'mesos-agent-executor'
I0721 05:29:29.484081 24501 http.cpp:993] Creating default 'basic' HTTP authenticator for
realm 'mesos-agent-readonly'
I0721 05:29:29.484166 24501 http.cpp:1014] Creating default 'jwt' HTTP authenticator for realm
'mesos-agent-readonly'
I0721 05:29:29.484319 24501 http.cpp:993] Creating default 'basic' HTTP authenticator for
realm 'mesos-agent-readwrite'
I0721 05:29:29.484416 24501 http.cpp:1014] Creating default 'jwt' HTTP authenticator for realm
'mesos-agent-readwrite'
I0721 05:29:29.485618 24501 slave.cpp:565] Agent resources: [{"name":"cpus","scalar":{"value":2.0},"type":"SCALAR"},{"name":"mem","scalar":{"value":1024.0},"type":"SCALAR"},{"name":"disk","scalar":{"value":1024.0},"type":"SCALAR"},{"name":"ports","ranges":{"range":[{"begin":31000,"end":32000}]},"type":"RANGES"}]
I0721 05:29:29.485811 24501 slave.cpp:573] Agent attributes: [  ]
I0721 05:29:29.485824 24501 slave.cpp:582] Agent hostname: 90913c4e99d0
I0721 05:29:29.485952 24503 status_update_manager.cpp:177] Pausing sending status updates
I0721 05:29:29.487157 24509 state.cpp:64] Recovering state from '/tmp/Endpoint_SlaveEndpointTest_NoAuthorizer_1_D7U2aP/meta'
I0721 05:29:29.487402 24515 status_update_manager.cpp:203] Recovering status update manager
I0721 05:29:29.487568 24513 containerizer.cpp:582] Recovering containerizer
I0721 05:29:29.488618 24515 provisioner.cpp:416] Provisioner recovery complete
I0721 05:29:29.488894 24505 slave.cpp:6207] Finished recovery
I0721 05:29:29.489343 24505 slave.cpp:6389] Querying resource estimator for oversubscribable
resources
I0721 05:29:29.489604 24516 slave.cpp:6403] Received oversubscribable resources {} from the
resource estimator
I0721 05:29:29.491341 24506 process.cpp:3837] Handling HTTP event for process 'slave(803)'
with path: '/slave(803)/monitor/statistics.json'
I0721 05:29:29.492771 24502 http.cpp:1133] HTTP GET for /slave(803)/monitor/statistics.json
from 172.17.0.5:58949
I0721 05:29:29.492846 24502 http.cpp:957] Authorizing principal 'test-principal' to GET the
'/monitor/statistics.json' endpoint
I0721 05:29:29.495576 24506 slave.cpp:843] Agent terminating
[       OK ] Endpoint/SlaveEndpointTest.NoAuthorizer/1 (25 ms)
[ RUN      ] Endpoint/SlaveEndpointTest.NoAuthorizer/2
I0721 05:29:29.505117  5685 containerizer.cpp:230] Using isolation: posix/cpu,posix/mem,filesystem/posix,network/cni,environment_secret
W0721 05:29:29.505561  5685 backend.cpp:76] Failed to create 'aufs' backend: AufsBackend requires
root privileges
W0721 05:29:29.505647  5685 backend.cpp:76] Failed to create 'bind' backend: BindBackend requires
root privileges
I0721 05:29:29.505677  5685 provisioner.cpp:255] Using default backend 'copy'
I0721 05:29:29.507071  5685 cluster.cpp:448] Creating default 'local' authorizer
I0721 05:29:29.508342 24510 slave.cpp:250] Mesos agent started on (804)@172.17.0.5:40309
I0721 05:29:29.508378 24510 slave.cpp:251] Flags at startup: --acls="" --appc_simple_discovery_uri_prefix="http://"
--appc_store_dir="/tmp/Endpoint_SlaveEndpointTest_NoAuthorizer_2_DpCyGm/store/appc" --authenticate_http_executors="true"
--authenticate_http_readonly="true" --authenticate_http_readwrite="true" --authenticatee="crammd5"
--authentication_backoff_factor="1secs" --authorizer="local" --cgroups_cpu_enable_pids_and_tids_count="false"
--cgroups_enable_cfs="false" --cgroups_hierarchy="/sys/fs/cgroup" --cgroups_limit_swap="false"
--cgroups_root="mesos" --container_disk_watch_interval="15secs" --containerizers="mesos" --credential="/tmp/Endpoint_SlaveEndpointTest_NoAuthorizer_2_DpCyGm/credential"
--default_role="*" --disk_watch_interval="1mins" --docker="docker" --docker_kill_orphans="true"
--docker_registry="https://registry-1.docker.io" --docker_remove_delay="6hrs" --docker_socket="/var/run/docker.sock"
--docker_stop_timeout="0ns" --docker_store_dir="/tmp/Endpoint_SlaveEndpointTest_NoAuthorizer_2_DpCyGm/store/docker"
--docker_volume_checkpoint_dir="/var/run/mesos/isolators/docker/volume" --enforce_container_disk_quota="false"
--executor_registration_timeout="1mins" --executor_reregistration_timeout="2secs" --executor_secret_key="/tmp/Endpoint_SlaveEndpointTest_NoAuthorizer_2_DpCyGm/executor_secret_key"
--executor_shutdown_grace_period="5secs" --fetcher_cache_dir="/tmp/Endpoint_SlaveEndpointTest_NoAuthorizer_2_DpCyGm/fetch"
--fetcher_cache_size="2GB" --frameworks_home="" --gc_delay="1weeks" --gc_disk_headroom="0.1"
--hadoop_home="" --help="false" --hostname_lookup="true" --http_command_executor="false" --http_credentials="/tmp/Endpoint_SlaveEndpointTest_NoAuthorizer_2_DpCyGm/http_credentials"
--http_heartbeat_interval="30secs" --initialize_driver_logging="true" --isolation="posix/cpu,posix/mem"
--launcher="posix" --launcher_dir="/mesos/mesos-1.4.0/_build/src" --logbufsecs="0" --logging_level="INFO"
--max_completed_executors_per_framework="150" --oversubscribed_resources_interval="15secs"
--perf_duration="10secs" --perf_interval="1mins" --port="5051" --qos_correction_interval_min="0ns"
--quiet="false" --recover="reconnect" --recovery_timeout="15mins" --registration_backoff_factor="10ms"
--resources="cpus:2;gpus:0;mem:1024;disk:1024;ports:[31000-32000]" --revocable_cpu_low_priority="true"
--runtime_dir="/tmp/Endpoint_SlaveEndpointTest_NoAuthorizer_2_DpCyGm" --sandbox_directory="/mnt/mesos/sandbox"
--strict="true" --switch_user="true" --systemd_enable_support="true" --systemd_runtime_directory="/run/systemd/system"
--version="false" --work_dir="/tmp/Endpoint_SlaveEndpointTest_NoAuthorizer_2_FFQJXf"
I0721 05:29:29.508850 24510 credentials.hpp:86] Loading credential for authentication from
'/tmp/Endpoint_SlaveEndpointTest_NoAuthorizer_2_DpCyGm/credential'
I0721 05:29:29.508977 24510 slave.cpp:283] Agent using credential for: test-principal
I0721 05:29:29.508996 24510 credentials.hpp:37] Loading credentials for authentication from
'/tmp/Endpoint_SlaveEndpointTest_NoAuthorizer_2_DpCyGm/http_credentials'
I0721 05:29:29.509232 24510 http.cpp:993] Creating default 'basic' HTTP authenticator for
realm 'mesos-agent-executor'
I0721 05:29:29.509325 24510 http.cpp:1014] Creating default 'jwt' HTTP authenticator for realm
'mesos-agent-executor'
I0721 05:29:29.509472 24510 http.cpp:993] Creating default 'basic' HTTP authenticator for
realm 'mesos-agent-readonly'
I0721 05:29:29.509578 24510 http.cpp:1014] Creating default 'jwt' HTTP authenticator for realm
'mesos-agent-readonly'
I0721 05:29:29.509723 24510 http.cpp:993] Creating default 'basic' HTTP authenticator for
realm 'mesos-agent-readwrite'
I0721 05:29:29.509819 24510 http.cpp:1014] Creating default 'jwt' HTTP authenticator for realm
'mesos-agent-readwrite'
I0721 05:29:29.510948 24510 slave.cpp:565] Agent resources: [{"name":"cpus","scalar":{"value":2.0},"type":"SCALAR"},{"name":"mem","scalar":{"value":1024.0},"type":"SCALAR"},{"name":"disk","scalar":{"value":1024.0},"type":"SCALAR"},{"name":"ports","ranges":{"range":[{"begin":31000,"end":32000}]},"type":"RANGES"}]
I0721 05:29:29.511139 24510 slave.cpp:573] Agent attributes: [  ]
I0721 05:29:29.511158 24510 slave.cpp:582] Agent hostname: 90913c4e99d0
I0721 05:29:29.511271 24507 status_update_manager.cpp:177] Pausing sending status updates
I0721 05:29:29.512321 24511 state.cpp:64] Recovering state from '/tmp/Endpoint_SlaveEndpointTest_NoAuthorizer_2_FFQJXf/meta'
I0721 05:29:29.512603 24512 status_update_manager.cpp:203] Recovering status update manager
I0721 05:29:29.512768 24514 containerizer.cpp:582] Recovering containerizer
I0721 05:29:29.513968 24511 provisioner.cpp:416] Provisioner recovery complete
I0721 05:29:29.514281 24504 slave.cpp:6207] Finished recovery
I0721 05:29:29.514740 24504 slave.cpp:6389] Querying resource estimator for oversubscribable
resources
I0721 05:29:29.514936 24509 slave.cpp:6403] Received oversubscribable resources {} from the
resource estimator
I0721 05:29:29.516636 24505 process.cpp:3837] Handling HTTP event for process 'slave(804)'
with path: '/slave(804)/containers'
I0721 05:29:29.518056 24503 http.cpp:1133] HTTP GET for /slave(804)/containers from 172.17.0.5:58950
I0721 05:29:29.518131 24503 http.cpp:957] Authorizing principal 'test-principal' to GET the
'/containers' endpoint
I0721 05:29:29.521119 24504 slave.cpp:843] Agent terminating
[       OK ] Endpoint/SlaveEndpointTest.NoAuthorizer/2 (25 ms)
[----------] 9 tests from Endpoint/SlaveEndpointTest (241 ms total)

[----------] Global test environment tear-down
[==========] 1645 tests from 181 test cases ran. (627750 ms total)
[  PASSED  ] 1644 tests.
[  FAILED  ] 1 test, listed below:
[  FAILED  ] ReservationEndpointsTest.ReserveOfferedResources

 1 FAILED TEST
  YOU HAVE 20 DISABLED TESTS

I0721 05:29:29.577544 24517 process.cpp:1006] Failed to accept socket: future discarded
make[4]: *** [check-local] Error 1
make[4]: Leaving directory `/mesos/mesos-1.4.0/_build/src'
make[3]: *** [check-am] Error 2
make[3]: Leaving directory `/mesos/mesos-1.4.0/_build/src'
make[2]: *** [check] Error 2
make[2]: Leaving directory `/mesos/mesos-1.4.0/_build/src'
make[1]: *** [check-recursive] Error 1
make[1]: Leaving directory `/mesos/mesos-1.4.0/_build'
make: *** [distcheck] Error 1
+ docker rmi mesos-1500611552-5299
Untagged: mesos-1500611552-5299:latest
Deleted: sha256:038d129a81c41ddabfaf84031d8ed9d51615bb78253e6fabfffa569cbd8cd471
Deleted: sha256:d001b68c40a65dadf666145139a945aaa2cc4f0ae27271f5509f2500043ad443
Deleted: sha256:43260c2aaec77d88ffb230610d4ed79d2c549fa9b1b36e118241ead56ced8ffc
Deleted: sha256:55916a5947e78cfd20f89db7d685d10ef91e48b2464d4fba1629da734349290d
Deleted: sha256:ebcab19081639aa1a335a5aee25d535af5654bb4064e85dc2e12931c4bdacf66
Deleted: sha256:7208a25d43bb11aebaf4bd2f971bf85605b5e30671798be5a2a44b3ab6633277
Deleted: sha256:a7e9c930b8e52ff4f92542efcacb053db56664ac1a8e26f0dd21f029b1ebafc3
Deleted: sha256:70f383d6d604d5d4d9178dfeafe2d77cd6abe2eb7de036baf213669bf21e6584
Deleted: sha256:8977d94b6dcead2830ca0bb92448f109b1d2ad585deefaa8708923c58c92ecd2
Deleted: sha256:c4b3124ccc0d1c64b2e1769a7a4d8d0b45c285c89f39576bd10a456ccd633523
Deleted: sha256:10fe055384d7f31f4c6564bf06c32fc89958567cb21fc0366cc5f11848b140b5
Deleted: sha256:e8544c2ed4634c3226da18c4fde66df9539be91509d1b458ad9506ba4173ced4
Deleted: sha256:ce0551bbc4a99429fd1444b53a38a94229fff699604d8955c4e40a829ac5e97e
Deleted: sha256:22b3fa5f67da3aa1abd564ffc8323588dfbd6b21b6321ab71da4aeec20bc50a6
Deleted: sha256:ce4047b7becc820fb5d47606e9d8cff67e3a9f284222f68293e6e86f763e1b4d
Deleted: sha256:7ba1e4853c3163bd5356500350a8586283735f5c421f9d108a8dc86a4ac7af8c
Deleted: sha256:8eb12aacf0e08a91b2ca2b7f0d507b890ce10a139e7068f34f707e74792d9d04
Deleted: sha256:7f073d5e754f26448b5defacb3cb705a21570cbef26bd54cb1cc5c18dce73b24
Deleted: sha256:a39ff77b35ca09a918944d683134360b6ca43cd69046d7cfc730d8c206513a8c
Deleted: sha256:be8c79a6dac2610cfbdeffc13cd9a48bcb31da3378f65bc6b4bb1fa64dc99915
Deleted: sha256:bf54d90f8142ee15a120d04a98b01faa515f6c1abf5d1eacffcf4de2c9b6b2ff
Deleted: sha256:6af1805071eae9d8143b09c92a23c8c24d3c1041cf6621af3afd43e12607877c
Deleted: sha256:5719bb3c2ef6d2fce7185215da00e4a5d15d129b9c2cf3019dbf19b1e2e9b59a
Deleted: sha256:8d90effbc9cbec524145b7d03df68a538babddbef2f0171f60778477a50c1486
Build step 'Execute shell' marked build as failure
Not sending mail to unregistered user benjamin.hindman@gmail.com
Not sending mail to unregistered user xujyan@apple.com

Mime
View raw message