mesos-builds mailing list archives

Site index · List index
Message view « Date » · « Thread »
Top « Date » · « Thread »
From Apache Jenkins Server <jenk...@builds.apache.org>
Subject Build failed in Jenkins: Mesos-Reviewbot #18621
Date Fri, 28 Jul 2017 03:29:08 GMT
See <https://builds.apache.org/job/Mesos-Reviewbot/18621/display/redirect>

------------------------------------------
[...truncated 30.28 MB...]
I0728 03:29:01.371822  5105 containerizer.cpp:230] Using isolation: posix/cpu,posix/mem,filesystem/posix,network/cni,environment_secret
W0728 03:29:01.372591  5105 backend.cpp:76] Failed to create 'overlay' backend: OverlayBackend
requires root privileges
W0728 03:29:01.372751  5105 backend.cpp:76] Failed to create 'bind' backend: BindBackend requires
root privileges
I0728 03:29:01.372793  5105 provisioner.cpp:255] Using default backend 'copy'
I0728 03:29:01.377851  5129 slave.cpp:250] Mesos agent started on (796)@172.17.0.3:36719
I0728 03:29:01.377892  5129 slave.cpp:251] Flags at startup: --acls="" --appc_simple_discovery_uri_prefix="http://"
--appc_store_dir="/tmp/Endpoint_SlaveEndpointTest_AuthorizedRequest_2_HJkrBB/store/appc" --authenticate_http_readonly="true"
--authenticate_http_readwrite="true" --authenticatee="crammd5" --authentication_backoff_factor="1secs"
--authorizer="local" --cgroups_cpu_enable_pids_and_tids_count="false" --cgroups_enable_cfs="false"
--cgroups_hierarchy="/sys/fs/cgroup" --cgroups_limit_swap="false" --cgroups_root="mesos" --container_disk_watch_interval="15secs"
--containerizers="mesos" --credential="/tmp/Endpoint_SlaveEndpointTest_AuthorizedRequest_2_HJkrBB/credential"
--default_role="*" --disk_watch_interval="1mins" --docker="docker" --docker_kill_orphans="true"
--docker_registry="https://registry-1.docker.io" --docker_remove_delay="6hrs" --docker_socket="/var/run/docker.sock"
--docker_stop_timeout="0ns" --docker_store_dir="/tmp/Endpoint_SlaveEndpointTest_AuthorizedRequest_2_HJkrBB/store/docker"
--docker_volume_checkpoint_dir="/var/run/mesos/isolators/docker/volume" --enforce_container_disk_quota="false"
--executor_registration_timeout="1mins" --executor_reregistration_timeout="2secs" --executor_shutdown_grace_period="5secs"
--fetcher_cache_dir="/tmp/Endpoint_SlaveEndpointTest_AuthorizedRequest_2_HJkrBB/fetch" --fetcher_cache_size="2GB"
--frameworks_home="" --gc_delay="1weeks" --gc_disk_headroom="0.1" --hadoop_home="" --help="false"
--hostname_lookup="true" --http_command_executor="false" --http_credentials="/tmp/Endpoint_SlaveEndpointTest_AuthorizedRequest_2_HJkrBB/http_credentials"
--http_heartbeat_interval="30secs" --initialize_driver_logging="true" --isolation="posix/cpu,posix/mem"
--launcher="posix" --launcher_dir="/mesos/mesos-1.4.0/_build/src" --logbufsecs="0" --logging_level="INFO"
--max_completed_executors_per_framework="150" --oversubscribed_resources_interval="15secs"
--perf_duration="10secs" --perf_interval="1mins" --port="5051" --qos_correction_interval_min="0ns"
--quiet="false" --recover="reconnect" --recovery_timeout="15mins" --registration_backoff_factor="10ms"
--resources="cpus:2;gpus:0;mem:1024;disk:1024;ports:[31000-32000]" --revocable_cpu_low_priority="true"
--runtime_dir="/tmp/Endpoint_SlaveEndpointTest_AuthorizedRequest_2_HJkrBB" --sandbox_directory="/mnt/mesos/sandbox"
--strict="true" --switch_user="true" --systemd_enable_support="true" --systemd_runtime_directory="/run/systemd/system"
--version="false" --work_dir="/tmp/Endpoint_SlaveEndpointTest_AuthorizedRequest_2_UGLaPI"
I0728 03:29:01.378609  5129 credentials.hpp:86] Loading credential for authentication from
'/tmp/Endpoint_SlaveEndpointTest_AuthorizedRequest_2_HJkrBB/credential'
I0728 03:29:01.378903  5129 slave.cpp:283] Agent using credential for: test-principal
I0728 03:29:01.378939  5129 credentials.hpp:37] Loading credentials for authentication from
'/tmp/Endpoint_SlaveEndpointTest_AuthorizedRequest_2_HJkrBB/http_credentials'
I0728 03:29:01.379385  5129 http.cpp:993] Creating default 'basic' HTTP authenticator for
realm 'mesos-agent-readonly'
I0728 03:29:01.379664  5129 http.cpp:993] Creating default 'basic' HTTP authenticator for
realm 'mesos-agent-readwrite'
I0728 03:29:01.381892  5129 slave.cpp:565] Agent resources: [{"name":"cpus","scalar":{"value":2.0},"type":"SCALAR"},{"name":"mem","scalar":{"value":1024.0},"type":"SCALAR"},{"name":"disk","scalar":{"value":1024.0},"type":"SCALAR"},{"name":"ports","ranges":{"range":[{"begin":31000,"end":32000}]},"type":"RANGES"}]
I0728 03:29:01.382324  5129 slave.cpp:573] Agent attributes: [  ]
I0728 03:29:01.382344  5129 slave.cpp:582] Agent hostname: 5984453bc3de
I0728 03:29:01.382654  5127 status_update_manager.cpp:177] Pausing sending status updates
I0728 03:29:01.384536  5125 state.cpp:64] Recovering state from '/tmp/Endpoint_SlaveEndpointTest_AuthorizedRequest_2_UGLaPI/meta'
I0728 03:29:01.385022  5124 status_update_manager.cpp:203] Recovering status update manager
I0728 03:29:01.385368  5129 containerizer.cpp:582] Recovering containerizer
I0728 03:29:01.387555  5124 provisioner.cpp:416] Provisioner recovery complete
I0728 03:29:01.388137  5126 slave.cpp:6207] Finished recovery
I0728 03:29:01.388772  5126 slave.cpp:6389] Querying resource estimator for oversubscribable
resources
I0728 03:29:01.389153  5130 slave.cpp:6403] Received oversubscribable resources {} from the
resource estimator
I0728 03:29:01.393263  5125 process.cpp:3837] Handling HTTP event for process 'slave(796)'
with path: '/slave(796)/containers'
I0728 03:29:01.395407  5128 http.cpp:1133] HTTP GET for /slave(796)/containers from 172.17.0.3:47990
I0728 03:29:01.395548  5128 http.cpp:957] Authorizing principal 'test-principal' to GET the
'/containers' endpoint
I0728 03:29:01.401916  5131 slave.cpp:843] Agent terminating
[       OK ] Endpoint/SlaveEndpointTest.AuthorizedRequest/2 (47 ms)
[ RUN      ] Endpoint/SlaveEndpointTest.UnauthorizedRequest/0
I0728 03:29:01.419090  5105 containerizer.cpp:230] Using isolation: posix/cpu,posix/mem,filesystem/posix,network/cni,environment_secret
W0728 03:29:01.419981  5105 backend.cpp:76] Failed to create 'overlay' backend: OverlayBackend
requires root privileges
W0728 03:29:01.420251  5105 backend.cpp:76] Failed to create 'bind' backend: BindBackend requires
root privileges
I0728 03:29:01.420303  5105 provisioner.cpp:255] Using default backend 'copy'
I0728 03:29:01.425406  5124 slave.cpp:250] Mesos agent started on (797)@172.17.0.3:36719
I0728 03:29:01.425446  5124 slave.cpp:251] Flags at startup: --acls="" --appc_simple_discovery_uri_prefix="http://"
--appc_store_dir="/tmp/Endpoint_SlaveEndpointTest_UnauthorizedRequest_0_BuTm88/store/appc"
--authenticate_http_readonly="true" --authenticate_http_readwrite="true" --authenticatee="crammd5"
--authentication_backoff_factor="1secs" --authorizer="local" --cgroups_cpu_enable_pids_and_tids_count="false"
--cgroups_enable_cfs="false" --cgroups_hierarchy="/sys/fs/cgroup" --cgroups_limit_swap="false"
--cgroups_root="mesos" --container_disk_watch_interval="15secs" --containerizers="mesos" --credential="/tmp/Endpoint_SlaveEndpointTest_UnauthorizedRequest_0_BuTm88/credential"
--default_role="*" --disk_watch_interval="1mins" --docker="docker" --docker_kill_orphans="true"
--docker_registry="https://registry-1.docker.io" --docker_remove_delay="6hrs" --docker_socket="/var/run/docker.sock"
--docker_stop_timeout="0ns" --docker_store_dir="/tmp/Endpoint_SlaveEndpointTest_UnauthorizedRequest_0_BuTm88/store/docker"
--docker_volume_checkpoint_dir="/var/run/mesos/isolators/docker/volume" --enforce_container_disk_quota="false"
--executor_registration_timeout="1mins" --executor_reregistration_timeout="2secs" --executor_shutdown_grace_period="5secs"
--fetcher_cache_dir="/tmp/Endpoint_SlaveEndpointTest_UnauthorizedRequest_0_BuTm88/fetch" --fetcher_cache_size="2GB"
--frameworks_home="" --gc_delay="1weeks" --gc_disk_headroom="0.1" --hadoop_home="" --help="false"
--hostname_lookup="true" --http_command_executor="false" --http_credentials="/tmp/Endpoint_SlaveEndpointTest_UnauthorizedRequest_0_BuTm88/http_credentials"
--http_heartbeat_interval="30secs" --initialize_driver_logging="true" --isolation="posix/cpu,posix/mem"
--launcher="posix" --launcher_dir="/mesos/mesos-1.4.0/_build/src" --logbufsecs="0" --logging_level="INFO"
--max_completed_executors_per_framework="150" --oversubscribed_resources_interval="15secs"
--perf_duration="10secs" --perf_interval="1mins" --port="5051" --qos_correction_interval_min="0ns"
--quiet="false" --recover="reconnect" --recovery_timeout="15mins" --registration_backoff_factor="10ms"
--resources="cpus:2;gpus:0;mem:1024;disk:1024;ports:[31000-32000]" --revocable_cpu_low_priority="true"
--runtime_dir="/tmp/Endpoint_SlaveEndpointTest_UnauthorizedRequest_0_BuTm88" --sandbox_directory="/mnt/mesos/sandbox"
--strict="true" --switch_user="true" --systemd_enable_support="true" --systemd_runtime_directory="/run/systemd/system"
--version="false" --work_dir="/tmp/Endpoint_SlaveEndpointTest_UnauthorizedRequest_0_aVvreg"
I0728 03:29:01.426254  5124 credentials.hpp:86] Loading credential for authentication from
'/tmp/Endpoint_SlaveEndpointTest_UnauthorizedRequest_0_BuTm88/credential'
I0728 03:29:01.426614  5124 slave.cpp:283] Agent using credential for: test-principal
I0728 03:29:01.426643  5124 credentials.hpp:37] Loading credentials for authentication from
'/tmp/Endpoint_SlaveEndpointTest_UnauthorizedRequest_0_BuTm88/http_credentials'
I0728 03:29:01.427099  5124 http.cpp:993] Creating default 'basic' HTTP authenticator for
realm 'mesos-agent-readonly'
I0728 03:29:01.427420  5124 http.cpp:993] Creating default 'basic' HTTP authenticator for
realm 'mesos-agent-readwrite'
I0728 03:29:01.429570  5124 slave.cpp:565] Agent resources: [{"name":"cpus","scalar":{"value":2.0},"type":"SCALAR"},{"name":"mem","scalar":{"value":1024.0},"type":"SCALAR"},{"name":"disk","scalar":{"value":1024.0},"type":"SCALAR"},{"name":"ports","ranges":{"range":[{"begin":31000,"end":32000}]},"type":"RANGES"}]
I0728 03:29:01.429996  5124 slave.cpp:573] Agent attributes: [  ]
I0728 03:29:01.430017  5124 slave.cpp:582] Agent hostname: 5984453bc3de
I0728 03:29:01.430371  5126 status_update_manager.cpp:177] Pausing sending status updates
I0728 03:29:01.432411  5131 state.cpp:64] Recovering state from '/tmp/Endpoint_SlaveEndpointTest_UnauthorizedRequest_0_aVvreg/meta'
I0728 03:29:01.432937  5130 status_update_manager.cpp:203] Recovering status update manager
I0728 03:29:01.433349  5124 containerizer.cpp:582] Recovering containerizer
I0728 03:29:01.435570  5129 provisioner.cpp:416] Provisioner recovery complete
I0728 03:29:01.436084  5127 slave.cpp:6207] Finished recovery
I0728 03:29:01.436763  5127 slave.cpp:6389] Querying resource estimator for oversubscribable
resources
I0728 03:29:01.437221  5124 slave.cpp:6403] Received oversubscribable resources {} from the
resource estimator
I0728 03:29:01.441447  5124 process.cpp:3837] Handling HTTP event for process 'slave(797)'
with path: '/slave(797)/monitor/statistics'
I0728 03:29:01.443563  5130 http.cpp:1133] HTTP GET for /slave(797)/monitor/statistics from
172.17.0.3:47992
I0728 03:29:01.443697  5130 http.cpp:957] Authorizing principal 'test-principal' to GET the
'/monitor/statistics' endpoint
I0728 03:29:01.447885  5105 slave.cpp:843] Agent terminating
[       OK ] Endpoint/SlaveEndpointTest.UnauthorizedRequest/0 (46 ms)
[ RUN      ] Endpoint/SlaveEndpointTest.UnauthorizedRequest/1
I0728 03:29:01.465553  5105 containerizer.cpp:230] Using isolation: posix/cpu,posix/mem,filesystem/posix,network/cni,environment_secret
W0728 03:29:01.466361  5105 backend.cpp:76] Failed to create 'overlay' backend: OverlayBackend
requires root privileges
W0728 03:29:01.466542  5105 backend.cpp:76] Failed to create 'bind' backend: BindBackend requires
root privileges
I0728 03:29:01.466585  5105 provisioner.cpp:255] Using default backend 'copy'
I0728 03:29:01.471458  5126 slave.cpp:250] Mesos agent started on (798)@172.17.0.3:36719
I0728 03:29:01.471498  5126 slave.cpp:251] Flags at startup: --acls="" --appc_simple_discovery_uri_prefix="http://"
--appc_store_dir="/tmp/Endpoint_SlaveEndpointTest_UnauthorizedRequest_1_BioE9G/store/appc"
--authenticate_http_readonly="true" --authenticate_http_readwrite="true" --authenticatee="crammd5"
--authentication_backoff_factor="1secs" --authorizer="local" --cgroups_cpu_enable_pids_and_tids_count="false"
--cgroups_enable_cfs="false" --cgroups_hierarchy="/sys/fs/cgroup" --cgroups_limit_swap="false"
--cgroups_root="mesos" --container_disk_watch_interval="15secs" --containerizers="mesos" --credential="/tmp/Endpoint_SlaveEndpointTest_UnauthorizedRequest_1_BioE9G/credential"
--default_role="*" --disk_watch_interval="1mins" --docker="docker" --docker_kill_orphans="true"
--docker_registry="https://registry-1.docker.io" --docker_remove_delay="6hrs" --docker_socket="/var/run/docker.sock"
--docker_stop_timeout="0ns" --docker_store_dir="/tmp/Endpoint_SlaveEndpointTest_UnauthorizedRequest_1_BioE9G/store/docker"
--docker_volume_checkpoint_dir="/var/run/mesos/isolators/docker/volume" --enforce_container_disk_quota="false"
--executor_registration_timeout="1mins" --executor_reregistration_timeout="2secs" --executor_shutdown_grace_period="5secs"
--fetcher_cache_dir="/tmp/Endpoint_SlaveEndpointTest_UnauthorizedRequest_1_BioE9G/fetch" --fetcher_cache_size="2GB"
--frameworks_home="" --gc_delay="1weeks" --gc_disk_headroom="0.1" --hadoop_home="" --help="false"
--hostname_lookup="true" --http_command_executor="false" --http_credentials="/tmp/Endpoint_SlaveEndpointTest_UnauthorizedRequest_1_BioE9G/http_credentials"
--http_heartbeat_interval="30secs" --initialize_driver_logging="true" --isolation="posix/cpu,posix/mem"
--launcher="posix" --launcher_dir="/mesos/mesos-1.4.0/_build/src" --logbufsecs="0" --logging_level="INFO"
--max_completed_executors_per_framework="150" --oversubscribed_resources_interval="15secs"
--perf_duration="10secs" --perf_interval="1mins" --port="5051" --qos_correction_interval_min="0ns"
--quiet="false" --recover="reconnect" --recovery_timeout="15mins" --registration_backoff_factor="10ms"
--resources="cpus:2;gpus:0;mem:1024;disk:1024;ports:[31000-32000]" --revocable_cpu_low_priority="true"
--runtime_dir="/tmp/Endpoint_SlaveEndpointTest_UnauthorizedRequest_1_BioE9G" --sandbox_directory="/mnt/mesos/sandbox"
--strict="true" --switch_user="true" --systemd_enable_support="true" --systemd_runtime_directory="/run/systemd/system"
--version="false" --work_dir="/tmp/Endpoint_SlaveEndpointTest_UnauthorizedRequest_1_ObVc8N"
I0728 03:29:01.472214  5126 credentials.hpp:86] Loading credential for authentication from
'/tmp/Endpoint_SlaveEndpointTest_UnauthorizedRequest_1_BioE9G/credential'
I0728 03:29:01.472471  5126 slave.cpp:283] Agent using credential for: test-principal
I0728 03:29:01.472497  5126 credentials.hpp:37] Loading credentials for authentication from
'/tmp/Endpoint_SlaveEndpointTest_UnauthorizedRequest_1_BioE9G/http_credentials'
I0728 03:29:01.472893  5126 http.cpp:993] Creating default 'basic' HTTP authenticator for
realm 'mesos-agent-readonly'
I0728 03:29:01.473124  5126 http.cpp:993] Creating default 'basic' HTTP authenticator for
realm 'mesos-agent-readwrite'
I0728 03:29:01.475651  5126 slave.cpp:565] Agent resources: [{"name":"cpus","scalar":{"value":2.0},"type":"SCALAR"},{"name":"mem","scalar":{"value":1024.0},"type":"SCALAR"},{"name":"disk","scalar":{"value":1024.0},"type":"SCALAR"},{"name":"ports","ranges":{"range":[{"begin":31000,"end":32000}]},"type":"RANGES"}]
I0728 03:29:01.476081  5126 slave.cpp:573] Agent attributes: [  ]
I0728 03:29:01.476101  5126 slave.cpp:582] Agent hostname: 5984453bc3de
I0728 03:29:01.476413  5124 status_update_manager.cpp:177] Pausing sending status updates
I0728 03:29:01.478137  5129 state.cpp:64] Recovering state from '/tmp/Endpoint_SlaveEndpointTest_UnauthorizedRequest_1_ObVc8N/meta'
I0728 03:29:01.478713  5124 status_update_manager.cpp:203] Recovering status update manager
I0728 03:29:01.479008  5131 containerizer.cpp:582] Recovering containerizer
I0728 03:29:01.481022  5128 provisioner.cpp:416] Provisioner recovery complete
I0728 03:29:01.481842  5130 slave.cpp:6207] Finished recovery
I0728 03:29:01.482573  5130 slave.cpp:6389] Querying resource estimator for oversubscribable
resources
I0728 03:29:01.483069  5131 slave.cpp:6403] Received oversubscribable resources {} from the
resource estimator
I0728 03:29:01.487244  5131 process.cpp:3837] Handling HTTP event for process 'slave(798)'
with path: '/slave(798)/monitor/statistics.json'
I0728 03:29:01.489203  5131 http.cpp:1133] HTTP GET for /slave(798)/monitor/statistics.json
from 172.17.0.3:47994
I0728 03:29:01.489328  5131 http.cpp:957] Authorizing principal 'test-principal' to GET the
'/monitor/statistics.json' endpoint
I0728 03:29:01.492436  5124 slave.cpp:843] Agent terminating
[       OK ] Endpoint/SlaveEndpointTest.UnauthorizedRequest/1 (43 ms)
[ RUN      ] Endpoint/SlaveEndpointTest.UnauthorizedRequest/2
I0728 03:29:01.509441  5105 containerizer.cpp:230] Using isolation: posix/cpu,posix/mem,filesystem/posix,network/cni,environment_secret
W0728 03:29:01.510246  5105 backend.cpp:76] Failed to create 'overlay' backend: OverlayBackend
requires root privileges
W0728 03:29:01.510437  5105 backend.cpp:76] Failed to create 'bind' backend: BindBackend requires
root privileges
I0728 03:29:01.510483  5105 provisioner.cpp:255] Using default backend 'copy'
I0728 03:29:01.515417  5131 slave.cpp:250] Mesos agent started on (799)@172.17.0.3:36719
I0728 03:29:01.515457  5131 slave.cpp:251] Flags at startup: --acls="" --appc_simple_discovery_uri_prefix="http://"
--appc_store_dir="/tmp/Endpoint_SlaveEndpointTest_UnauthorizedRequest_2_JiBFDf/store/appc"
--authenticate_http_readonly="true" --authenticate_http_readwrite="true" --authenticatee="crammd5"
--authentication_backoff_factor="1secs" --authorizer="local" --cgroups_cpu_enable_pids_and_tids_count="false"
--cgroups_enable_cfs="false" --cgroups_hierarchy="/sys/fs/cgroup" --cgroups_limit_swap="false"
--cgroups_root="mesos" --container_disk_watch_interval="15secs" --containerizers="mesos" --credential="/tmp/Endpoint_SlaveEndpointTest_UnauthorizedRequest_2_JiBFDf/credential"
--default_role="*" --disk_watch_interval="1mins" --docker="docker" --docker_kill_orphans="true"
--docker_registry="https://registry-1.docker.io" --docker_remove_delay="6hrs" --docker_socket="/var/run/docker.sock"
--docker_stop_timeout="0ns" --docker_store_dir="/tmp/Endpoint_SlaveEndpointTest_UnauthorizedRequest_2_JiBFDf/store/docker"
--docker_volume_checkpoint_dir="/var/run/mesos/isolators/docker/volume" --enforce_container_disk_quota="false"
--executor_registration_timeout="1mins" --executor_reregistration_timeout="2secs" --executor_shutdown_grace_period="5secs"
--fetcher_cache_dir="/tmp/Endpoint_SlaveEndpointTest_UnauthorizedRequest_2_JiBFDf/fetch" --fetcher_cache_size="2GB"
--frameworks_home="" --gc_delay="1weeks" --gc_disk_headroom="0.1" --hadoop_home="" --help="false"
--hostname_lookup="true" --http_command_executor="false" --http_credentials="/tmp/Endpoint_SlaveEndpointTest_UnauthorizedRequest_2_JiBFDf/http_credentials"
--http_heartbeat_interval="30secs" --initialize_driver_logging="true" --isolation="posix/cpu,posix/mem"
--launcher="posix" --launcher_dir="/mesos/mesos-1.4.0/_build/src" --logbufsecs="0" --logging_level="INFO"
--max_completed_executors_per_framework="150" --oversubscribed_resources_interval="15secs"
--perf_duration="10secs" --perf_interval="1mins" --port="5051" --qos_correction_interval_min="0ns"
--quiet="false" --recover="reconnect" --recovery_timeout="15mins" --registration_backoff_factor="10ms"
--resources="cpus:2;gpus:0;mem:1024;disk:1024;ports:[31000-32000]" --revocable_cpu_low_priority="true"
--runtime_dir="/tmp/Endpoint_SlaveEndpointTest_UnauthorizedRequest_2_JiBFDf" --sandbox_directory="/mnt/mesos/sandbox"
--strict="true" --switch_user="true" --systemd_enable_support="true" --systemd_runtime_directory="/run/systemd/system"
--version="false" --work_dir="/tmp/Endpoint_SlaveEndpointTest_UnauthorizedRequest_2_Eqi7um"
I0728 03:29:01.516162  5131 credentials.hpp:86] Loading credential for authentication from
'/tmp/Endpoint_SlaveEndpointTest_UnauthorizedRequest_2_JiBFDf/credential'
I0728 03:29:01.516414  5131 slave.cpp:283] Agent using credential for: test-principal
I0728 03:29:01.516438  5131 credentials.hpp:37] Loading credentials for authentication from
'/tmp/Endpoint_SlaveEndpointTest_UnauthorizedRequest_2_JiBFDf/http_credentials'
I0728 03:29:01.516782  5131 http.cpp:993] Creating default 'basic' HTTP authenticator for
realm 'mesos-agent-readonly'
I0728 03:29:01.517009  5131 http.cpp:993] Creating default 'basic' HTTP authenticator for
realm 'mesos-agent-readwrite'
I0728 03:29:01.519146  5131 slave.cpp:565] Agent resources: [{"name":"cpus","scalar":{"value":2.0},"type":"SCALAR"},{"name":"mem","scalar":{"value":1024.0},"type":"SCALAR"},{"name":"disk","scalar":{"value":1024.0},"type":"SCALAR"},{"name":"ports","ranges":{"range":[{"begin":31000,"end":32000}]},"type":"RANGES"}]
I0728 03:29:01.519568  5131 slave.cpp:573] Agent attributes: [  ]
I0728 03:29:01.519588  5131 slave.cpp:582] Agent hostname: 5984453bc3de
I0728 03:29:01.519847  5126 status_update_manager.cpp:177] Pausing sending status updates
I0728 03:29:01.521581  5128 state.cpp:64] Recovering state from '/tmp/Endpoint_SlaveEndpointTest_UnauthorizedRequest_2_Eqi7um/meta'
I0728 03:29:01.522198  5126 status_update_manager.cpp:203] Recovering status update manager
I0728 03:29:01.522614  5124 containerizer.cpp:582] Recovering containerizer
I0728 03:29:01.524982  5128 provisioner.cpp:416] Provisioner recovery complete
I0728 03:29:01.525622  5128 slave.cpp:6207] Finished recovery
I0728 03:29:01.526274  5128 slave.cpp:6389] Querying resource estimator for oversubscribable
resources
I0728 03:29:01.526672  5129 slave.cpp:6403] Received oversubscribable resources {} from the
resource estimator
I0728 03:29:01.530658  5129 process.cpp:3837] Handling HTTP event for process 'slave(799)'
with path: '/slave(799)/containers'
I0728 03:29:01.532716  5131 http.cpp:1133] HTTP GET for /slave(799)/containers from 172.17.0.3:47996
I0728 03:29:01.532850  5131 http.cpp:957] Authorizing principal 'test-principal' to GET the
'/containers' endpoint
I0728 03:29:01.536247  5128 slave.cpp:843] Agent terminating
[       OK ] Endpoint/SlaveEndpointTest.UnauthorizedRequest/2 (43 ms)
[ RUN      ] Endpoint/SlaveEndpointTest.NoAuthorizer/0
I0728 03:29:01.553417  5105 containerizer.cpp:230] Using isolation: posix/cpu,posix/mem,filesystem/posix,network/cni,environment_secret
W0728 03:29:01.554260  5105 backend.cpp:76] Failed to create 'overlay' backend: OverlayBackend
requires root privileges
W0728 03:29:01.554450  5105 backend.cpp:76] Failed to create 'bind' backend: BindBackend requires
root privileges
I0728 03:29:01.554496  5105 provisioner.cpp:255] Using default backend 'copy'
I0728 03:29:01.556864  5105 cluster.cpp:448] Creating default 'local' authorizer
I0728 03:29:01.559548  5127 slave.cpp:250] Mesos agent started on (800)@172.17.0.3:36719
I0728 03:29:01.559590  5127 slave.cpp:251] Flags at startup: --acls="" --appc_simple_discovery_uri_prefix="http://"
--appc_store_dir="/tmp/Endpoint_SlaveEndpointTest_NoAuthorizer_0_7Yr1zO/store/appc" --authenticate_http_readonly="true"
--authenticate_http_readwrite="true" --authenticatee="crammd5" --authentication_backoff_factor="1secs"
--authorizer="local" --cgroups_cpu_enable_pids_and_tids_count="false" --cgroups_enable_cfs="false"
--cgroups_hierarchy="/sys/fs/cgroup" --cgroups_limit_swap="false" --cgroups_root="mesos" --container_disk_watch_interval="15secs"
--containerizers="mesos" --credential="/tmp/Endpoint_SlaveEndpointTest_NoAuthorizer_0_7Yr1zO/credential"
--default_role="*" --disk_watch_interval="1mins" --docker="docker" --docker_kill_orphans="true"
--docker_registry="https://registry-1.docker.io" --docker_remove_delay="6hrs" --docker_socket="/var/run/docker.sock"
--docker_stop_timeout="0ns" --docker_store_dir="/tmp/Endpoint_SlaveEndpointTest_NoAuthorizer_0_7Yr1zO/store/docker"
--docker_volume_checkpoint_dir="/var/run/mesos/isolators/docker/volume" --enforce_container_disk_quota="false"
--executor_registration_timeout="1mins" --executor_reregistration_timeout="2secs" --executor_shutdown_grace_period="5secs"
--fetcher_cache_dir="/tmp/Endpoint_SlaveEndpointTest_NoAuthorizer_0_7Yr1zO/fetch" --fetcher_cache_size="2GB"
--frameworks_home="" --gc_delay="1weeks" --gc_disk_headroom="0.1" --hadoop_home="" --help="false"
--hostname_lookup="true" --http_command_executor="false" --http_credentials="/tmp/Endpoint_SlaveEndpointTest_NoAuthorizer_0_7Yr1zO/http_credentials"
--http_heartbeat_interval="30secs" --initialize_driver_logging="true" --isolation="posix/cpu,posix/mem"
--launcher="posix" --launcher_dir="/mesos/mesos-1.4.0/_build/src" --logbufsecs="0" --logging_level="INFO"
--max_completed_executors_per_framework="150" --oversubscribed_resources_interval="15secs"
--perf_duration="10secs" --perf_interval="1mins" --port="5051" --qos_correction_interval_min="0ns"
--quiet="false" --recover="reconnect" --recovery_timeout="15mins" --registration_backoff_factor="10ms"
--resources="cpus:2;gpus:0;mem:1024;disk:1024;ports:[31000-32000]" --revocable_cpu_low_priority="true"
--runtime_dir="/tmp/Endpoint_SlaveEndpointTest_NoAuthorizer_0_7Yr1zO" --sandbox_directory="/mnt/mesos/sandbox"
--strict="true" --switch_user="true" --systemd_enable_support="true" --systemd_runtime_directory="/run/systemd/system"
--version="false" --work_dir="/tmp/Endpoint_SlaveEndpointTest_NoAuthorizer_0_gavokV"
I0728 03:29:01.560366  5127 credentials.hpp:86] Loading credential for authentication from
'/tmp/Endpoint_SlaveEndpointTest_NoAuthorizer_0_7Yr1zO/credential'
I0728 03:29:01.560691  5127 slave.cpp:283] Agent using credential for: test-principal
I0728 03:29:01.560716  5127 credentials.hpp:37] Loading credentials for authentication from
'/tmp/Endpoint_SlaveEndpointTest_NoAuthorizer_0_7Yr1zO/http_credentials'
I0728 03:29:01.561211  5127 http.cpp:993] Creating default 'basic' HTTP authenticator for
realm 'mesos-agent-readonly'
I0728 03:29:01.561501  5127 http.cpp:993] Creating default 'basic' HTTP authenticator for
realm 'mesos-agent-readwrite'
I0728 03:29:01.563686  5127 slave.cpp:565] Agent resources: [{"name":"cpus","scalar":{"value":2.0},"type":"SCALAR"},{"name":"mem","scalar":{"value":1024.0},"type":"SCALAR"},{"name":"disk","scalar":{"value":1024.0},"type":"SCALAR"},{"name":"ports","ranges":{"range":[{"begin":31000,"end":32000}]},"type":"RANGES"}]
I0728 03:29:01.564143  5127 slave.cpp:573] Agent attributes: [  ]
I0728 03:29:01.564165  5127 slave.cpp:582] Agent hostname: 5984453bc3de
I0728 03:29:01.564522  5129 status_update_manager.cpp:177] Pausing sending status updates
I0728 03:29:01.566525  5131 state.cpp:64] Recovering state from '/tmp/Endpoint_SlaveEndpointTest_NoAuthorizer_0_gavokV/meta'
I0728 03:29:01.567232  5125 status_update_manager.cpp:203] Recovering status update manager
I0728 03:29:01.567757  5128 containerizer.cpp:582] Recovering containerizer
I0728 03:29:01.569742  5128 provisioner.cpp:416] Provisioner recovery complete
I0728 03:29:01.570416  5127 slave.cpp:6207] Finished recovery
I0728 03:29:01.571138  5127 slave.cpp:6389] Querying resource estimator for oversubscribable
resources
I0728 03:29:01.571611  5126 slave.cpp:6403] Received oversubscribable resources {} from the
resource estimator
I0728 03:29:01.575778  5130 process.cpp:3837] Handling HTTP event for process 'slave(800)'
with path: '/slave(800)/monitor/statistics'
I0728 03:29:01.577976  5129 http.cpp:1133] HTTP GET for /slave(800)/monitor/statistics from
172.17.0.3:47998
I0728 03:29:01.578104  5129 http.cpp:957] Authorizing principal 'test-principal' to GET the
'/monitor/statistics' endpoint
I0728 03:29:01.583372  5129 slave.cpp:843] Agent terminating
[       OK ] Endpoint/SlaveEndpointTest.NoAuthorizer/0 (46 ms)
[ RUN      ] Endpoint/SlaveEndpointTest.NoAuthorizer/1
I0728 03:29:01.600388  5105 containerizer.cpp:230] Using isolation: posix/cpu,posix/mem,filesystem/posix,network/cni,environment_secret
W0728 03:29:01.601183  5105 backend.cpp:76] Failed to create 'overlay' backend: OverlayBackend
requires root privileges
W0728 03:29:01.601372  5105 backend.cpp:76] Failed to create 'bind' backend: BindBackend requires
root privileges
I0728 03:29:01.601416  5105 provisioner.cpp:255] Using default backend 'copy'
I0728 03:29:01.603770  5105 cluster.cpp:448] Creating default 'local' authorizer
I0728 03:29:01.606509  5124 slave.cpp:250] Mesos agent started on (801)@172.17.0.3:36719
I0728 03:29:01.606549  5124 slave.cpp:251] Flags at startup: --acls="" --appc_simple_discovery_uri_prefix="http://"
--appc_store_dir="/tmp/Endpoint_SlaveEndpointTest_NoAuthorizer_1_1Ris0n/store/appc" --authenticate_http_readonly="true"
--authenticate_http_readwrite="true" --authenticatee="crammd5" --authentication_backoff_factor="1secs"
--authorizer="local" --cgroups_cpu_enable_pids_and_tids_count="false" --cgroups_enable_cfs="false"
--cgroups_hierarchy="/sys/fs/cgroup" --cgroups_limit_swap="false" --cgroups_root="mesos" --container_disk_watch_interval="15secs"
--containerizers="mesos" --credential="/tmp/Endpoint_SlaveEndpointTest_NoAuthorizer_1_1Ris0n/credential"
--default_role="*" --disk_watch_interval="1mins" --docker="docker" --docker_kill_orphans="true"
--docker_registry="https://registry-1.docker.io" --docker_remove_delay="6hrs" --docker_socket="/var/run/docker.sock"
--docker_stop_timeout="0ns" --docker_store_dir="/tmp/Endpoint_SlaveEndpointTest_NoAuthorizer_1_1Ris0n/store/docker"
--docker_volume_checkpoint_dir="/var/run/mesos/isolators/docker/volume" --enforce_container_disk_quota="false"
--executor_registration_timeout="1mins" --executor_reregistration_timeout="2secs" --executor_shutdown_grace_period="5secs"
--fetcher_cache_dir="/tmp/Endpoint_SlaveEndpointTest_NoAuthorizer_1_1Ris0n/fetch" --fetcher_cache_size="2GB"
--frameworks_home="" --gc_delay="1weeks" --gc_disk_headroom="0.1" --hadoop_home="" --help="false"
--hostname_lookup="true" --http_command_executor="false" --http_credentials="/tmp/Endpoint_SlaveEndpointTest_NoAuthorizer_1_1Ris0n/http_credentials"
--http_heartbeat_interval="30secs" --initialize_driver_logging="true" --isolation="posix/cpu,posix/mem"
--launcher="posix" --launcher_dir="/mesos/mesos-1.4.0/_build/src" --logbufsecs="0" --logging_level="INFO"
--max_completed_executors_per_framework="150" --oversubscribed_resources_interval="15secs"
--perf_duration="10secs" --perf_interval="1mins" --port="5051" --qos_correction_interval_min="0ns"
--quiet="false" --recover="reconnect" --recovery_timeout="15mins" --registration_backoff_factor="10ms"
--resources="cpus:2;gpus:0;mem:1024;disk:1024;ports:[31000-32000]" --revocable_cpu_low_priority="true"
--runtime_dir="/tmp/Endpoint_SlaveEndpointTest_NoAuthorizer_1_1Ris0n" --sandbox_directory="/mnt/mesos/sandbox"
--strict="true" --switch_user="true" --systemd_enable_support="true" --systemd_runtime_directory="/run/systemd/system"
--version="false" --work_dir="/tmp/Endpoint_SlaveEndpointTest_NoAuthorizer_1_eJ4dDu"
I0728 03:29:01.607352  5124 credentials.hpp:86] Loading credential for authentication from
'/tmp/Endpoint_SlaveEndpointTest_NoAuthorizer_1_1Ris0n/credential'
I0728 03:29:01.607717  5124 slave.cpp:283] Agent using credential for: test-principal
I0728 03:29:01.607743  5124 credentials.hpp:37] Loading credentials for authentication from
'/tmp/Endpoint_SlaveEndpointTest_NoAuthorizer_1_1Ris0n/http_credentials'
I0728 03:29:01.608202  5124 http.cpp:993] Creating default 'basic' HTTP authenticator for
realm 'mesos-agent-readonly'
I0728 03:29:01.608430  5124 http.cpp:993] Creating default 'basic' HTTP authenticator for
realm 'mesos-agent-readwrite'
I0728 03:29:01.610669  5124 slave.cpp:565] Agent resources: [{"name":"cpus","scalar":{"value":2.0},"type":"SCALAR"},{"name":"mem","scalar":{"value":1024.0},"type":"SCALAR"},{"name":"disk","scalar":{"value":1024.0},"type":"SCALAR"},{"name":"ports","ranges":{"range":[{"begin":31000,"end":32000}]},"type":"RANGES"}]
I0728 03:29:01.611095  5124 slave.cpp:573] Agent attributes: [  ]
I0728 03:29:01.611129  5124 slave.cpp:582] Agent hostname: 5984453bc3de
I0728 03:29:01.611364  5129 status_update_manager.cpp:177] Pausing sending status updates
I0728 03:29:01.613373  5128 state.cpp:64] Recovering state from '/tmp/Endpoint_SlaveEndpointTest_NoAuthorizer_1_eJ4dDu/meta'
I0728 03:29:01.613867  5126 status_update_manager.cpp:203] Recovering status update manager
I0728 03:29:01.614161  5131 containerizer.cpp:582] Recovering containerizer
I0728 03:29:01.616202  5129 provisioner.cpp:416] Provisioner recovery complete
I0728 03:29:01.616766  5131 slave.cpp:6207] Finished recovery
I0728 03:29:01.617404  5131 slave.cpp:6389] Querying resource estimator for oversubscribable
resources
I0728 03:29:01.617861  5125 slave.cpp:6403] Received oversubscribable resources {} from the
resource estimator
I0728 03:29:01.621937  5129 process.cpp:3837] Handling HTTP event for process 'slave(801)'
with path: '/slave(801)/monitor/statistics.json'
I0728 03:29:01.624143  5125 http.cpp:1133] HTTP GET for /slave(801)/monitor/statistics.json
from 172.17.0.3:48000
I0728 03:29:01.624291  5125 http.cpp:957] Authorizing principal 'test-principal' to GET the
'/monitor/statistics.json' endpoint
I0728 03:29:01.629153  5128 slave.cpp:843] Agent terminating
[       OK ] Endpoint/SlaveEndpointTest.NoAuthorizer/1 (45 ms)
[ RUN      ] Endpoint/SlaveEndpointTest.NoAuthorizer/2
I0728 03:29:01.646471  5105 containerizer.cpp:230] Using isolation: posix/cpu,posix/mem,filesystem/posix,network/cni,environment_secret
W0728 03:29:01.647228  5105 backend.cpp:76] Failed to create 'overlay' backend: OverlayBackend
requires root privileges
W0728 03:29:01.647388  5105 backend.cpp:76] Failed to create 'bind' backend: BindBackend requires
root privileges
I0728 03:29:01.647429  5105 provisioner.cpp:255] Using default backend 'copy'
I0728 03:29:01.649701  5105 cluster.cpp:448] Creating default 'local' authorizer
I0728 03:29:01.652325  5128 slave.cpp:250] Mesos agent started on (802)@172.17.0.3:36719
I0728 03:29:01.652369  5128 slave.cpp:251] Flags at startup: --acls="" --appc_simple_discovery_uri_prefix="http://"
--appc_store_dir="/tmp/Endpoint_SlaveEndpointTest_NoAuthorizer_2_BiSKUX/store/appc" --authenticate_http_readonly="true"
--authenticate_http_readwrite="true" --authenticatee="crammd5" --authentication_backoff_factor="1secs"
--authorizer="local" --cgroups_cpu_enable_pids_and_tids_count="false" --cgroups_enable_cfs="false"
--cgroups_hierarchy="/sys/fs/cgroup" --cgroups_limit_swap="false" --cgroups_root="mesos" --container_disk_watch_interval="15secs"
--containerizers="mesos" --credential="/tmp/Endpoint_SlaveEndpointTest_NoAuthorizer_2_BiSKUX/credential"
--default_role="*" --disk_watch_interval="1mins" --docker="docker" --docker_kill_orphans="true"
--docker_registry="https://registry-1.docker.io" --docker_remove_delay="6hrs" --docker_socket="/var/run/docker.sock"
--docker_stop_timeout="0ns" --docker_store_dir="/tmp/Endpoint_SlaveEndpointTest_NoAuthorizer_2_BiSKUX/store/docker"
--docker_volume_checkpoint_dir="/var/run/mesos/isolators/docker/volume" --enforce_container_disk_quota="false"
--executor_registration_timeout="1mins" --executor_reregistration_timeout="2secs" --executor_shutdown_grace_period="5secs"
--fetcher_cache_dir="/tmp/Endpoint_SlaveEndpointTest_NoAuthorizer_2_BiSKUX/fetch" --fetcher_cache_size="2GB"
--frameworks_home="" --gc_delay="1weeks" --gc_disk_headroom="0.1" --hadoop_home="" --help="false"
--hostname_lookup="true" --http_command_executor="false" --http_credentials="/tmp/Endpoint_SlaveEndpointTest_NoAuthorizer_2_BiSKUX/http_credentials"
--http_heartbeat_interval="30secs" --initialize_driver_logging="true" --isolation="posix/cpu,posix/mem"
--launcher="posix" --launcher_dir="/mesos/mesos-1.4.0/_build/src" --logbufsecs="0" --logging_level="INFO"
--max_completed_executors_per_framework="150" --oversubscribed_resources_interval="15secs"
--perf_duration="10secs" --perf_interval="1mins" --port="5051" --qos_correction_interval_min="0ns"
--quiet="false" --recover="reconnect" --recovery_timeout="15mins" --registration_backoff_factor="10ms"
--resources="cpus:2;gpus:0;mem:1024;disk:1024;ports:[31000-32000]" --revocable_cpu_low_priority="true"
--runtime_dir="/tmp/Endpoint_SlaveEndpointTest_NoAuthorizer_2_BiSKUX" --sandbox_directory="/mnt/mesos/sandbox"
--strict="true" --switch_user="true" --systemd_enable_support="true" --systemd_runtime_directory="/run/systemd/system"
--version="false" --work_dir="/tmp/Endpoint_SlaveEndpointTest_NoAuthorizer_2_WDD4p4"
I0728 03:29:01.653103  5128 credentials.hpp:86] Loading credential for authentication from
'/tmp/Endpoint_SlaveEndpointTest_NoAuthorizer_2_BiSKUX/credential'
I0728 03:29:01.653374  5128 slave.cpp:283] Agent using credential for: test-principal
I0728 03:29:01.653406  5128 credentials.hpp:37] Loading credentials for authentication from
'/tmp/Endpoint_SlaveEndpointTest_NoAuthorizer_2_BiSKUX/http_credentials'
I0728 03:29:01.653774  5128 http.cpp:993] Creating default 'basic' HTTP authenticator for
realm 'mesos-agent-readonly'
I0728 03:29:01.654024  5128 http.cpp:993] Creating default 'basic' HTTP authenticator for
realm 'mesos-agent-readwrite'
I0728 03:29:01.656240  5128 slave.cpp:565] Agent resources: [{"name":"cpus","scalar":{"value":2.0},"type":"SCALAR"},{"name":"mem","scalar":{"value":1024.0},"type":"SCALAR"},{"name":"disk","scalar":{"value":1024.0},"type":"SCALAR"},{"name":"ports","ranges":{"range":[{"begin":31000,"end":32000}]},"type":"RANGES"}]
I0728 03:29:01.656669  5128 slave.cpp:573] Agent attributes: [  ]
I0728 03:29:01.656692  5128 slave.cpp:582] Agent hostname: 5984453bc3de
I0728 03:29:01.656932  5125 status_update_manager.cpp:177] Pausing sending status updates
I0728 03:29:01.658800  5131 state.cpp:64] Recovering state from '/tmp/Endpoint_SlaveEndpointTest_NoAuthorizer_2_WDD4p4/meta'
I0728 03:29:01.659304  5127 status_update_manager.cpp:203] Recovering status update manager
I0728 03:29:01.659698  5130 containerizer.cpp:582] Recovering containerizer
I0728 03:29:01.661900  5126 provisioner.cpp:416] Provisioner recovery complete
I0728 03:29:01.662524  5130 slave.cpp:6207] Finished recovery
I0728 03:29:01.663259  5130 slave.cpp:6389] Querying resource estimator for oversubscribable
resources
I0728 03:29:01.663692  5127 slave.cpp:6403] Received oversubscribable resources {} from the
resource estimator
I0728 03:29:01.667680  5127 process.cpp:3837] Handling HTTP event for process 'slave(802)'
with path: '/slave(802)/containers'
I0728 03:29:01.669872  5126 http.cpp:1133] HTTP GET for /slave(802)/containers from 172.17.0.3:48002
I0728 03:29:01.670001  5126 http.cpp:957] Authorizing principal 'test-principal' to GET the
'/containers' endpoint
I0728 03:29:01.676393  5105 slave.cpp:843] Agent terminating
[       OK ] Endpoint/SlaveEndpointTest.NoAuthorizer/2 (46 ms)
[----------] 9 tests from Endpoint/SlaveEndpointTest (420 ms total)

[----------] Global test environment tear-down
[==========] 1651 tests from 181 test cases ran. (732450 ms total)
[  PASSED  ] 1647 tests.
[  FAILED  ] 4 tests, listed below:
[  FAILED  ] DefaultExecutorCheckTest.CommandCheckDeliveredAndReconciled
[  FAILED  ] DefaultExecutorCheckTest.CommandCheckStatusChange
[  FAILED  ] DefaultExecutorCheckTest.CommandCheckSeesParentsEnv
[  FAILED  ] DefaultExecutorCheckTest.CommandCheckSharesWorkDirWithTask

 4 FAILED TESTS
  YOU HAVE 20 DISABLED TESTS

I0728 03:29:01.820726  5132 process.cpp:1006] Failed to accept socket: future discarded
make[4]: *** [check-local] Error 1
make[4]: Leaving directory `/mesos/mesos-1.4.0/_build/src'
make[3]: *** [check-am] Error 2
make[3]: Leaving directory `/mesos/mesos-1.4.0/_build/src'
make[2]: *** [check] Error 2
make[2]: Leaving directory `/mesos/mesos-1.4.0/_build/src'
make[1]: *** [check-recursive] Error 1
make[1]: Leaving directory `/mesos/mesos-1.4.0/_build'
make: *** [distcheck] Error 1
+ docker rmi mesos-1501206875-6084
Untagged: mesos-1501206875-6084:latest
Deleted: sha256:b9363b4f317e152ad2b2b6b8e24dbb8fbaca696480d1c246610c01e7e2ed10a8
Deleted: sha256:2e619b94dc09f1a9890d97816f58b6baf67234499348f353c00defd2f2076b8f
Deleted: sha256:1485256f96eb37c84d194662639dc9c7db17bd6e853eb7d5a358ba925728a3da
Deleted: sha256:bc06b66a3464a2f327f03e43d70162a19eb14d5fc925a27bd6b7f58f838ada8b
Deleted: sha256:c57ffe260db818a82216b7fb708725a4b6fda3f429e9ee71ae43426a90735baa
Deleted: sha256:31afefcf1b7b543dd99dcca279ff24bac0abd6c3704bceedb2e70ac9c92bda28
Deleted: sha256:5b4052c45952002c7010bb99aef45ab9015fcd94bae0f9e9b1609ca1f1d3117d
Deleted: sha256:865ad1bd185058580fab769cd5c8fe53ff2fb619ad8eb516c5d78234a389bbda
Deleted: sha256:6f249c63ebcb90b3b11eed562f81845fc8c7697433efc359e1c381512824e7ee
Deleted: sha256:3b7fa90f6478078861c368a70246c8216cd7e23c0b8e77904fb07c58bb3f5ba0
Deleted: sha256:0bf64cffca4f79f3b72ed014c71a215f3ad7aede0764bbff13e3d9e50461745c
Deleted: sha256:77269f5b0f035bfc8fae382cd5e428a2daa43404d9e1f16ec024a53ab4b3896c
Deleted: sha256:08e6ade59ff0c231cce5cb6faa515d58745dae432d6e14f1a649892dffd50fd7
Deleted: sha256:4af7e78b24531c95122f120655ce2f90798f761aea967fdcfbb6a9c61d69de0f
Deleted: sha256:0d40def22d9765260bd97b848bf1e33a2e913545e0d8dffb29716590add31f53
Deleted: sha256:60b1add1859ae4086f2d87d87a7d6007e0bd48760ab00d2b893bfa390f17d91f
Deleted: sha256:bad51869d9affc7798d7d2b8f11df2de76a84ad55f43bd93676d9e8e8f81583d
Deleted: sha256:b272d264c2660a3331ba870563e120875393b9fbcaf1046d84ae189054b37a2b
Deleted: sha256:3dd532eacde075659682550d6ed5df9dfc3dbcabfc4b88888b5f8a70a73d3b36
Deleted: sha256:dc6570105857f25ff247d12e0e76ca846a800d875cb389979ad3d44bdc11443e
Deleted: sha256:b819142f5e7c27ae44946a2608f2d1e4fc14d30464f441970b9a239bf05b4439
Deleted: sha256:6b33d8a3b3a34c24f7b1315f78fc90e00ea4b390b582d55feeb7537f8648c8e1
Deleted: sha256:84f54a36b86822790f9d62e35802d51f1dcfdeab9a1fb18558f30872aa63f476
Deleted: sha256:765b23e1c356f77514c14987b296a87e434bb918a0cc53301b0109ff109fe2ac
Build step 'Execute shell' marked build as failure

Mime
View raw message