mesos-builds mailing list archives

Site index · List index
Message view « Date » · « Thread »
Top « Date » · « Thread »
From Apache Jenkins Server <jenk...@builds.apache.org>
Subject Build failed in Jenkins: Mesos-Buildbot » cmake,clang,--verbose,GLOG_v=1 MESOS_VERBOSE=1,ubuntu:14.04,(ubuntu)&&(!ubuntu-us1)&&(!ubuntu-eu2) #3855
Date Sat, 01 Jul 2017 05:35:08 GMT
See <https://builds.apache.org/job/Mesos-Buildbot/BUILDTOOL=cmake,COMPILER=clang,CONFIGURATION=--verbose,ENVIRONMENT=GLOG_v=1%20MESOS_VERBOSE=1,OS=ubuntu%3A14.04,label_exp=(ubuntu)&&(!ubuntu-us1)&&(!ubuntu-eu2)/3855/display/redirect?page=changes>

Changes:

[kapil] Removed core file during distclean.

[yujie.jay] Removed an unused declaration in type_utils.hpp.

[yujie.jay] Added stubs for the resource provider driver.

[yujie.jay] Added devolve functions for resource provider Event/Call.

[yujie.jay] Added stubs for storage local resource provider.

[yujie.jay] Added stubs for the ResourceProviderManager.

[yujie.jay] Added 'type' and 'name' fields to ResourceProviderInfo.

[yujie.jay] Introduced a streaming function for a vector.

[yujie.jay] Added streaming function for ResourceProviderInfo.

[yujie.jay] Added agent `--resource_provider_config_dir` flag.

[yujie.jay] Added agent endpoint for local resource providers.

[yujie.jay] Added stubs for local resource provider daemon.

[yujie.jay] Added ResourceProviderMessage for the manager.

[yujie.jay] Added local resource provider daemon initialization logic.

------------------------------------------
[...truncated 27.47 MB...]
I0701 05:34:57.276422 30686 http.cpp:935] Authorizing principal 'test-principal' to GET the
'/monitor/statistics.json' endpoint
I0701 05:34:57.308300 30680 slave.cpp:839] Agent terminating
[       OK ] Endpoint/SlaveEndpointTest.AuthorizedRequest/1 (134 ms)
[ RUN      ] Endpoint/SlaveEndpointTest.AuthorizedRequest/2
I0701 05:34:57.351716 30680 containerizer.cpp:230] Using isolation: posix/cpu,posix/mem,filesystem/posix,network/cni,environment_secret
W0701 05:34:57.352646 30680 backend.cpp:76] Failed to create 'overlay' backend: OverlayBackend
requires root privileges
W0701 05:34:57.352916 30680 backend.cpp:76] Failed to create 'bind' backend: BindBackend requires
root privileges
I0701 05:34:57.352964 30680 provisioner.cpp:255] Using default backend 'copy'
I0701 05:34:57.358321 30687 slave.cpp:250] Mesos agent started on (769)@172.17.0.4:45831
I0701 05:34:57.358371 30687 slave.cpp:251] Flags at startup: --acls="" --appc_simple_discovery_uri_prefix="http://"
--appc_store_dir="/tmp/Endpoint_SlaveEndpointTest_AuthorizedRequest_2_gtQViG/store/appc" --authenticate_http_readonly="true"
--authenticate_http_readwrite="true" --authenticatee="crammd5" --authentication_backoff_factor="1secs"
--authorizer="local" --cgroups_cpu_enable_pids_and_tids_count="false" --cgroups_enable_cfs="false"
--cgroups_hierarchy="/sys/fs/cgroup" --cgroups_limit_swap="false" --cgroups_root="mesos" --container_disk_watch_interval="15secs"
--containerizers="mesos" --credential="/tmp/Endpoint_SlaveEndpointTest_AuthorizedRequest_2_gtQViG/credential"
--default_role="*" --disk_watch_interval="1mins" --docker="docker" --docker_kill_orphans="true"
--docker_registry="https://registry-1.docker.io" --docker_remove_delay="6hrs" --docker_socket="/var/run/docker.sock"
--docker_stop_timeout="0ns" --docker_store_dir="/tmp/Endpoint_SlaveEndpointTest_AuthorizedRequest_2_gtQViG/store/docker"
--docker_volume_checkpoint_dir="/var/run/mesos/isolators/docker/volume" --enforce_container_disk_quota="false"
--executor_registration_timeout="1mins" --executor_reregistration_timeout="2secs" --executor_shutdown_grace_period="5secs"
--fetcher_cache_dir="/tmp/Endpoint_SlaveEndpointTest_AuthorizedRequest_2_gtQViG/fetch" --fetcher_cache_size="2GB"
--frameworks_home="" --gc_delay="1weeks" --gc_disk_headroom="0.1" --hadoop_home="" --help="false"
--hostname_lookup="true" --http_command_executor="false" --http_credentials="/tmp/Endpoint_SlaveEndpointTest_AuthorizedRequest_2_gtQViG/http_credentials"
--http_heartbeat_interval="30secs" --initialize_driver_logging="true" --isolation="posix/cpu,posix/mem"
--launcher="posix" --launcher_dir="/mesos/build/src" --logbufsecs="0" --logging_level="INFO"
--max_completed_executors_per_framework="150" --oversubscribed_resources_interval="15secs"
--perf_duration="10secs" --perf_interval="1mins" --port="5051" --qos_correction_interval_min="0ns"
--quiet="false" --recover="reconnect" --recovery_timeout="15mins" --registration_backoff_factor="10ms"
--resources="cpus:2;gpus:0;mem:1024;disk:1024;ports:[31000-32000]" --revocable_cpu_low_priority="true"
--runtime_dir="/tmp/Endpoint_SlaveEndpointTest_AuthorizedRequest_2_gtQViG" --sandbox_directory="/mnt/mesos/sandbox"
--strict="true" --switch_user="true" --systemd_enable_support="true" --systemd_runtime_directory="/run/systemd/system"
--version="false" --work_dir="/tmp/Endpoint_SlaveEndpointTest_AuthorizedRequest_2_6Dwvmy"
I0701 05:34:57.359244 30687 credentials.hpp:86] Loading credential for authentication from
'/tmp/Endpoint_SlaveEndpointTest_AuthorizedRequest_2_gtQViG/credential'
I0701 05:34:57.359556 30687 slave.cpp:283] Agent using credential for: test-principal
I0701 05:34:57.359583 30687 credentials.hpp:37] Loading credentials for authentication from
'/tmp/Endpoint_SlaveEndpointTest_AuthorizedRequest_2_gtQViG/http_credentials'
I0701 05:34:57.359997 30687 http.cpp:974] Creating default 'basic' HTTP authenticator for
realm 'mesos-agent-readonly'
I0701 05:34:57.360312 30687 http.cpp:974] Creating default 'basic' HTTP authenticator for
realm 'mesos-agent-readwrite'
I0701 05:34:57.365967 30687 slave.cpp:565] Agent resources: [{"name":"cpus","scalar":{"value":2.0},"type":"SCALAR"},{"name":"mem","scalar":{"value":1024.0},"type":"SCALAR"},{"name":"disk","scalar":{"value":1024.0},"type":"SCALAR"},{"name":"ports","ranges":{"range":[{"begin":31000,"end":32000}]},"type":"RANGES"}]
I0701 05:34:57.366302 30687 slave.cpp:573] Agent attributes: [  ]
I0701 05:34:57.366317 30687 slave.cpp:578] Agent hostname: 4da8451e458e
I0701 05:34:57.366714 30686 status_update_manager.cpp:177] Pausing sending status updates
I0701 05:34:57.368867 30687 state.cpp:64] Recovering state from '/tmp/Endpoint_SlaveEndpointTest_AuthorizedRequest_2_6Dwvmy/meta'
I0701 05:34:57.369377 30685 status_update_manager.cpp:203] Recovering status update manager
I0701 05:34:57.370048 30684 containerizer.cpp:582] Recovering containerizer
I0701 05:34:57.373106 30685 provisioner.cpp:416] Provisioner recovery complete
I0701 05:34:57.378183 30688 slave.cpp:6189] Finished recovery
I0701 05:34:57.379025 30688 slave.cpp:6371] Querying resource estimator for oversubscribable
resources
I0701 05:34:57.384022 30682 slave.cpp:6385] Received oversubscribable resources {} from the
resource estimator
I0701 05:34:57.389806 30684 process.cpp:3779] Handling HTTP event for process 'slave(769)'
with path: '/slave(769)/containers'
I0701 05:34:57.392087 30684 http.cpp:1114] HTTP GET for /slave(769)/containers from 172.17.0.4:42192
I0701 05:34:57.392204 30684 http.cpp:935] Authorizing principal 'test-principal' to GET the
'/containers' endpoint
I0701 05:34:57.401557 30682 slave.cpp:839] Agent terminating
[       OK ] Endpoint/SlaveEndpointTest.AuthorizedRequest/2 (116 ms)
[ RUN      ] Endpoint/SlaveEndpointTest.UnauthorizedRequest/0
I0701 05:34:57.468670 30680 containerizer.cpp:230] Using isolation: posix/cpu,posix/mem,filesystem/posix,network/cni,environment_secret
W0701 05:34:57.469935 30680 backend.cpp:76] Failed to create 'overlay' backend: OverlayBackend
requires root privileges
W0701 05:34:57.470201 30680 backend.cpp:76] Failed to create 'bind' backend: BindBackend requires
root privileges
I0701 05:34:57.470250 30680 provisioner.cpp:255] Using default backend 'copy'
I0701 05:34:57.484782 30688 slave.cpp:250] Mesos agent started on (770)@172.17.0.4:45831
I0701 05:34:57.484853 30688 slave.cpp:251] Flags at startup: --acls="" --appc_simple_discovery_uri_prefix="http://"
--appc_store_dir="/tmp/Endpoint_SlaveEndpointTest_UnauthorizedRequest_0_4OAW3c/store/appc"
--authenticate_http_readonly="true" --authenticate_http_readwrite="true" --authenticatee="crammd5"
--authentication_backoff_factor="1secs" --authorizer="local" --cgroups_cpu_enable_pids_and_tids_count="false"
--cgroups_enable_cfs="false" --cgroups_hierarchy="/sys/fs/cgroup" --cgroups_limit_swap="false"
--cgroups_root="mesos" --container_disk_watch_interval="15secs" --containerizers="mesos" --credential="/tmp/Endpoint_SlaveEndpointTest_UnauthorizedRequest_0_4OAW3c/credential"
--default_role="*" --disk_watch_interval="1mins" --docker="docker" --docker_kill_orphans="true"
--docker_registry="https://registry-1.docker.io" --docker_remove_delay="6hrs" --docker_socket="/var/run/docker.sock"
--docker_stop_timeout="0ns" --docker_store_dir="/tmp/Endpoint_SlaveEndpointTest_UnauthorizedRequest_0_4OAW3c/store/docker"
--docker_volume_checkpoint_dir="/var/run/mesos/isolators/docker/volume" --enforce_container_disk_quota="false"
--executor_registration_timeout="1mins" --executor_reregistration_timeout="2secs" --executor_shutdown_grace_period="5secs"
--fetcher_cache_dir="/tmp/Endpoint_SlaveEndpointTest_UnauthorizedRequest_0_4OAW3c/fetch" --fetcher_cache_size="2GB"
--frameworks_home="" --gc_delay="1weeks" --gc_disk_headroom="0.1" --hadoop_home="" --help="false"
--hostname_lookup="true" --http_command_executor="false" --http_credentials="/tmp/Endpoint_SlaveEndpointTest_UnauthorizedRequest_0_4OAW3c/http_credentials"
--http_heartbeat_interval="30secs" --initialize_driver_logging="true" --isolation="posix/cpu,posix/mem"
--launcher="posix" --launcher_dir="/mesos/build/src" --logbufsecs="0" --logging_level="INFO"
--max_completed_executors_per_framework="150" --oversubscribed_resources_interval="15secs"
--perf_duration="10secs" --perf_interval="1mins" --port="5051" --qos_correction_interval_min="0ns"
--quiet="false" --recover="reconnect" --recovery_timeout="15mins" --registration_backoff_factor="10ms"
--resources="cpus:2;gpus:0;mem:1024;disk:1024;ports:[31000-32000]" --revocable_cpu_low_priority="true"
--runtime_dir="/tmp/Endpoint_SlaveEndpointTest_UnauthorizedRequest_0_4OAW3c" --sandbox_directory="/mnt/mesos/sandbox"
--strict="true" --switch_user="true" --systemd_enable_support="true" --systemd_runtime_directory="/run/systemd/system"
--version="false" --work_dir="/tmp/Endpoint_SlaveEndpointTest_UnauthorizedRequest_0_kxNAO4"
I0701 05:34:57.485991 30688 credentials.hpp:86] Loading credential for authentication from
'/tmp/Endpoint_SlaveEndpointTest_UnauthorizedRequest_0_4OAW3c/credential'
I0701 05:34:57.486510 30688 slave.cpp:283] Agent using credential for: test-principal
I0701 05:34:57.486546 30688 credentials.hpp:37] Loading credentials for authentication from
'/tmp/Endpoint_SlaveEndpointTest_UnauthorizedRequest_0_4OAW3c/http_credentials'
I0701 05:34:57.487180 30688 http.cpp:974] Creating default 'basic' HTTP authenticator for
realm 'mesos-agent-readonly'
I0701 05:34:57.487741 30688 http.cpp:974] Creating default 'basic' HTTP authenticator for
realm 'mesos-agent-readwrite'
I0701 05:34:57.490717 30688 slave.cpp:565] Agent resources: [{"name":"cpus","scalar":{"value":2.0},"type":"SCALAR"},{"name":"mem","scalar":{"value":1024.0},"type":"SCALAR"},{"name":"disk","scalar":{"value":1024.0},"type":"SCALAR"},{"name":"ports","ranges":{"range":[{"begin":31000,"end":32000}]},"type":"RANGES"}]
I0701 05:34:57.492528 30688 slave.cpp:573] Agent attributes: [  ]
I0701 05:34:57.492554 30688 slave.cpp:578] Agent hostname: 4da8451e458e
I0701 05:34:57.493002 30681 status_update_manager.cpp:177] Pausing sending status updates
I0701 05:34:57.500639 30681 state.cpp:64] Recovering state from '/tmp/Endpoint_SlaveEndpointTest_UnauthorizedRequest_0_kxNAO4/meta'
I0701 05:34:57.501260 30681 status_update_manager.cpp:203] Recovering status update manager
I0701 05:34:57.504081 30682 containerizer.cpp:582] Recovering containerizer
I0701 05:34:57.512290 30686 provisioner.cpp:416] Provisioner recovery complete
I0701 05:34:57.513015 30682 slave.cpp:6189] Finished recovery
I0701 05:34:57.513893 30682 slave.cpp:6371] Querying resource estimator for oversubscribable
resources
I0701 05:34:57.514479 30688 slave.cpp:6385] Received oversubscribable resources {} from the
resource estimator
I0701 05:34:57.522150 30688 process.cpp:3779] Handling HTTP event for process 'slave(770)'
with path: '/slave(770)/monitor/statistics'
I0701 05:34:57.525084 30688 http.cpp:1114] HTTP GET for /slave(770)/monitor/statistics from
172.17.0.4:42194
I0701 05:34:57.525216 30688 http.cpp:935] Authorizing principal 'test-principal' to GET the
'/monitor/statistics' endpoint
I0701 05:34:57.541091 30680 slave.cpp:839] Agent terminating
[       OK ] Endpoint/SlaveEndpointTest.UnauthorizedRequest/0 (93 ms)
[ RUN      ] Endpoint/SlaveEndpointTest.UnauthorizedRequest/1
I0701 05:34:57.568217 30680 containerizer.cpp:230] Using isolation: posix/cpu,posix/mem,filesystem/posix,network/cni,environment_secret
W0701 05:34:57.569088 30680 backend.cpp:76] Failed to create 'overlay' backend: OverlayBackend
requires root privileges
W0701 05:34:57.569378 30680 backend.cpp:76] Failed to create 'bind' backend: BindBackend requires
root privileges
I0701 05:34:57.569427 30680 provisioner.cpp:255] Using default backend 'copy'
I0701 05:34:57.578187 30688 slave.cpp:250] Mesos agent started on (771)@172.17.0.4:45831
I0701 05:34:57.578248 30688 slave.cpp:251] Flags at startup: --acls="" --appc_simple_discovery_uri_prefix="http://"
--appc_store_dir="/tmp/Endpoint_SlaveEndpointTest_UnauthorizedRequest_1_ug2tUK/store/appc"
--authenticate_http_readonly="true" --authenticate_http_readwrite="true" --authenticatee="crammd5"
--authentication_backoff_factor="1secs" --authorizer="local" --cgroups_cpu_enable_pids_and_tids_count="false"
--cgroups_enable_cfs="false" --cgroups_hierarchy="/sys/fs/cgroup" --cgroups_limit_swap="false"
--cgroups_root="mesos" --container_disk_watch_interval="15secs" --containerizers="mesos" --credential="/tmp/Endpoint_SlaveEndpointTest_UnauthorizedRequest_1_ug2tUK/credential"
--default_role="*" --disk_watch_interval="1mins" --docker="docker" --docker_kill_orphans="true"
--docker_registry="https://registry-1.docker.io" --docker_remove_delay="6hrs" --docker_socket="/var/run/docker.sock"
--docker_stop_timeout="0ns" --docker_store_dir="/tmp/Endpoint_SlaveEndpointTest_UnauthorizedRequest_1_ug2tUK/store/docker"
--docker_volume_checkpoint_dir="/var/run/mesos/isolators/docker/volume" --enforce_container_disk_quota="false"
--executor_registration_timeout="1mins" --executor_reregistration_timeout="2secs" --executor_shutdown_grace_period="5secs"
--fetcher_cache_dir="/tmp/Endpoint_SlaveEndpointTest_UnauthorizedRequest_1_ug2tUK/fetch" --fetcher_cache_size="2GB"
--frameworks_home="" --gc_delay="1weeks" --gc_disk_headroom="0.1" --hadoop_home="" --help="false"
--hostname_lookup="true" --http_command_executor="false" --http_credentials="/tmp/Endpoint_SlaveEndpointTest_UnauthorizedRequest_1_ug2tUK/http_credentials"
--http_heartbeat_interval="30secs" --initialize_driver_logging="true" --isolation="posix/cpu,posix/mem"
--launcher="posix" --launcher_dir="/mesos/build/src" --logbufsecs="0" --logging_level="INFO"
--max_completed_executors_per_framework="150" --oversubscribed_resources_interval="15secs"
--perf_duration="10secs" --perf_interval="1mins" --port="5051" --qos_correction_interval_min="0ns"
--quiet="false" --recover="reconnect" --recovery_timeout="15mins" --registration_backoff_factor="10ms"
--resources="cpus:2;gpus:0;mem:1024;disk:1024;ports:[31000-32000]" --revocable_cpu_low_priority="true"
--runtime_dir="/tmp/Endpoint_SlaveEndpointTest_UnauthorizedRequest_1_ug2tUK" --sandbox_directory="/mnt/mesos/sandbox"
--strict="true" --switch_user="true" --systemd_enable_support="true" --systemd_runtime_directory="/run/systemd/system"
--version="false" --work_dir="/tmp/Endpoint_SlaveEndpointTest_UnauthorizedRequest_1_YFlTpC"
I0701 05:34:57.579118 30688 credentials.hpp:86] Loading credential for authentication from
'/tmp/Endpoint_SlaveEndpointTest_UnauthorizedRequest_1_ug2tUK/credential'
I0701 05:34:57.579546 30688 slave.cpp:283] Agent using credential for: test-principal
I0701 05:34:57.579581 30688 credentials.hpp:37] Loading credentials for authentication from
'/tmp/Endpoint_SlaveEndpointTest_UnauthorizedRequest_1_ug2tUK/http_credentials'
I0701 05:34:57.580111 30688 http.cpp:974] Creating default 'basic' HTTP authenticator for
realm 'mesos-agent-readonly'
I0701 05:34:57.580538 30688 http.cpp:974] Creating default 'basic' HTTP authenticator for
realm 'mesos-agent-readwrite'
I0701 05:34:57.583282 30688 slave.cpp:565] Agent resources: [{"name":"cpus","scalar":{"value":2.0},"type":"SCALAR"},{"name":"mem","scalar":{"value":1024.0},"type":"SCALAR"},{"name":"disk","scalar":{"value":1024.0},"type":"SCALAR"},{"name":"ports","ranges":{"range":[{"begin":31000,"end":32000}]},"type":"RANGES"}]
I0701 05:34:57.583685 30688 slave.cpp:573] Agent attributes: [  ]
I0701 05:34:57.583776 30688 slave.cpp:578] Agent hostname: 4da8451e458e
I0701 05:34:57.584264 30684 status_update_manager.cpp:177] Pausing sending status updates
I0701 05:34:57.587309 30688 state.cpp:64] Recovering state from '/tmp/Endpoint_SlaveEndpointTest_UnauthorizedRequest_1_YFlTpC/meta'
I0701 05:34:57.595252 30682 status_update_manager.cpp:203] Recovering status update manager
I0701 05:34:57.595767 30681 containerizer.cpp:582] Recovering containerizer
I0701 05:34:57.598543 30681 provisioner.cpp:416] Provisioner recovery complete
I0701 05:34:57.599288 30687 slave.cpp:6189] Finished recovery
I0701 05:34:57.600277 30687 slave.cpp:6371] Querying resource estimator for oversubscribable
resources
I0701 05:34:57.600796 30687 slave.cpp:6385] Received oversubscribable resources {} from the
resource estimator
I0701 05:34:57.611825 30683 process.cpp:3779] Handling HTTP event for process 'slave(771)'
with path: '/slave(771)/monitor/statistics.json'
I0701 05:34:57.614367 30683 http.cpp:1114] HTTP GET for /slave(771)/monitor/statistics.json
from 172.17.0.4:42196
I0701 05:34:57.614496 30683 http.cpp:935] Authorizing principal 'test-principal' to GET the
'/monitor/statistics.json' endpoint
I0701 05:34:57.624701 30685 slave.cpp:839] Agent terminating
[       OK ] Endpoint/SlaveEndpointTest.UnauthorizedRequest/1 (94 ms)
[ RUN      ] Endpoint/SlaveEndpointTest.UnauthorizedRequest/2
I0701 05:34:57.682574 30680 containerizer.cpp:230] Using isolation: posix/cpu,posix/mem,filesystem/posix,network/cni,environment_secret
W0701 05:34:57.683363 30680 backend.cpp:76] Failed to create 'overlay' backend: OverlayBackend
requires root privileges
W0701 05:34:57.683542 30680 backend.cpp:76] Failed to create 'bind' backend: BindBackend requires
root privileges
I0701 05:34:57.683588 30680 provisioner.cpp:255] Using default backend 'copy'
I0701 05:34:57.688817 30682 slave.cpp:250] Mesos agent started on (772)@172.17.0.4:45831
I0701 05:34:57.688930 30682 slave.cpp:251] Flags at startup: --acls="" --appc_simple_discovery_uri_prefix="http://"
--appc_store_dir="/tmp/Endpoint_SlaveEndpointTest_UnauthorizedRequest_2_mWZcRj/store/appc"
--authenticate_http_readonly="true" --authenticate_http_readwrite="true" --authenticatee="crammd5"
--authentication_backoff_factor="1secs" --authorizer="local" --cgroups_cpu_enable_pids_and_tids_count="false"
--cgroups_enable_cfs="false" --cgroups_hierarchy="/sys/fs/cgroup" --cgroups_limit_swap="false"
--cgroups_root="mesos" --container_disk_watch_interval="15secs" --containerizers="mesos" --credential="/tmp/Endpoint_SlaveEndpointTest_UnauthorizedRequest_2_mWZcRj/credential"
--default_role="*" --disk_watch_interval="1mins" --docker="docker" --docker_kill_orphans="true"
--docker_registry="https://registry-1.docker.io" --docker_remove_delay="6hrs" --docker_socket="/var/run/docker.sock"
--docker_stop_timeout="0ns" --docker_store_dir="/tmp/Endpoint_SlaveEndpointTest_UnauthorizedRequest_2_mWZcRj/store/docker"
--docker_volume_checkpoint_dir="/var/run/mesos/isolators/docker/volume" --enforce_container_disk_quota="false"
--executor_registration_timeout="1mins" --executor_reregistration_timeout="2secs" --executor_shutdown_grace_period="5secs"
--fetcher_cache_dir="/tmp/Endpoint_SlaveEndpointTest_UnauthorizedRequest_2_mWZcRj/fetch" --fetcher_cache_size="2GB"
--frameworks_home="" --gc_delay="1weeks" --gc_disk_headroom="0.1" --hadoop_home="" --help="false"
--hostname_lookup="true" --http_command_executor="false" --http_credentials="/tmp/Endpoint_SlaveEndpointTest_UnauthorizedRequest_2_mWZcRj/http_credentials"
--http_heartbeat_interval="30secs" --initialize_driver_logging="true" --isolation="posix/cpu,posix/mem"
--launcher="posix" --launcher_dir="/mesos/build/src" --logbufsecs="0" --logging_level="INFO"
--max_completed_executors_per_framework="150" --oversubscribed_resources_interval="15secs"
--perf_duration="10secs" --perf_interval="1mins" --port="5051" --qos_correction_interval_min="0ns"
--quiet="false" --recover="reconnect" --recovery_timeout="15mins" --registration_backoff_factor="10ms"
--resources="cpus:2;gpus:0;mem:1024;disk:1024;ports:[31000-32000]" --revocable_cpu_low_priority="true"
--runtime_dir="/tmp/Endpoint_SlaveEndpointTest_UnauthorizedRequest_2_mWZcRj" --sandbox_directory="/mnt/mesos/sandbox"
--strict="true" --switch_user="true" --systemd_enable_support="true" --systemd_runtime_directory="/run/systemd/system"
--version="false" --work_dir="/tmp/Endpoint_SlaveEndpointTest_UnauthorizedRequest_2_Wc7x4a"
I0701 05:34:57.689837 30682 credentials.hpp:86] Loading credential for authentication from
'/tmp/Endpoint_SlaveEndpointTest_UnauthorizedRequest_2_mWZcRj/credential'
I0701 05:34:57.690250 30682 slave.cpp:283] Agent using credential for: test-principal
I0701 05:34:57.690320 30682 credentials.hpp:37] Loading credentials for authentication from
'/tmp/Endpoint_SlaveEndpointTest_UnauthorizedRequest_2_mWZcRj/http_credentials'
I0701 05:34:57.690897 30682 http.cpp:974] Creating default 'basic' HTTP authenticator for
realm 'mesos-agent-readonly'
I0701 05:34:57.691330 30682 http.cpp:974] Creating default 'basic' HTTP authenticator for
realm 'mesos-agent-readwrite'
I0701 05:34:57.694018 30682 slave.cpp:565] Agent resources: [{"name":"cpus","scalar":{"value":2.0},"type":"SCALAR"},{"name":"mem","scalar":{"value":1024.0},"type":"SCALAR"},{"name":"disk","scalar":{"value":1024.0},"type":"SCALAR"},{"name":"ports","ranges":{"range":[{"begin":31000,"end":32000}]},"type":"RANGES"}]
I0701 05:34:57.694586 30682 slave.cpp:573] Agent attributes: [  ]
I0701 05:34:57.694694 30682 slave.cpp:578] Agent hostname: 4da8451e458e
I0701 05:34:57.695052 30681 status_update_manager.cpp:177] Pausing sending status updates
I0701 05:34:57.699359 30684 state.cpp:64] Recovering state from '/tmp/Endpoint_SlaveEndpointTest_UnauthorizedRequest_2_Wc7x4a/meta'
I0701 05:34:57.699887 30688 status_update_manager.cpp:203] Recovering status update manager
I0701 05:34:57.700309 30687 containerizer.cpp:582] Recovering containerizer
I0701 05:34:57.702728 30684 provisioner.cpp:416] Provisioner recovery complete
I0701 05:34:57.703399 30687 slave.cpp:6189] Finished recovery
I0701 05:34:57.704218 30687 slave.cpp:6371] Querying resource estimator for oversubscribable
resources
I0701 05:34:57.714390 30687 slave.cpp:6385] Received oversubscribable resources {} from the
resource estimator
I0701 05:34:57.720064 30682 process.cpp:3779] Handling HTTP event for process 'slave(772)'
with path: '/slave(772)/containers'
I0701 05:34:57.722451 30685 http.cpp:1114] HTTP GET for /slave(772)/containers from 172.17.0.4:42198
I0701 05:34:57.722573 30685 http.cpp:935] Authorizing principal 'test-principal' to GET the
'/containers' endpoint
I0701 05:34:57.725944 30685 slave.cpp:839] Agent terminating
[       OK ] Endpoint/SlaveEndpointTest.UnauthorizedRequest/2 (74 ms)
[ RUN      ] Endpoint/SlaveEndpointTest.NoAuthorizer/0
I0701 05:34:57.748476 30680 containerizer.cpp:230] Using isolation: posix/cpu,posix/mem,filesystem/posix,network/cni,environment_secret
W0701 05:34:57.754554 30680 backend.cpp:76] Failed to create 'overlay' backend: OverlayBackend
requires root privileges
W0701 05:34:57.754858 30680 backend.cpp:76] Failed to create 'bind' backend: BindBackend requires
root privileges
I0701 05:34:57.754906 30680 provisioner.cpp:255] Using default backend 'copy'
I0701 05:34:57.760869 30680 cluster.cpp:448] Creating default 'local' authorizer
I0701 05:34:57.765118 30686 slave.cpp:250] Mesos agent started on (773)@172.17.0.4:45831
I0701 05:34:57.765179 30686 slave.cpp:251] Flags at startup: --acls="" --appc_simple_discovery_uri_prefix="http://"
--appc_store_dir="/tmp/Endpoint_SlaveEndpointTest_NoAuthorizer_0_whgOET/store/appc" --authenticate_http_readonly="true"
--authenticate_http_readwrite="true" --authenticatee="crammd5" --authentication_backoff_factor="1secs"
--authorizer="local" --cgroups_cpu_enable_pids_and_tids_count="false" --cgroups_enable_cfs="false"
--cgroups_hierarchy="/sys/fs/cgroup" --cgroups_limit_swap="false" --cgroups_root="mesos" --container_disk_watch_interval="15secs"
--containerizers="mesos" --credential="/tmp/Endpoint_SlaveEndpointTest_NoAuthorizer_0_whgOET/credential"
--default_role="*" --disk_watch_interval="1mins" --docker="docker" --docker_kill_orphans="true"
--docker_registry="https://registry-1.docker.io" --docker_remove_delay="6hrs" --docker_socket="/var/run/docker.sock"
--docker_stop_timeout="0ns" --docker_store_dir="/tmp/Endpoint_SlaveEndpointTest_NoAuthorizer_0_whgOET/store/docker"
--docker_volume_checkpoint_dir="/var/run/mesos/isolators/docker/volume" --enforce_container_disk_quota="false"
--executor_registration_timeout="1mins" --executor_reregistration_timeout="2secs" --executor_shutdown_grace_period="5secs"
--fetcher_cache_dir="/tmp/Endpoint_SlaveEndpointTest_NoAuthorizer_0_whgOET/fetch" --fetcher_cache_size="2GB"
--frameworks_home="" --gc_delay="1weeks" --gc_disk_headroom="0.1" --hadoop_home="" --help="false"
--hostname_lookup="true" --http_command_executor="false" --http_credentials="/tmp/Endpoint_SlaveEndpointTest_NoAuthorizer_0_whgOET/http_credentials"
--http_heartbeat_interval="30secs" --initialize_driver_logging="true" --isolation="posix/cpu,posix/mem"
--launcher="posix" --launcher_dir="/mesos/build/src" --logbufsecs="0" --logging_level="INFO"
--max_completed_executors_per_framework="150" --oversubscribed_resources_interval="15secs"
--perf_duration="10secs" --perf_interval="1mins" --port="5051" --qos_correction_interval_min="0ns"
--quiet="false" --recover="reconnect" --recovery_timeout="15mins" --registration_backoff_factor="10ms"
--resources="cpus:2;gpus:0;mem:1024;disk:1024;ports:[31000-32000]" --revocable_cpu_low_priority="true"
--runtime_dir="/tmp/Endpoint_SlaveEndpointTest_NoAuthorizer_0_whgOET" --sandbox_directory="/mnt/mesos/sandbox"
--strict="true" --switch_user="true" --systemd_enable_support="true" --systemd_runtime_directory="/run/systemd/system"
--version="false" --work_dir="/tmp/Endpoint_SlaveEndpointTest_NoAuthorizer_0_SuXaGK"
I0701 05:34:57.766057 30686 credentials.hpp:86] Loading credential for authentication from
'/tmp/Endpoint_SlaveEndpointTest_NoAuthorizer_0_whgOET/credential'
I0701 05:34:57.766358 30686 slave.cpp:283] Agent using credential for: test-principal
I0701 05:34:57.766379 30686 credentials.hpp:37] Loading credentials for authentication from
'/tmp/Endpoint_SlaveEndpointTest_NoAuthorizer_0_whgOET/http_credentials'
I0701 05:34:57.766727 30686 http.cpp:974] Creating default 'basic' HTTP authenticator for
realm 'mesos-agent-readonly'
I0701 05:34:57.767031 30686 http.cpp:974] Creating default 'basic' HTTP authenticator for
realm 'mesos-agent-readwrite'
I0701 05:34:57.769127 30686 slave.cpp:565] Agent resources: [{"name":"cpus","scalar":{"value":2.0},"type":"SCALAR"},{"name":"mem","scalar":{"value":1024.0},"type":"SCALAR"},{"name":"disk","scalar":{"value":1024.0},"type":"SCALAR"},{"name":"ports","ranges":{"range":[{"begin":31000,"end":32000}]},"type":"RANGES"}]
I0701 05:34:57.769460 30686 slave.cpp:573] Agent attributes: [  ]
I0701 05:34:57.769475 30686 slave.cpp:578] Agent hostname: 4da8451e458e
I0701 05:34:57.769731 30681 status_update_manager.cpp:177] Pausing sending status updates
I0701 05:34:57.771795 30683 state.cpp:64] Recovering state from '/tmp/Endpoint_SlaveEndpointTest_NoAuthorizer_0_SuXaGK/meta'
I0701 05:34:57.772671 30683 status_update_manager.cpp:203] Recovering status update manager
I0701 05:34:57.773087 30685 containerizer.cpp:582] Recovering containerizer
I0701 05:34:57.775276 30687 provisioner.cpp:416] Provisioner recovery complete
I0701 05:34:57.776165 30682 slave.cpp:6189] Finished recovery
I0701 05:34:57.777057 30682 slave.cpp:6371] Querying resource estimator for oversubscribable
resources
I0701 05:34:57.777694 30684 slave.cpp:6385] Received oversubscribable resources {} from the
resource estimator
I0701 05:34:57.785390 30687 process.cpp:3779] Handling HTTP event for process 'slave(773)'
with path: '/slave(773)/monitor/statistics'
I0701 05:34:57.787570 30685 http.cpp:1114] HTTP GET for /slave(773)/monitor/statistics from
172.17.0.4:42200
I0701 05:34:57.787700 30685 http.cpp:935] Authorizing principal 'test-principal' to GET the
'/monitor/statistics' endpoint
I0701 05:34:57.795821 30680 slave.cpp:839] Agent terminating
[       OK ] Endpoint/SlaveEndpointTest.NoAuthorizer/0 (69 ms)
[ RUN      ] Endpoint/SlaveEndpointTest.NoAuthorizer/1
I0701 05:34:57.819486 30680 containerizer.cpp:230] Using isolation: posix/cpu,posix/mem,filesystem/posix,network/cni,environment_secret
W0701 05:34:57.820403 30680 backend.cpp:76] Failed to create 'overlay' backend: OverlayBackend
requires root privileges
W0701 05:34:57.820614 30680 backend.cpp:76] Failed to create 'bind' backend: BindBackend requires
root privileges
I0701 05:34:57.820727 30680 provisioner.cpp:255] Using default backend 'copy'
I0701 05:34:57.823248 30680 cluster.cpp:448] Creating default 'local' authorizer
I0701 05:34:57.837234 30687 slave.cpp:250] Mesos agent started on (774)@172.17.0.4:45831
I0701 05:34:57.837297 30687 slave.cpp:251] Flags at startup: --acls="" --appc_simple_discovery_uri_prefix="http://"
--appc_store_dir="/tmp/Endpoint_SlaveEndpointTest_NoAuthorizer_1_aa495s/store/appc" --authenticate_http_readonly="true"
--authenticate_http_readwrite="true" --authenticatee="crammd5" --authentication_backoff_factor="1secs"
--authorizer="local" --cgroups_cpu_enable_pids_and_tids_count="false" --cgroups_enable_cfs="false"
--cgroups_hierarchy="/sys/fs/cgroup" --cgroups_limit_swap="false" --cgroups_root="mesos" --container_disk_watch_interval="15secs"
--containerizers="mesos" --credential="/tmp/Endpoint_SlaveEndpointTest_NoAuthorizer_1_aa495s/credential"
--default_role="*" --disk_watch_interval="1mins" --docker="docker" --docker_kill_orphans="true"
--docker_registry="https://registry-1.docker.io" --docker_remove_delay="6hrs" --docker_socket="/var/run/docker.sock"
--docker_stop_timeout="0ns" --docker_store_dir="/tmp/Endpoint_SlaveEndpointTest_NoAuthorizer_1_aa495s/store/docker"
--docker_volume_checkpoint_dir="/var/run/mesos/isolators/docker/volume" --enforce_container_disk_quota="false"
--executor_registration_timeout="1mins" --executor_reregistration_timeout="2secs" --executor_shutdown_grace_period="5secs"
--fetcher_cache_dir="/tmp/Endpoint_SlaveEndpointTest_NoAuthorizer_1_aa495s/fetch" --fetcher_cache_size="2GB"
--frameworks_home="" --gc_delay="1weeks" --gc_disk_headroom="0.1" --hadoop_home="" --help="false"
--hostname_lookup="true" --http_command_executor="false" --http_credentials="/tmp/Endpoint_SlaveEndpointTest_NoAuthorizer_1_aa495s/http_credentials"
--http_heartbeat_interval="30secs" --initialize_driver_logging="true" --isolation="posix/cpu,posix/mem"
--launcher="posix" --launcher_dir="/mesos/build/src" --logbufsecs="0" --logging_level="INFO"
--max_completed_executors_per_framework="150" --oversubscribed_resources_interval="15secs"
--perf_duration="10secs" --perf_interval="1mins" --port="5051" --qos_correction_interval_min="0ns"
--quiet="false" --recover="reconnect" --recovery_timeout="15mins" --registration_backoff_factor="10ms"
--resources="cpus:2;gpus:0;mem:1024;disk:1024;ports:[31000-32000]" --revocable_cpu_low_priority="true"
--runtime_dir="/tmp/Endpoint_SlaveEndpointTest_NoAuthorizer_1_aa495s" --sandbox_directory="/mnt/mesos/sandbox"
--strict="true" --switch_user="true" --systemd_enable_support="true" --systemd_runtime_directory="/run/systemd/system"
--version="false" --work_dir="/tmp/Endpoint_SlaveEndpointTest_NoAuthorizer_1_Edy1Vj"
I0701 05:34:57.838063 30687 credentials.hpp:86] Loading credential for authentication from
'/tmp/Endpoint_SlaveEndpointTest_NoAuthorizer_1_aa495s/credential'
I0701 05:34:57.838522 30687 slave.cpp:283] Agent using credential for: test-principal
I0701 05:34:57.838552 30687 credentials.hpp:37] Loading credentials for authentication from
'/tmp/Endpoint_SlaveEndpointTest_NoAuthorizer_1_aa495s/http_credentials'
I0701 05:34:57.839630 30687 http.cpp:974] Creating default 'basic' HTTP authenticator for
realm 'mesos-agent-readonly'
I0701 05:34:57.839937 30687 http.cpp:974] Creating default 'basic' HTTP authenticator for
realm 'mesos-agent-readwrite'
I0701 05:34:57.842213 30687 slave.cpp:565] Agent resources: [{"name":"cpus","scalar":{"value":2.0},"type":"SCALAR"},{"name":"mem","scalar":{"value":1024.0},"type":"SCALAR"},{"name":"disk","scalar":{"value":1024.0},"type":"SCALAR"},{"name":"ports","ranges":{"range":[{"begin":31000,"end":32000}]},"type":"RANGES"}]
I0701 05:34:57.842561 30687 slave.cpp:573] Agent attributes: [  ]
I0701 05:34:57.853919 30687 slave.cpp:578] Agent hostname: 4da8451e458e
I0701 05:34:57.854358 30688 status_update_manager.cpp:177] Pausing sending status updates
I0701 05:34:57.857276 30687 state.cpp:64] Recovering state from '/tmp/Endpoint_SlaveEndpointTest_NoAuthorizer_1_Edy1Vj/meta'
I0701 05:34:57.857898 30687 status_update_manager.cpp:203] Recovering status update manager
I0701 05:34:57.858290 30683 containerizer.cpp:582] Recovering containerizer
I0701 05:34:57.860865 30684 provisioner.cpp:416] Provisioner recovery complete
I0701 05:34:57.861490 30684 slave.cpp:6189] Finished recovery
I0701 05:34:57.862192 30684 slave.cpp:6371] Querying resource estimator for oversubscribable
resources
I0701 05:34:57.862507 30684 slave.cpp:6385] Received oversubscribable resources {} from the
resource estimator
I0701 05:34:57.868460 30688 process.cpp:3779] Handling HTTP event for process 'slave(774)'
with path: '/slave(774)/monitor/statistics.json'
I0701 05:34:57.871273 30688 http.cpp:1114] HTTP GET for /slave(774)/monitor/statistics.json
from 172.17.0.4:42202
I0701 05:34:57.871405 30688 http.cpp:935] Authorizing principal 'test-principal' to GET the
'/monitor/statistics.json' endpoint
I0701 05:34:57.903249 30685 slave.cpp:839] Agent terminating
[       OK ] Endpoint/SlaveEndpointTest.NoAuthorizer/1 (115 ms)
[ RUN      ] Endpoint/SlaveEndpointTest.NoAuthorizer/2
I0701 05:34:57.934504 30680 containerizer.cpp:230] Using isolation: posix/cpu,posix/mem,filesystem/posix,network/cni,environment_secret
W0701 05:34:57.935294 30680 backend.cpp:76] Failed to create 'overlay' backend: OverlayBackend
requires root privileges
W0701 05:34:57.935492 30680 backend.cpp:76] Failed to create 'bind' backend: BindBackend requires
root privileges
I0701 05:34:57.935537 30680 provisioner.cpp:255] Using default backend 'copy'
I0701 05:34:57.938565 30680 cluster.cpp:448] Creating default 'local' authorizer
I0701 05:34:57.941187 30686 slave.cpp:250] Mesos agent started on (775)@172.17.0.4:45831
I0701 05:34:57.941252 30686 slave.cpp:251] Flags at startup: --acls="" --appc_simple_discovery_uri_prefix="http://"
--appc_store_dir="/tmp/Endpoint_SlaveEndpointTest_NoAuthorizer_2_i0CBL4/store/appc" --authenticate_http_readonly="true"
--authenticate_http_readwrite="true" --authenticatee="crammd5" --authentication_backoff_factor="1secs"
--authorizer="local" --cgroups_cpu_enable_pids_and_tids_count="false" --cgroups_enable_cfs="false"
--cgroups_hierarchy="/sys/fs/cgroup" --cgroups_limit_swap="false" --cgroups_root="mesos" --container_disk_watch_interval="15secs"
--containerizers="mesos" --credential="/tmp/Endpoint_SlaveEndpointTest_NoAuthorizer_2_i0CBL4/credential"
--default_role="*" --disk_watch_interval="1mins" --docker="docker" --docker_kill_orphans="true"
--docker_registry="https://registry-1.docker.io" --docker_remove_delay="6hrs" --docker_socket="/var/run/docker.sock"
--docker_stop_timeout="0ns" --docker_store_dir="/tmp/Endpoint_SlaveEndpointTest_NoAuthorizer_2_i0CBL4/store/docker"
--docker_volume_checkpoint_dir="/var/run/mesos/isolators/docker/volume" --enforce_container_disk_quota="false"
--executor_registration_timeout="1mins" --executor_reregistration_timeout="2secs" --executor_shutdown_grace_period="5secs"
--fetcher_cache_dir="/tmp/Endpoint_SlaveEndpointTest_NoAuthorizer_2_i0CBL4/fetch" --fetcher_cache_size="2GB"
--frameworks_home="" --gc_delay="1weeks" --gc_disk_headroom="0.1" --hadoop_home="" --help="false"
--hostname_lookup="true" --http_command_executor="false" --http_credentials="/tmp/Endpoint_SlaveEndpointTest_NoAuthorizer_2_i0CBL4/http_credentials"
--http_heartbeat_interval="30secs" --initialize_driver_logging="true" --isolation="posix/cpu,posix/mem"
--launcher="posix" --launcher_dir="/mesos/build/src" --logbufsecs="0" --logging_level="INFO"
--max_completed_executors_per_framework="150" --oversubscribed_resources_interval="15secs"
--perf_duration="10secs" --perf_interval="1mins" --port="5051" --qos_correction_interval_min="0ns"
--quiet="false" --recover="reconnect" --recovery_timeout="15mins" --registration_backoff_factor="10ms"
--resources="cpus:2;gpus:0;mem:1024;disk:1024;ports:[31000-32000]" --revocable_cpu_low_priority="true"
--runtime_dir="/tmp/Endpoint_SlaveEndpointTest_NoAuthorizer_2_i0CBL4" --sandbox_directory="/mnt/mesos/sandbox"
--strict="true" --switch_user="true" --systemd_enable_support="true" --systemd_runtime_directory="/run/systemd/system"
--version="false" --work_dir="/tmp/Endpoint_SlaveEndpointTest_NoAuthorizer_2_06aSiV"
I0701 05:34:57.942003 30686 credentials.hpp:86] Loading credential for authentication from
'/tmp/Endpoint_SlaveEndpointTest_NoAuthorizer_2_i0CBL4/credential'
I0701 05:34:57.942258 30686 slave.cpp:283] Agent using credential for: test-principal
I0701 05:34:57.942279 30686 credentials.hpp:37] Loading credentials for authentication from
'/tmp/Endpoint_SlaveEndpointTest_NoAuthorizer_2_i0CBL4/http_credentials'
I0701 05:34:57.942847 30686 http.cpp:974] Creating default 'basic' HTTP authenticator for
realm 'mesos-agent-readonly'
I0701 05:34:57.943092 30686 http.cpp:974] Creating default 'basic' HTTP authenticator for
realm 'mesos-agent-readwrite'
I0701 05:34:57.945243 30686 slave.cpp:565] Agent resources: [{"name":"cpus","scalar":{"value":2.0},"type":"SCALAR"},{"name":"mem","scalar":{"value":1024.0},"type":"SCALAR"},{"name":"disk","scalar":{"value":1024.0},"type":"SCALAR"},{"name":"ports","ranges":{"range":[{"begin":31000,"end":32000}]},"type":"RANGES"}]
I0701 05:34:57.945578 30686 slave.cpp:573] Agent attributes: [  ]
I0701 05:34:57.945595 30686 slave.cpp:578] Agent hostname: 4da8451e458e
I0701 05:34:57.945932 30683 status_update_manager.cpp:177] Pausing sending status updates
I0701 05:34:57.954939 30686 state.cpp:64] Recovering state from '/tmp/Endpoint_SlaveEndpointTest_NoAuthorizer_2_06aSiV/meta'
I0701 05:34:57.955404 30686 status_update_manager.cpp:203] Recovering status update manager
I0701 05:34:57.956137 30688 containerizer.cpp:582] Recovering containerizer
I0701 05:34:57.964993 30684 provisioner.cpp:416] Provisioner recovery complete
I0701 05:34:57.965615 30685 slave.cpp:6189] Finished recovery
I0701 05:34:57.966254 30685 slave.cpp:6371] Querying resource estimator for oversubscribable
resources
I0701 05:34:57.966801 30683 slave.cpp:6385] Received oversubscribable resources {} from the
resource estimator
I0701 05:34:57.985381 30683 process.cpp:3779] Handling HTTP event for process 'slave(775)'
with path: '/slave(775)/containers'
I0701 05:34:57.987534 30684 http.cpp:1114] HTTP GET for /slave(775)/containers from 172.17.0.4:42204
I0701 05:34:57.987655 30684 http.cpp:935] Authorizing principal 'test-principal' to GET the
'/containers' endpoint
I0701 05:34:58.024055 30685 slave.cpp:839] Agent terminating
[       OK ] Endpoint/SlaveEndpointTest.NoAuthorizer/2 (125 ms)
[----------] 9 tests from Endpoint/SlaveEndpointTest (955 ms total)

[----------] Global test environment tear-down
[==========] 1573 tests from 172 test cases ran. (577923 ms total)
[  PASSED  ] 1572 tests.
[  FAILED  ] 1 test, listed below:
[  FAILED  ] ContentType/AgentAPIStreamingTest.AttachInputToNestedContainerSession/1, where
GetParam() = application/json

 1 FAILED TEST
  YOU HAVE 20 DISABLED TESTS

I0701 05:34:58.234278 30689 process.cpp:968] Failed to accept socket: future discarded
make[3]: *** [CMakeFiles/check] Error 1
make[3]: Leaving directory `/mesos/build'
make[2]: Leaving directory `/mesos/build'
make[2]: *** [CMakeFiles/check.dir/all] Error 2
make[1]: *** [CMakeFiles/check.dir/rule] Error 2
make[1]: Leaving directory `/mesos/build'
make: *** [check] Error 2
+ docker rmi mesos-1498881819-14378
Untagged: mesos-1498881819-14378:latest
Deleted: sha256:6b7a792e76983d5fe196a40df476caf859b53e7f22af8a9d1758382936a3a345
Deleted: sha256:fdd2058021a77976e71fd8021cab2fdf1d9b812ab4b351d1611e786c8971056b
Deleted: sha256:dfa28ac733e33b82d0d255d7eabb74571be679231f1295311880a04a127c0bde
Deleted: sha256:1a8d3c043bc8ca8de0cd88c169071f88f446573706f845a8e248e97686564945
Deleted: sha256:61e17615b18ce47a50901b53abf9899ccfef6f45d4ea8b84e48a7fabcdaa69a0
Deleted: sha256:9e3bb52dc073ef5cebc1e1089ce85715cb369bacd0d803a01709f8796a1f0724
Deleted: sha256:dbf05c3b2ee8f628c9d495728514a05fc6f228c23b25985b94d92b3e1f204ca2
Deleted: sha256:d733df946ba14b548d30b43cf31b18a951399b858ee1c4f527ff99b52f829d98
Deleted: sha256:43ee3833472edbfc99367d367efc445594fcb47d8ba73ca2a5dbf3a03e14ecac
Deleted: sha256:1b152fa4e2515d82feafcd8afd3eb155cea193b1af1528a1c9d53e207eaa6d09
Deleted: sha256:69ffe6ff8542c6a278729ca5e9d1fc63da20bda937f3bcae978904921b1f829c
Deleted: sha256:9524d6e40a9fed6aa55d5f39a25e8eba059007576f8b07f89e70018c0fa77f40
Deleted: sha256:8bb598f491a55850dfb68ba6c681ccc4ad42aa7c8b390303db9b8342c7dc1d78
Deleted: sha256:6f385f97fb64ca3328763e92fcb204d5bd925c4fe8a82987c4a4c2e8eadbab68
Deleted: sha256:b0abc434e000433daea257167d52b2c7efda96c2f49515251fbbc40461f01a8a
Deleted: sha256:8c0d3289ea0a4b83fa7334592f20f2d06a94347d29bff52218d412fb647b1f73
Deleted: sha256:dd4a2b4829de087351e0e8cf8cf71944b3e83eb2450ade20489de928fc73a9a1
Deleted: sha256:82f7d77e6df22b03a7819f092796b5fd023e31411109c35b2aa4e1982fd24cb4
Deleted: sha256:c4d11d07fab87b10005afc49877f647f6613dbb0783dffb31b1aef04f965968a
Deleted: sha256:cbeaabfd305b84ee115c1363a9633f6057a061e36b96b7eda96a422563544179
Deleted: sha256:a75401034ed676968b624b99fc0aef37cd7780006569b7d07faa3b3f3bfe695d
Deleted: sha256:e0e2386d86890d4b621b9dbf536c34ec30ccc2ed125d69bdf440433b832f8fd8
Deleted: sha256:f3901acce912f63f09cad819f70ebd64b5b58d9b50d75e3b53260b3809297648
Deleted: sha256:46f799683c6836c1d8022adb1e47d6bdb5a9e3cbdcc64dd5a688ebcb84e8b970
Build step 'Execute shell' marked build as failure
Not sending mail to unregistered user yujie.jay@gmail.com

Mime
View raw message