mesos-builds mailing list archives

Site index · List index
Message view « Date » · « Thread »
Top « Date » · « Thread »
From Apache Jenkins Server <jenk...@builds.apache.org>
Subject Build failed in Jenkins: Mesos-Buildbot » autotools,clang,--verbose,GLOG_v=1 MESOS_VERBOSE=1,ubuntu:14.04,(ubuntu)&&(!ubuntu-us1)&&(!ubuntu-eu2) #3955
Date Wed, 26 Jul 2017 00:27:15 GMT
See <https://builds.apache.org/job/Mesos-Buildbot/BUILDTOOL=autotools,COMPILER=clang,CONFIGURATION=--verbose,ENVIRONMENT=GLOG_v=1%20MESOS_VERBOSE=1,OS=ubuntu%3A14.04,label_exp=(ubuntu)&&(!ubuntu-us1)&&(!ubuntu-eu2)/3955/display/redirect?page=changes>

Changes:

[xujyan] Added more tests for agent reregistration.

------------------------------------------
[...truncated 30.18 MB...]
[       OK ] Endpoint/SlaveEndpointTest.AuthorizedRequest/1 (30 ms)
[ RUN      ] Endpoint/SlaveEndpointTest.AuthorizedRequest/2
I0726 00:27:08.395262  3622 containerizer.cpp:230] Using isolation: posix/cpu,posix/mem,filesystem/posix,network/cni,environment_secret
W0726 00:27:08.395750  3622 backend.cpp:76] Failed to create 'aufs' backend: AufsBackend requires
root privileges
W0726 00:27:08.395854  3622 backend.cpp:76] Failed to create 'bind' backend: BindBackend requires
root privileges
I0726 00:27:08.395905  3622 provisioner.cpp:255] Using default backend 'copy'
I0726 00:27:08.398753  3657 slave.cpp:250] Mesos agent started on (796)@172.17.0.2:40540
I0726 00:27:08.398792  3657 slave.cpp:251] Flags at startup: --acls="" --appc_simple_discovery_uri_prefix="http://"
--appc_store_dir="/tmp/Endpoint_SlaveEndpointTest_AuthorizedRequest_2_yAVSkX/store/appc" --authenticate_http_readonly="true"
--authenticate_http_readwrite="true" --authenticatee="crammd5" --authentication_backoff_factor="1secs"
--authorizer="local" --cgroups_cpu_enable_pids_and_tids_count="false" --cgroups_enable_cfs="false"
--cgroups_hierarchy="/sys/fs/cgroup" --cgroups_limit_swap="false" --cgroups_root="mesos" --container_disk_watch_interval="15secs"
--containerizers="mesos" --credential="/tmp/Endpoint_SlaveEndpointTest_AuthorizedRequest_2_yAVSkX/credential"
--default_role="*" --disk_watch_interval="1mins" --docker="docker" --docker_kill_orphans="true"
--docker_registry="https://registry-1.docker.io" --docker_remove_delay="6hrs" --docker_socket="/var/run/docker.sock"
--docker_stop_timeout="0ns" --docker_store_dir="/tmp/Endpoint_SlaveEndpointTest_AuthorizedRequest_2_yAVSkX/store/docker"
--docker_volume_checkpoint_dir="/var/run/mesos/isolators/docker/volume" --enforce_container_disk_quota="false"
--executor_registration_timeout="1mins" --executor_reregistration_timeout="2secs" --executor_shutdown_grace_period="5secs"
--fetcher_cache_dir="/tmp/Endpoint_SlaveEndpointTest_AuthorizedRequest_2_yAVSkX/fetch" --fetcher_cache_size="2GB"
--frameworks_home="" --gc_delay="1weeks" --gc_disk_headroom="0.1" --hadoop_home="" --help="false"
--hostname_lookup="true" --http_command_executor="false" --http_credentials="/tmp/Endpoint_SlaveEndpointTest_AuthorizedRequest_2_yAVSkX/http_credentials"
--http_heartbeat_interval="30secs" --initialize_driver_logging="true" --isolation="posix/cpu,posix/mem"
--launcher="posix" --launcher_dir="/mesos/mesos-1.4.0/_build/src" --logbufsecs="0" --logging_level="INFO"
--max_completed_executors_per_framework="150" --oversubscribed_resources_interval="15secs"
--perf_duration="10secs" --perf_interval="1mins" --port="5051" --qos_correction_interval_min="0ns"
--quiet="false" --recover="reconnect" --recovery_timeout="15mins" --registration_backoff_factor="10ms"
--resources="cpus:2;gpus:0;mem:1024;disk:1024;ports:[31000-32000]" --revocable_cpu_low_priority="true"
--runtime_dir="/tmp/Endpoint_SlaveEndpointTest_AuthorizedRequest_2_yAVSkX" --sandbox_directory="/mnt/mesos/sandbox"
--strict="true" --switch_user="true" --systemd_enable_support="true" --systemd_runtime_directory="/run/systemd/system"
--version="false" --work_dir="/tmp/Endpoint_SlaveEndpointTest_AuthorizedRequest_2_v5JTTY"
I0726 00:27:08.399240  3657 credentials.hpp:86] Loading credential for authentication from
'/tmp/Endpoint_SlaveEndpointTest_AuthorizedRequest_2_yAVSkX/credential'
I0726 00:27:08.399406  3657 slave.cpp:283] Agent using credential for: test-principal
I0726 00:27:08.399428  3657 credentials.hpp:37] Loading credentials for authentication from
'/tmp/Endpoint_SlaveEndpointTest_AuthorizedRequest_2_yAVSkX/http_credentials'
I0726 00:27:08.399648  3657 http.cpp:993] Creating default 'basic' HTTP authenticator for
realm 'mesos-agent-readonly'
I0726 00:27:08.399782  3657 http.cpp:993] Creating default 'basic' HTTP authenticator for
realm 'mesos-agent-readwrite'
I0726 00:27:08.401053  3657 slave.cpp:565] Agent resources: [{"name":"cpus","scalar":{"value":2.0},"type":"SCALAR"},{"name":"mem","scalar":{"value":1024.0},"type":"SCALAR"},{"name":"disk","scalar":{"value":1024.0},"type":"SCALAR"},{"name":"ports","ranges":{"range":[{"begin":31000,"end":32000}]},"type":"RANGES"}]
I0726 00:27:08.401268  3657 slave.cpp:573] Agent attributes: [  ]
I0726 00:27:08.401283  3657 slave.cpp:582] Agent hostname: c51831d9353e
I0726 00:27:08.401432  3642 status_update_manager.cpp:177] Pausing sending status updates
I0726 00:27:08.402652  3656 state.cpp:64] Recovering state from '/tmp/Endpoint_SlaveEndpointTest_AuthorizedRequest_2_v5JTTY/meta'
I0726 00:27:08.402880  3663 status_update_manager.cpp:203] Recovering status update manager
I0726 00:27:08.403067  3652 containerizer.cpp:582] Recovering containerizer
I0726 00:27:08.404382  3658 provisioner.cpp:416] Provisioner recovery complete
I0726 00:27:08.404750  3649 slave.cpp:6207] Finished recovery
I0726 00:27:08.405153  3649 slave.cpp:6389] Querying resource estimator for oversubscribable
resources
I0726 00:27:08.405351  3653 slave.cpp:6403] Received oversubscribable resources {} from the
resource estimator
I0726 00:27:08.407522  3642 process.cpp:3837] Handling HTTP event for process 'slave(796)'
with path: '/slave(796)/containers'
I0726 00:27:08.408691  3651 http.cpp:1133] HTTP GET for /slave(796)/containers from 172.17.0.2:50702
I0726 00:27:08.408761  3651 http.cpp:957] Authorizing principal 'test-principal' to GET the
'/containers' endpoint
I0726 00:27:08.412073  3646 slave.cpp:843] Agent terminating
[       OK ] Endpoint/SlaveEndpointTest.AuthorizedRequest/2 (26 ms)
[ RUN      ] Endpoint/SlaveEndpointTest.UnauthorizedRequest/0
I0726 00:27:08.421332  3622 containerizer.cpp:230] Using isolation: posix/cpu,posix/mem,filesystem/posix,network/cni,environment_secret
W0726 00:27:08.421744  3622 backend.cpp:76] Failed to create 'aufs' backend: AufsBackend requires
root privileges
W0726 00:27:08.421828  3622 backend.cpp:76] Failed to create 'bind' backend: BindBackend requires
root privileges
I0726 00:27:08.421856  3622 provisioner.cpp:255] Using default backend 'copy'
I0726 00:27:08.424525  3649 slave.cpp:250] Mesos agent started on (797)@172.17.0.2:40540
I0726 00:27:08.424571  3649 slave.cpp:251] Flags at startup: --acls="" --appc_simple_discovery_uri_prefix="http://"
--appc_store_dir="/tmp/Endpoint_SlaveEndpointTest_UnauthorizedRequest_0_iv09hR/store/appc"
--authenticate_http_readonly="true" --authenticate_http_readwrite="true" --authenticatee="crammd5"
--authentication_backoff_factor="1secs" --authorizer="local" --cgroups_cpu_enable_pids_and_tids_count="false"
--cgroups_enable_cfs="false" --cgroups_hierarchy="/sys/fs/cgroup" --cgroups_limit_swap="false"
--cgroups_root="mesos" --container_disk_watch_interval="15secs" --containerizers="mesos" --credential="/tmp/Endpoint_SlaveEndpointTest_UnauthorizedRequest_0_iv09hR/credential"
--default_role="*" --disk_watch_interval="1mins" --docker="docker" --docker_kill_orphans="true"
--docker_registry="https://registry-1.docker.io" --docker_remove_delay="6hrs" --docker_socket="/var/run/docker.sock"
--docker_stop_timeout="0ns" --docker_store_dir="/tmp/Endpoint_SlaveEndpointTest_UnauthorizedRequest_0_iv09hR/store/docker"
--docker_volume_checkpoint_dir="/var/run/mesos/isolators/docker/volume" --enforce_container_disk_quota="false"
--executor_registration_timeout="1mins" --executor_reregistration_timeout="2secs" --executor_shutdown_grace_period="5secs"
--fetcher_cache_dir="/tmp/Endpoint_SlaveEndpointTest_UnauthorizedRequest_0_iv09hR/fetch" --fetcher_cache_size="2GB"
--frameworks_home="" --gc_delay="1weeks" --gc_disk_headroom="0.1" --hadoop_home="" --help="false"
--hostname_lookup="true" --http_command_executor="false" --http_credentials="/tmp/Endpoint_SlaveEndpointTest_UnauthorizedRequest_0_iv09hR/http_credentials"
--http_heartbeat_interval="30secs" --initialize_driver_logging="true" --isolation="posix/cpu,posix/mem"
--launcher="posix" --launcher_dir="/mesos/mesos-1.4.0/_build/src" --logbufsecs="0" --logging_level="INFO"
--max_completed_executors_per_framework="150" --oversubscribed_resources_interval="15secs"
--perf_duration="10secs" --perf_interval="1mins" --port="5051" --qos_correction_interval_min="0ns"
--quiet="false" --recover="reconnect" --recovery_timeout="15mins" --registration_backoff_factor="10ms"
--resources="cpus:2;gpus:0;mem:1024;disk:1024;ports:[31000-32000]" --revocable_cpu_low_priority="true"
--runtime_dir="/tmp/Endpoint_SlaveEndpointTest_UnauthorizedRequest_0_iv09hR" --sandbox_directory="/mnt/mesos/sandbox"
--strict="true" --switch_user="true" --systemd_enable_support="true" --systemd_runtime_directory="/run/systemd/system"
--version="false" --work_dir="/tmp/Endpoint_SlaveEndpointTest_UnauthorizedRequest_0_mQJfNS"
I0726 00:27:08.424970  3649 credentials.hpp:86] Loading credential for authentication from
'/tmp/Endpoint_SlaveEndpointTest_UnauthorizedRequest_0_iv09hR/credential'
I0726 00:27:08.425115  3649 slave.cpp:283] Agent using credential for: test-principal
I0726 00:27:08.425137  3649 credentials.hpp:37] Loading credentials for authentication from
'/tmp/Endpoint_SlaveEndpointTest_UnauthorizedRequest_0_iv09hR/http_credentials'
I0726 00:27:08.425348  3649 http.cpp:993] Creating default 'basic' HTTP authenticator for
realm 'mesos-agent-readonly'
I0726 00:27:08.425482  3649 http.cpp:993] Creating default 'basic' HTTP authenticator for
realm 'mesos-agent-readwrite'
I0726 00:27:08.426681  3649 slave.cpp:565] Agent resources: [{"name":"cpus","scalar":{"value":2.0},"type":"SCALAR"},{"name":"mem","scalar":{"value":1024.0},"type":"SCALAR"},{"name":"disk","scalar":{"value":1024.0},"type":"SCALAR"},{"name":"ports","ranges":{"range":[{"begin":31000,"end":32000}]},"type":"RANGES"}]
I0726 00:27:08.426893  3649 slave.cpp:573] Agent attributes: [  ]
I0726 00:27:08.426908  3649 slave.cpp:582] Agent hostname: c51831d9353e
I0726 00:27:08.427055  3663 status_update_manager.cpp:177] Pausing sending status updates
I0726 00:27:08.428263  3656 state.cpp:64] Recovering state from '/tmp/Endpoint_SlaveEndpointTest_UnauthorizedRequest_0_mQJfNS/meta'
I0726 00:27:08.428536  3655 status_update_manager.cpp:203] Recovering status update manager
I0726 00:27:08.428752  3645 containerizer.cpp:582] Recovering containerizer
I0726 00:27:08.429849  3641 provisioner.cpp:416] Provisioner recovery complete
I0726 00:27:08.430167  3650 slave.cpp:6207] Finished recovery
I0726 00:27:08.430560  3650 slave.cpp:6389] Querying resource estimator for oversubscribable
resources
I0726 00:27:08.430806  3660 slave.cpp:6403] Received oversubscribable resources {} from the
resource estimator
I0726 00:27:08.433154  3651 process.cpp:3837] Handling HTTP event for process 'slave(797)'
with path: '/slave(797)/monitor/statistics'
I0726 00:27:08.434180  3649 http.cpp:1133] HTTP GET for /slave(797)/monitor/statistics from
172.17.0.2:50704
I0726 00:27:08.434252  3649 http.cpp:957] Authorizing principal 'test-principal' to GET the
'/monitor/statistics' endpoint
I0726 00:27:08.436054  3642 slave.cpp:843] Agent terminating
[       OK ] Endpoint/SlaveEndpointTest.UnauthorizedRequest/0 (23 ms)
[ RUN      ] Endpoint/SlaveEndpointTest.UnauthorizedRequest/1
I0726 00:27:08.445984  3622 containerizer.cpp:230] Using isolation: posix/cpu,posix/mem,filesystem/posix,network/cni,environment_secret
W0726 00:27:08.446467  3622 backend.cpp:76] Failed to create 'aufs' backend: AufsBackend requires
root privileges
W0726 00:27:08.446566  3622 backend.cpp:76] Failed to create 'bind' backend: BindBackend requires
root privileges
I0726 00:27:08.446600  3622 provisioner.cpp:255] Using default backend 'copy'
I0726 00:27:08.450003  3659 slave.cpp:250] Mesos agent started on (798)@172.17.0.2:40540
I0726 00:27:08.450045  3659 slave.cpp:251] Flags at startup: --acls="" --appc_simple_discovery_uri_prefix="http://"
--appc_store_dir="/tmp/Endpoint_SlaveEndpointTest_UnauthorizedRequest_1_Y9lWtL/store/appc"
--authenticate_http_readonly="true" --authenticate_http_readwrite="true" --authenticatee="crammd5"
--authentication_backoff_factor="1secs" --authorizer="local" --cgroups_cpu_enable_pids_and_tids_count="false"
--cgroups_enable_cfs="false" --cgroups_hierarchy="/sys/fs/cgroup" --cgroups_limit_swap="false"
--cgroups_root="mesos" --container_disk_watch_interval="15secs" --containerizers="mesos" --credential="/tmp/Endpoint_SlaveEndpointTest_UnauthorizedRequest_1_Y9lWtL/credential"
--default_role="*" --disk_watch_interval="1mins" --docker="docker" --docker_kill_orphans="true"
--docker_registry="https://registry-1.docker.io" --docker_remove_delay="6hrs" --docker_socket="/var/run/docker.sock"
--docker_stop_timeout="0ns" --docker_store_dir="/tmp/Endpoint_SlaveEndpointTest_UnauthorizedRequest_1_Y9lWtL/store/docker"
--docker_volume_checkpoint_dir="/var/run/mesos/isolators/docker/volume" --enforce_container_disk_quota="false"
--executor_registration_timeout="1mins" --executor_reregistration_timeout="2secs" --executor_shutdown_grace_period="5secs"
--fetcher_cache_dir="/tmp/Endpoint_SlaveEndpointTest_UnauthorizedRequest_1_Y9lWtL/fetch" --fetcher_cache_size="2GB"
--frameworks_home="" --gc_delay="1weeks" --gc_disk_headroom="0.1" --hadoop_home="" --help="false"
--hostname_lookup="true" --http_command_executor="false" --http_credentials="/tmp/Endpoint_SlaveEndpointTest_UnauthorizedRequest_1_Y9lWtL/http_credentials"
--http_heartbeat_interval="30secs" --initialize_driver_logging="true" --isolation="posix/cpu,posix/mem"
--launcher="posix" --launcher_dir="/mesos/mesos-1.4.0/_build/src" --logbufsecs="0" --logging_level="INFO"
--max_completed_executors_per_framework="150" --oversubscribed_resources_interval="15secs"
--perf_duration="10secs" --perf_interval="1mins" --port="5051" --qos_correction_interval_min="0ns"
--quiet="false" --recover="reconnect" --recovery_timeout="15mins" --registration_backoff_factor="10ms"
--resources="cpus:2;gpus:0;mem:1024;disk:1024;ports:[31000-32000]" --revocable_cpu_low_priority="true"
--runtime_dir="/tmp/Endpoint_SlaveEndpointTest_UnauthorizedRequest_1_Y9lWtL" --sandbox_directory="/mnt/mesos/sandbox"
--strict="true" --switch_user="true" --systemd_enable_support="true" --systemd_runtime_directory="/run/systemd/system"
--version="false" --work_dir="/tmp/Endpoint_SlaveEndpointTest_UnauthorizedRequest_1_ammrVM"
I0726 00:27:08.450384  3659 credentials.hpp:86] Loading credential for authentication from
'/tmp/Endpoint_SlaveEndpointTest_UnauthorizedRequest_1_Y9lWtL/credential'
I0726 00:27:08.450522  3659 slave.cpp:283] Agent using credential for: test-principal
I0726 00:27:08.450544  3659 credentials.hpp:37] Loading credentials for authentication from
'/tmp/Endpoint_SlaveEndpointTest_UnauthorizedRequest_1_Y9lWtL/http_credentials'
I0726 00:27:08.450749  3659 http.cpp:993] Creating default 'basic' HTTP authenticator for
realm 'mesos-agent-readonly'
I0726 00:27:08.450881  3659 http.cpp:993] Creating default 'basic' HTTP authenticator for
realm 'mesos-agent-readwrite'
I0726 00:27:08.452069  3659 slave.cpp:565] Agent resources: [{"name":"cpus","scalar":{"value":2.0},"type":"SCALAR"},{"name":"mem","scalar":{"value":1024.0},"type":"SCALAR"},{"name":"disk","scalar":{"value":1024.0},"type":"SCALAR"},{"name":"ports","ranges":{"range":[{"begin":31000,"end":32000}]},"type":"RANGES"}]
I0726 00:27:08.452282  3659 slave.cpp:573] Agent attributes: [  ]
I0726 00:27:08.452297  3659 slave.cpp:582] Agent hostname: c51831d9353e
I0726 00:27:08.452447  3654 status_update_manager.cpp:177] Pausing sending status updates
I0726 00:27:08.453852  3662 state.cpp:64] Recovering state from '/tmp/Endpoint_SlaveEndpointTest_UnauthorizedRequest_1_ammrVM/meta'
I0726 00:27:08.454121  3661 status_update_manager.cpp:203] Recovering status update manager
I0726 00:27:08.454298  3645 containerizer.cpp:582] Recovering containerizer
I0726 00:27:08.455286  3640 provisioner.cpp:416] Provisioner recovery complete
I0726 00:27:08.455682  3655 slave.cpp:6207] Finished recovery
I0726 00:27:08.456118  3655 slave.cpp:6389] Querying resource estimator for oversubscribable
resources
I0726 00:27:08.456316  3648 slave.cpp:6403] Received oversubscribable resources {} from the
resource estimator
I0726 00:27:08.458508  3647 process.cpp:3837] Handling HTTP event for process 'slave(798)'
with path: '/slave(798)/monitor/statistics.json'
I0726 00:27:08.459851  3660 http.cpp:1133] HTTP GET for /slave(798)/monitor/statistics.json
from 172.17.0.2:50706
I0726 00:27:08.459949  3660 http.cpp:957] Authorizing principal 'test-principal' to GET the
'/monitor/statistics.json' endpoint
I0726 00:27:08.461896  3650 slave.cpp:843] Agent terminating
[       OK ] Endpoint/SlaveEndpointTest.UnauthorizedRequest/1 (26 ms)
[ RUN      ] Endpoint/SlaveEndpointTest.UnauthorizedRequest/2
I0726 00:27:08.474834  3622 containerizer.cpp:230] Using isolation: posix/cpu,posix/mem,filesystem/posix,network/cni,environment_secret
W0726 00:27:08.475620  3622 backend.cpp:76] Failed to create 'aufs' backend: AufsBackend requires
root privileges
W0726 00:27:08.475759  3622 backend.cpp:76] Failed to create 'bind' backend: BindBackend requires
root privileges
I0726 00:27:08.475792  3622 provisioner.cpp:255] Using default backend 'copy'
I0726 00:27:08.480312  3656 slave.cpp:250] Mesos agent started on (799)@172.17.0.2:40540
I0726 00:27:08.480365  3656 slave.cpp:251] Flags at startup: --acls="" --appc_simple_discovery_uri_prefix="http://"
--appc_store_dir="/tmp/Endpoint_SlaveEndpointTest_UnauthorizedRequest_2_tEdEVF/store/appc"
--authenticate_http_readonly="true" --authenticate_http_readwrite="true" --authenticatee="crammd5"
--authentication_backoff_factor="1secs" --authorizer="local" --cgroups_cpu_enable_pids_and_tids_count="false"
--cgroups_enable_cfs="false" --cgroups_hierarchy="/sys/fs/cgroup" --cgroups_limit_swap="false"
--cgroups_root="mesos" --container_disk_watch_interval="15secs" --containerizers="mesos" --credential="/tmp/Endpoint_SlaveEndpointTest_UnauthorizedRequest_2_tEdEVF/credential"
--default_role="*" --disk_watch_interval="1mins" --docker="docker" --docker_kill_orphans="true"
--docker_registry="https://registry-1.docker.io" --docker_remove_delay="6hrs" --docker_socket="/var/run/docker.sock"
--docker_stop_timeout="0ns" --docker_store_dir="/tmp/Endpoint_SlaveEndpointTest_UnauthorizedRequest_2_tEdEVF/store/docker"
--docker_volume_checkpoint_dir="/var/run/mesos/isolators/docker/volume" --enforce_container_disk_quota="false"
--executor_registration_timeout="1mins" --executor_reregistration_timeout="2secs" --executor_shutdown_grace_period="5secs"
--fetcher_cache_dir="/tmp/Endpoint_SlaveEndpointTest_UnauthorizedRequest_2_tEdEVF/fetch" --fetcher_cache_size="2GB"
--frameworks_home="" --gc_delay="1weeks" --gc_disk_headroom="0.1" --hadoop_home="" --help="false"
--hostname_lookup="true" --http_command_executor="false" --http_credentials="/tmp/Endpoint_SlaveEndpointTest_UnauthorizedRequest_2_tEdEVF/http_credentials"
--http_heartbeat_interval="30secs" --initialize_driver_logging="true" --isolation="posix/cpu,posix/mem"
--launcher="posix" --launcher_dir="/mesos/mesos-1.4.0/_build/src" --logbufsecs="0" --logging_level="INFO"
--max_completed_executors_per_framework="150" --oversubscribed_resources_interval="15secs"
--perf_duration="10secs" --perf_interval="1mins" --port="5051" --qos_correction_interval_min="0ns"
--quiet="false" --recover="reconnect" --recovery_timeout="15mins" --registration_backoff_factor="10ms"
--resources="cpus:2;gpus:0;mem:1024;disk:1024;ports:[31000-32000]" --revocable_cpu_low_priority="true"
--runtime_dir="/tmp/Endpoint_SlaveEndpointTest_UnauthorizedRequest_2_tEdEVF" --sandbox_directory="/mnt/mesos/sandbox"
--strict="true" --switch_user="true" --systemd_enable_support="true" --systemd_runtime_directory="/run/systemd/system"
--version="false" --work_dir="/tmp/Endpoint_SlaveEndpointTest_UnauthorizedRequest_2_U2x3iH"
I0726 00:27:08.480942  3656 credentials.hpp:86] Loading credential for authentication from
'/tmp/Endpoint_SlaveEndpointTest_UnauthorizedRequest_2_tEdEVF/credential'
I0726 00:27:08.481127  3656 slave.cpp:283] Agent using credential for: test-principal
I0726 00:27:08.481158  3656 credentials.hpp:37] Loading credentials for authentication from
'/tmp/Endpoint_SlaveEndpointTest_UnauthorizedRequest_2_tEdEVF/http_credentials'
I0726 00:27:08.481480  3656 http.cpp:993] Creating default 'basic' HTTP authenticator for
realm 'mesos-agent-readonly'
I0726 00:27:08.481650  3656 http.cpp:993] Creating default 'basic' HTTP authenticator for
realm 'mesos-agent-readwrite'
I0726 00:27:08.483582  3656 slave.cpp:565] Agent resources: [{"name":"cpus","scalar":{"value":2.0},"type":"SCALAR"},{"name":"mem","scalar":{"value":1024.0},"type":"SCALAR"},{"name":"disk","scalar":{"value":1024.0},"type":"SCALAR"},{"name":"ports","ranges":{"range":[{"begin":31000,"end":32000}]},"type":"RANGES"}]
I0726 00:27:08.483870  3656 slave.cpp:573] Agent attributes: [  ]
I0726 00:27:08.483886  3656 slave.cpp:582] Agent hostname: c51831d9353e
I0726 00:27:08.483999  3661 status_update_manager.cpp:177] Pausing sending status updates
I0726 00:27:08.485334  3662 state.cpp:64] Recovering state from '/tmp/Endpoint_SlaveEndpointTest_UnauthorizedRequest_2_U2x3iH/meta'
I0726 00:27:08.485620  3655 status_update_manager.cpp:203] Recovering status update manager
I0726 00:27:08.485807  3652 containerizer.cpp:582] Recovering containerizer
I0726 00:27:08.487172  3651 provisioner.cpp:416] Provisioner recovery complete
I0726 00:27:08.487565  3644 slave.cpp:6207] Finished recovery
I0726 00:27:08.487978  3644 slave.cpp:6389] Querying resource estimator for oversubscribable
resources
I0726 00:27:08.488170  3646 slave.cpp:6403] Received oversubscribable resources {} from the
resource estimator
I0726 00:27:08.490262  3659 process.cpp:3837] Handling HTTP event for process 'slave(799)'
with path: '/slave(799)/containers'
I0726 00:27:08.491542  3656 http.cpp:1133] HTTP GET for /slave(799)/containers from 172.17.0.2:50708
I0726 00:27:08.491617  3656 http.cpp:957] Authorizing principal 'test-principal' to GET the
'/containers' endpoint
I0726 00:27:08.494190  3648 slave.cpp:843] Agent terminating
[       OK ] Endpoint/SlaveEndpointTest.UnauthorizedRequest/2 (32 ms)
[ RUN      ] Endpoint/SlaveEndpointTest.NoAuthorizer/0
I0726 00:27:08.504348  3622 containerizer.cpp:230] Using isolation: posix/cpu,posix/mem,filesystem/posix,network/cni,environment_secret
W0726 00:27:08.504830  3622 backend.cpp:76] Failed to create 'aufs' backend: AufsBackend requires
root privileges
W0726 00:27:08.504925  3622 backend.cpp:76] Failed to create 'bind' backend: BindBackend requires
root privileges
I0726 00:27:08.504957  3622 provisioner.cpp:255] Using default backend 'copy'
I0726 00:27:08.506518  3622 cluster.cpp:448] Creating default 'local' authorizer
I0726 00:27:08.507992  3640 slave.cpp:250] Mesos agent started on (800)@172.17.0.2:40540
I0726 00:27:08.508026  3640 slave.cpp:251] Flags at startup: --acls="" --appc_simple_discovery_uri_prefix="http://"
--appc_store_dir="/tmp/Endpoint_SlaveEndpointTest_NoAuthorizer_0_9l92FA/store/appc" --authenticate_http_readonly="true"
--authenticate_http_readwrite="true" --authenticatee="crammd5" --authentication_backoff_factor="1secs"
--authorizer="local" --cgroups_cpu_enable_pids_and_tids_count="false" --cgroups_enable_cfs="false"
--cgroups_hierarchy="/sys/fs/cgroup" --cgroups_limit_swap="false" --cgroups_root="mesos" --container_disk_watch_interval="15secs"
--containerizers="mesos" --credential="/tmp/Endpoint_SlaveEndpointTest_NoAuthorizer_0_9l92FA/credential"
--default_role="*" --disk_watch_interval="1mins" --docker="docker" --docker_kill_orphans="true"
--docker_registry="https://registry-1.docker.io" --docker_remove_delay="6hrs" --docker_socket="/var/run/docker.sock"
--docker_stop_timeout="0ns" --docker_store_dir="/tmp/Endpoint_SlaveEndpointTest_NoAuthorizer_0_9l92FA/store/docker"
--docker_volume_checkpoint_dir="/var/run/mesos/isolators/docker/volume" --enforce_container_disk_quota="false"
--executor_registration_timeout="1mins" --executor_reregistration_timeout="2secs" --executor_shutdown_grace_period="5secs"
--fetcher_cache_dir="/tmp/Endpoint_SlaveEndpointTest_NoAuthorizer_0_9l92FA/fetch" --fetcher_cache_size="2GB"
--frameworks_home="" --gc_delay="1weeks" --gc_disk_headroom="0.1" --hadoop_home="" --help="false"
--hostname_lookup="true" --http_command_executor="false" --http_credentials="/tmp/Endpoint_SlaveEndpointTest_NoAuthorizer_0_9l92FA/http_credentials"
--http_heartbeat_interval="30secs" --initialize_driver_logging="true" --isolation="posix/cpu,posix/mem"
--launcher="posix" --launcher_dir="/mesos/mesos-1.4.0/_build/src" --logbufsecs="0" --logging_level="INFO"
--max_completed_executors_per_framework="150" --oversubscribed_resources_interval="15secs"
--perf_duration="10secs" --perf_interval="1mins" --port="5051" --qos_correction_interval_min="0ns"
--quiet="false" --recover="reconnect" --recovery_timeout="15mins" --registration_backoff_factor="10ms"
--resources="cpus:2;gpus:0;mem:1024;disk:1024;ports:[31000-32000]" --revocable_cpu_low_priority="true"
--runtime_dir="/tmp/Endpoint_SlaveEndpointTest_NoAuthorizer_0_9l92FA" --sandbox_directory="/mnt/mesos/sandbox"
--strict="true" --switch_user="true" --systemd_enable_support="true" --systemd_runtime_directory="/run/systemd/system"
--version="false" --work_dir="/tmp/Endpoint_SlaveEndpointTest_NoAuthorizer_0_7CWRYB"
I0726 00:27:08.508376  3640 credentials.hpp:86] Loading credential for authentication from
'/tmp/Endpoint_SlaveEndpointTest_NoAuthorizer_0_9l92FA/credential'
I0726 00:27:08.508556  3640 slave.cpp:283] Agent using credential for: test-principal
I0726 00:27:08.508601  3640 credentials.hpp:37] Loading credentials for authentication from
'/tmp/Endpoint_SlaveEndpointTest_NoAuthorizer_0_9l92FA/http_credentials'
I0726 00:27:08.508842  3640 http.cpp:993] Creating default 'basic' HTTP authenticator for
realm 'mesos-agent-readonly'
I0726 00:27:08.509033  3640 http.cpp:993] Creating default 'basic' HTTP authenticator for
realm 'mesos-agent-readwrite'
I0726 00:27:08.510301  3640 slave.cpp:565] Agent resources: [{"name":"cpus","scalar":{"value":2.0},"type":"SCALAR"},{"name":"mem","scalar":{"value":1024.0},"type":"SCALAR"},{"name":"disk","scalar":{"value":1024.0},"type":"SCALAR"},{"name":"ports","ranges":{"range":[{"begin":31000,"end":32000}]},"type":"RANGES"}]
I0726 00:27:08.510520  3640 slave.cpp:573] Agent attributes: [  ]
I0726 00:27:08.510534  3640 slave.cpp:582] Agent hostname: c51831d9353e
I0726 00:27:08.510655  3658 status_update_manager.cpp:177] Pausing sending status updates
I0726 00:27:08.511925  3645 state.cpp:64] Recovering state from '/tmp/Endpoint_SlaveEndpointTest_NoAuthorizer_0_7CWRYB/meta'
I0726 00:27:08.512195  3653 status_update_manager.cpp:203] Recovering status update manager
I0726 00:27:08.512364  3654 containerizer.cpp:582] Recovering containerizer
I0726 00:27:08.513550  3652 provisioner.cpp:416] Provisioner recovery complete
I0726 00:27:08.513860  3655 slave.cpp:6207] Finished recovery
I0726 00:27:08.514274  3655 slave.cpp:6389] Querying resource estimator for oversubscribable
resources
I0726 00:27:08.514488  3643 slave.cpp:6403] Received oversubscribable resources {} from the
resource estimator
I0726 00:27:08.516770  3641 process.cpp:3837] Handling HTTP event for process 'slave(800)'
with path: '/slave(800)/monitor/statistics'
I0726 00:27:08.517880  3640 http.cpp:1133] HTTP GET for /slave(800)/monitor/statistics from
172.17.0.2:50710
I0726 00:27:08.517973  3640 http.cpp:957] Authorizing principal 'test-principal' to GET the
'/monitor/statistics' endpoint
I0726 00:27:08.521713  3662 slave.cpp:843] Agent terminating
[       OK ] Endpoint/SlaveEndpointTest.NoAuthorizer/0 (28 ms)
[ RUN      ] Endpoint/SlaveEndpointTest.NoAuthorizer/1
I0726 00:27:08.533061  3622 containerizer.cpp:230] Using isolation: posix/cpu,posix/mem,filesystem/posix,network/cni,environment_secret
W0726 00:27:08.533524  3622 backend.cpp:76] Failed to create 'aufs' backend: AufsBackend requires
root privileges
W0726 00:27:08.533614  3622 backend.cpp:76] Failed to create 'bind' backend: BindBackend requires
root privileges
I0726 00:27:08.533645  3622 provisioner.cpp:255] Using default backend 'copy'
I0726 00:27:08.535317  3622 cluster.cpp:448] Creating default 'local' authorizer
I0726 00:27:08.536834  3658 slave.cpp:250] Mesos agent started on (801)@172.17.0.2:40540
I0726 00:27:08.536870  3658 slave.cpp:251] Flags at startup: --acls="" --appc_simple_discovery_uri_prefix="http://"
--appc_store_dir="/tmp/Endpoint_SlaveEndpointTest_NoAuthorizer_1_PoJ4Gv/store/appc" --authenticate_http_readonly="true"
--authenticate_http_readwrite="true" --authenticatee="crammd5" --authentication_backoff_factor="1secs"
--authorizer="local" --cgroups_cpu_enable_pids_and_tids_count="false" --cgroups_enable_cfs="false"
--cgroups_hierarchy="/sys/fs/cgroup" --cgroups_limit_swap="false" --cgroups_root="mesos" --container_disk_watch_interval="15secs"
--containerizers="mesos" --credential="/tmp/Endpoint_SlaveEndpointTest_NoAuthorizer_1_PoJ4Gv/credential"
--default_role="*" --disk_watch_interval="1mins" --docker="docker" --docker_kill_orphans="true"
--docker_registry="https://registry-1.docker.io" --docker_remove_delay="6hrs" --docker_socket="/var/run/docker.sock"
--docker_stop_timeout="0ns" --docker_store_dir="/tmp/Endpoint_SlaveEndpointTest_NoAuthorizer_1_PoJ4Gv/store/docker"
--docker_volume_checkpoint_dir="/var/run/mesos/isolators/docker/volume" --enforce_container_disk_quota="false"
--executor_registration_timeout="1mins" --executor_reregistration_timeout="2secs" --executor_shutdown_grace_period="5secs"
--fetcher_cache_dir="/tmp/Endpoint_SlaveEndpointTest_NoAuthorizer_1_PoJ4Gv/fetch" --fetcher_cache_size="2GB"
--frameworks_home="" --gc_delay="1weeks" --gc_disk_headroom="0.1" --hadoop_home="" --help="false"
--hostname_lookup="true" --http_command_executor="false" --http_credentials="/tmp/Endpoint_SlaveEndpointTest_NoAuthorizer_1_PoJ4Gv/http_credentials"
--http_heartbeat_interval="30secs" --initialize_driver_logging="true" --isolation="posix/cpu,posix/mem"
--launcher="posix" --launcher_dir="/mesos/mesos-1.4.0/_build/src" --logbufsecs="0" --logging_level="INFO"
--max_completed_executors_per_framework="150" --oversubscribed_resources_interval="15secs"
--perf_duration="10secs" --perf_interval="1mins" --port="5051" --qos_correction_interval_min="0ns"
--quiet="false" --recover="reconnect" --recovery_timeout="15mins" --registration_backoff_factor="10ms"
--resources="cpus:2;gpus:0;mem:1024;disk:1024;ports:[31000-32000]" --revocable_cpu_low_priority="true"
--runtime_dir="/tmp/Endpoint_SlaveEndpointTest_NoAuthorizer_1_PoJ4Gv" --sandbox_directory="/mnt/mesos/sandbox"
--strict="true" --switch_user="true" --systemd_enable_support="true" --systemd_runtime_directory="/run/systemd/system"
--version="false" --work_dir="/tmp/Endpoint_SlaveEndpointTest_NoAuthorizer_1_tNiEVw"
I0726 00:27:08.537267  3658 credentials.hpp:86] Loading credential for authentication from
'/tmp/Endpoint_SlaveEndpointTest_NoAuthorizer_1_PoJ4Gv/credential'
I0726 00:27:08.537411  3658 slave.cpp:283] Agent using credential for: test-principal
I0726 00:27:08.537436  3658 credentials.hpp:37] Loading credentials for authentication from
'/tmp/Endpoint_SlaveEndpointTest_NoAuthorizer_1_PoJ4Gv/http_credentials'
I0726 00:27:08.537708  3658 http.cpp:993] Creating default 'basic' HTTP authenticator for
realm 'mesos-agent-readonly'
I0726 00:27:08.537838  3658 http.cpp:993] Creating default 'basic' HTTP authenticator for
realm 'mesos-agent-readwrite'
I0726 00:27:08.539165  3658 slave.cpp:565] Agent resources: [{"name":"cpus","scalar":{"value":2.0},"type":"SCALAR"},{"name":"mem","scalar":{"value":1024.0},"type":"SCALAR"},{"name":"disk","scalar":{"value":1024.0},"type":"SCALAR"},{"name":"ports","ranges":{"range":[{"begin":31000,"end":32000}]},"type":"RANGES"}]
I0726 00:27:08.539386  3658 slave.cpp:573] Agent attributes: [  ]
I0726 00:27:08.539402  3658 slave.cpp:582] Agent hostname: c51831d9353e
I0726 00:27:08.539526  3651 status_update_manager.cpp:177] Pausing sending status updates
I0726 00:27:08.540938  3650 state.cpp:64] Recovering state from '/tmp/Endpoint_SlaveEndpointTest_NoAuthorizer_1_tNiEVw/meta'
I0726 00:27:08.541203  3661 status_update_manager.cpp:203] Recovering status update manager
I0726 00:27:08.541395  3661 containerizer.cpp:582] Recovering containerizer
I0726 00:27:08.542683  3659 provisioner.cpp:416] Provisioner recovery complete
I0726 00:27:08.543040  3646 slave.cpp:6207] Finished recovery
I0726 00:27:08.543476  3646 slave.cpp:6389] Querying resource estimator for oversubscribable
resources
I0726 00:27:08.543678  3645 slave.cpp:6403] Received oversubscribable resources {} from the
resource estimator
I0726 00:27:08.545873  3651 process.cpp:3837] Handling HTTP event for process 'slave(801)'
with path: '/slave(801)/monitor/statistics.json'
I0726 00:27:08.547013  3662 http.cpp:1133] HTTP GET for /slave(801)/monitor/statistics.json
from 172.17.0.2:50712
I0726 00:27:08.547080  3662 http.cpp:957] Authorizing principal 'test-principal' to GET the
'/monitor/statistics.json' endpoint
I0726 00:27:08.550645  3643 slave.cpp:843] Agent terminating
[       OK ] Endpoint/SlaveEndpointTest.NoAuthorizer/1 (28 ms)
[ RUN      ] Endpoint/SlaveEndpointTest.NoAuthorizer/2
I0726 00:27:08.560595  3622 containerizer.cpp:230] Using isolation: posix/cpu,posix/mem,filesystem/posix,network/cni,environment_secret
W0726 00:27:08.561048  3622 backend.cpp:76] Failed to create 'aufs' backend: AufsBackend requires
root privileges
W0726 00:27:08.561143  3622 backend.cpp:76] Failed to create 'bind' backend: BindBackend requires
root privileges
I0726 00:27:08.561174  3622 provisioner.cpp:255] Using default backend 'copy'
I0726 00:27:08.562574  3622 cluster.cpp:448] Creating default 'local' authorizer
I0726 00:27:08.563884  3660 slave.cpp:250] Mesos agent started on (802)@172.17.0.2:40540
I0726 00:27:08.563915  3660 slave.cpp:251] Flags at startup: --acls="" --appc_simple_discovery_uri_prefix="http://"
--appc_store_dir="/tmp/Endpoint_SlaveEndpointTest_NoAuthorizer_2_wlwXYq/store/appc" --authenticate_http_readonly="true"
--authenticate_http_readwrite="true" --authenticatee="crammd5" --authentication_backoff_factor="1secs"
--authorizer="local" --cgroups_cpu_enable_pids_and_tids_count="false" --cgroups_enable_cfs="false"
--cgroups_hierarchy="/sys/fs/cgroup" --cgroups_limit_swap="false" --cgroups_root="mesos" --container_disk_watch_interval="15secs"
--containerizers="mesos" --credential="/tmp/Endpoint_SlaveEndpointTest_NoAuthorizer_2_wlwXYq/credential"
--default_role="*" --disk_watch_interval="1mins" --docker="docker" --docker_kill_orphans="true"
--docker_registry="https://registry-1.docker.io" --docker_remove_delay="6hrs" --docker_socket="/var/run/docker.sock"
--docker_stop_timeout="0ns" --docker_store_dir="/tmp/Endpoint_SlaveEndpointTest_NoAuthorizer_2_wlwXYq/store/docker"
--docker_volume_checkpoint_dir="/var/run/mesos/isolators/docker/volume" --enforce_container_disk_quota="false"
--executor_registration_timeout="1mins" --executor_reregistration_timeout="2secs" --executor_shutdown_grace_period="5secs"
--fetcher_cache_dir="/tmp/Endpoint_SlaveEndpointTest_NoAuthorizer_2_wlwXYq/fetch" --fetcher_cache_size="2GB"
--frameworks_home="" --gc_delay="1weeks" --gc_disk_headroom="0.1" --hadoop_home="" --help="false"
--hostname_lookup="true" --http_command_executor="false" --http_credentials="/tmp/Endpoint_SlaveEndpointTest_NoAuthorizer_2_wlwXYq/http_credentials"
--http_heartbeat_interval="30secs" --initialize_driver_logging="true" --isolation="posix/cpu,posix/mem"
--launcher="posix" --launcher_dir="/mesos/mesos-1.4.0/_build/src" --logbufsecs="0" --logging_level="INFO"
--max_completed_executors_per_framework="150" --oversubscribed_resources_interval="15secs"
--perf_duration="10secs" --perf_interval="1mins" --port="5051" --qos_correction_interval_min="0ns"
--quiet="false" --recover="reconnect" --recovery_timeout="15mins" --registration_backoff_factor="10ms"
--resources="cpus:2;gpus:0;mem:1024;disk:1024;ports:[31000-32000]" --revocable_cpu_low_priority="true"
--runtime_dir="/tmp/Endpoint_SlaveEndpointTest_NoAuthorizer_2_wlwXYq" --sandbox_directory="/mnt/mesos/sandbox"
--strict="true" --switch_user="true" --systemd_enable_support="true" --systemd_runtime_directory="/run/systemd/system"
--version="false" --work_dir="/tmp/Endpoint_SlaveEndpointTest_NoAuthorizer_2_ILVm9r"
I0726 00:27:08.564330  3660 credentials.hpp:86] Loading credential for authentication from
'/tmp/Endpoint_SlaveEndpointTest_NoAuthorizer_2_wlwXYq/credential'
I0726 00:27:08.564466  3660 slave.cpp:283] Agent using credential for: test-principal
I0726 00:27:08.564488  3660 credentials.hpp:37] Loading credentials for authentication from
'/tmp/Endpoint_SlaveEndpointTest_NoAuthorizer_2_wlwXYq/http_credentials'
I0726 00:27:08.564736  3660 http.cpp:993] Creating default 'basic' HTTP authenticator for
realm 'mesos-agent-readonly'
I0726 00:27:08.564889  3660 http.cpp:993] Creating default 'basic' HTTP authenticator for
realm 'mesos-agent-readwrite'
I0726 00:27:08.566134  3660 slave.cpp:565] Agent resources: [{"name":"cpus","scalar":{"value":2.0},"type":"SCALAR"},{"name":"mem","scalar":{"value":1024.0},"type":"SCALAR"},{"name":"disk","scalar":{"value":1024.0},"type":"SCALAR"},{"name":"ports","ranges":{"range":[{"begin":31000,"end":32000}]},"type":"RANGES"}]
I0726 00:27:08.566354  3660 slave.cpp:573] Agent attributes: [  ]
I0726 00:27:08.566368  3660 slave.cpp:582] Agent hostname: c51831d9353e
I0726 00:27:08.566551  3640 status_update_manager.cpp:177] Pausing sending status updates
I0726 00:27:08.567889  3642 state.cpp:64] Recovering state from '/tmp/Endpoint_SlaveEndpointTest_NoAuthorizer_2_ILVm9r/meta'
I0726 00:27:08.568183  3656 status_update_manager.cpp:203] Recovering status update manager
I0726 00:27:08.568362  3647 containerizer.cpp:582] Recovering containerizer
I0726 00:27:08.569787  3643 provisioner.cpp:416] Provisioner recovery complete
I0726 00:27:08.570118  3654 slave.cpp:6207] Finished recovery
I0726 00:27:08.570593  3654 slave.cpp:6389] Querying resource estimator for oversubscribable
resources
I0726 00:27:08.570788  3651 slave.cpp:6403] Received oversubscribable resources {} from the
resource estimator
I0726 00:27:08.573099  3641 process.cpp:3837] Handling HTTP event for process 'slave(802)'
with path: '/slave(802)/containers'
I0726 00:27:08.574156  3660 http.cpp:1133] HTTP GET for /slave(802)/containers from 172.17.0.2:50714
I0726 00:27:08.574226  3660 http.cpp:957] Authorizing principal 'test-principal' to GET the
'/containers' endpoint
I0726 00:27:08.577366  3648 slave.cpp:843] Agent terminating
[       OK ] Endpoint/SlaveEndpointTest.NoAuthorizer/2 (28 ms)
[----------] 9 tests from Endpoint/SlaveEndpointTest (254 ms total)

[----------] Global test environment tear-down
[==========] 1639 tests from 179 test cases ran. (589324 ms total)
[  PASSED  ] 1638 tests.
[  FAILED  ] 1 test, listed below:
[  FAILED  ] bool/MasterTestPrePostReservationRefinement.ReserveAndUnreserveResourcesV1/1,
where GetParam() = false

 1 FAILED TEST
  YOU HAVE 20 DISABLED TESTS

I0726 00:27:08.653041  3664 process.cpp:1006] Failed to accept socket: future discarded
make[4]: *** [check-local] Error 1
make[4]: Leaving directory `/mesos/mesos-1.4.0/_build/src'
make[3]: *** [check-am] Error 2
make[3]: Leaving directory `/mesos/mesos-1.4.0/_build/src'
make[2]: *** [check] Error 2
make[2]: Leaving directory `/mesos/mesos-1.4.0/_build/src'
make[1]: *** [check-recursive] Error 1
make[1]: Leaving directory `/mesos/mesos-1.4.0/_build'
make: *** [distcheck] Error 1
+ docker rmi mesos-1501025929-16435
Untagged: mesos-1501025929-16435:latest
Deleted: sha256:5c1faa731c07978563fcdaa99280c0be523afb87e87a089511e5ccc85c161a2f
Deleted: sha256:34d21a05db3f94fa5384316f6cff03dea3c441b7456a4ed3d2e8b198be112b42
Deleted: sha256:46403945ec0518b1fd5478e39a48e764b0a0b15b5bb4d613bf8172d6d2f17bdf
Deleted: sha256:46a2ece563d6c1bda9fc9b65ceb143b8e3921b0e6ffd66b322983e3d5e826271
Deleted: sha256:fa491b672b4307058625b145573b09b94047f8efbc3e7a0f3437dc4033e3b347
Deleted: sha256:cb9dff497aa4cbaa616ac4d7ec02ba854dafd31edad11cdc90b2e1a8a80e22cc
Deleted: sha256:dc2050b8e72edd9d80872478a7acdc26f8a758cb79e0d9f97ddde8792d326208
Deleted: sha256:b4f60369a0ff49004fa303c0f29fa17c460ed76140aaec7a0df758cf2b221639
Deleted: sha256:08f547101857e4f99c8988b9aafe6233c178b1d243904af410f91e4e3f856d7a
Deleted: sha256:1d763640eeb7599f9dce1a2e65f14d011615bea57dc04375c82673a0cdfa6f20
Deleted: sha256:4cd6c538be53109322be2b409440cfb7717f68d50361264332538036f4119187
Deleted: sha256:8b4ca38ac1ea4f794f3a6f64beef82e21bd65b4a9dc8245351477ef6ec910e85
Deleted: sha256:4b5606b36825a9997d66c9b2798285f40c479166160e84f3b9d6c228f7f515fd
Deleted: sha256:78f98e9fdfd1fee7733246f176cf4797c3683b5a20b3592ba116393cbcd06ce8
Deleted: sha256:921a0dd1b6c5f959f4f5997e7a5a06bf82e16594192312582b2eb45cd27cf229
Deleted: sha256:c21cdea0c1bdca0e0504403aa01168b855aec2f71d9a9a6e0f64361d8839071e
Deleted: sha256:416aef4188ccc2a06346175f4e52fbea29ada9f3d925b9690b93036e45312d7a
Deleted: sha256:aceef6f7b12c40802883d3d661df235cc3d94debc87014bfca064c651082b161
Deleted: sha256:9b2bb47f1f18df498a4f74959c2b7d8b9ee74a8b830b76e9f0346afd0cd58345
Deleted: sha256:2ab6c7422452d400f7857fd322bd42c96b4e9f89fb56749764924141a7315240
Deleted: sha256:f4c8e25ea45e5870465ef79c4066817d5c95418fbf0b3a91dc208da67c683c19
Deleted: sha256:0694bdee134f2dcc0aa5cee04b4a9806a5c21dbbe557755fec19cf0302c3ac06
Deleted: sha256:dc4fe43054489250ff53167b732afb7aca943826527c3de78b50abc11339f821
Deleted: sha256:9d0e27fae6554374955988a8a60ddda9dcc3e6bcb20d1418e3f2c8be71889b36
Build step 'Execute shell' marked build as failure
Not sending mail to unregistered user xujyan@apple.com

Mime
View raw message