mesos-builds mailing list archives

Site index · List index
Message view « Date » · « Thread »
Top « Date » · « Thread »
From Apache Jenkins Server <jenk...@builds.apache.org>
Subject Build failed in Jenkins: Mesos-Buildbot » autotools,clang,--verbose --enable-libevent --enable-ssl,GLOG_v=1 MESOS_VERBOSE=1,ubuntu:14.04,(ubuntu)&&(!ubuntu-us1)&&(!ubuntu-eu2) #3855
Date Sat, 01 Jul 2017 04:57:18 GMT
See <https://builds.apache.org/job/Mesos-Buildbot/BUILDTOOL=autotools,COMPILER=clang,CONFIGURATION=--verbose%20--enable-libevent%20--enable-ssl,ENVIRONMENT=GLOG_v=1%20MESOS_VERBOSE=1,OS=ubuntu%3A14.04,label_exp=(ubuntu)&&(!ubuntu-us1)&&(!ubuntu-eu2)/3855/display/redirect?page=changes>

Changes:

[kapil] Removed core file during distclean.

[yujie.jay] Removed an unused declaration in type_utils.hpp.

[yujie.jay] Added stubs for the resource provider driver.

[yujie.jay] Added devolve functions for resource provider Event/Call.

[yujie.jay] Added stubs for storage local resource provider.

[yujie.jay] Added stubs for the ResourceProviderManager.

[yujie.jay] Added 'type' and 'name' fields to ResourceProviderInfo.

[yujie.jay] Introduced a streaming function for a vector.

[yujie.jay] Added streaming function for ResourceProviderInfo.

[yujie.jay] Added agent `--resource_provider_config_dir` flag.

[yujie.jay] Added agent endpoint for local resource providers.

[yujie.jay] Added stubs for local resource provider daemon.

[yujie.jay] Added ResourceProviderMessage for the manager.

[yujie.jay] Added local resource provider daemon initialization logic.

------------------------------------------
[...truncated 30.56 MB...]
I0701 04:57:05.311470 24121 process.cpp:3779] Handling HTTP event for process 'slave(778)'
with path: '/slave(778)/containers'
I0701 04:57:05.313210 24126 http.cpp:1114] HTTP GET for /slave(778)/containers from 172.17.0.5:32920
I0701 04:57:05.313288 24126 http.cpp:935] Authorizing principal 'test-principal' to GET the
'/containers' endpoint
I0701 04:57:05.317672 24117 slave.cpp:839] Agent terminating
[       OK ] Endpoint/SlaveEndpointTest.AuthorizedRequest/2 (36 ms)
[ RUN      ] Endpoint/SlaveEndpointTest.UnauthorizedRequest/0
I0701 04:57:05.330838  5634 containerizer.cpp:230] Using isolation: posix/cpu,posix/mem,filesystem/posix,network/cni,environment_secret
W0701 04:57:05.331444  5634 backend.cpp:76] Failed to create 'aufs' backend: AufsBackend requires
root privileges
W0701 04:57:05.331579  5634 backend.cpp:76] Failed to create 'bind' backend: BindBackend requires
root privileges
I0701 04:57:05.331627  5634 provisioner.cpp:255] Using default backend 'copy'
I0701 04:57:05.335139 24128 slave.cpp:250] Mesos agent started on (779)@172.17.0.5:41030
I0701 04:57:05.335209 24128 slave.cpp:251] Flags at startup: --acls="" --appc_simple_discovery_uri_prefix="http://"
--appc_store_dir="/tmp/Endpoint_SlaveEndpointTest_UnauthorizedRequest_0_3jKUjH/store/appc"
--authenticate_http_executors="true" --authenticate_http_readonly="true" --authenticate_http_readwrite="true"
--authenticatee="crammd5" --authentication_backoff_factor="1secs" --authorizer="local" --cgroups_cpu_enable_pids_and_tids_count="false"
--cgroups_enable_cfs="false" --cgroups_hierarchy="/sys/fs/cgroup" --cgroups_limit_swap="false"
--cgroups_root="mesos" --container_disk_watch_interval="15secs" --containerizers="mesos" --credential="/tmp/Endpoint_SlaveEndpointTest_UnauthorizedRequest_0_3jKUjH/credential"
--default_role="*" --disk_watch_interval="1mins" --docker="docker" --docker_kill_orphans="true"
--docker_registry="https://registry-1.docker.io" --docker_remove_delay="6hrs" --docker_socket="/var/run/docker.sock"
--docker_stop_timeout="0ns" --docker_store_dir="/tmp/Endpoint_SlaveEndpointTest_UnauthorizedRequest_0_3jKUjH/store/docker"
--docker_volume_checkpoint_dir="/var/run/mesos/isolators/docker/volume" --enforce_container_disk_quota="false"
--executor_registration_timeout="1mins" --executor_reregistration_timeout="2secs" --executor_secret_key="/tmp/Endpoint_SlaveEndpointTest_UnauthorizedRequest_0_3jKUjH/executor_secret_key"
--executor_shutdown_grace_period="5secs" --fetcher_cache_dir="/tmp/Endpoint_SlaveEndpointTest_UnauthorizedRequest_0_3jKUjH/fetch"
--fetcher_cache_size="2GB" --frameworks_home="" --gc_delay="1weeks" --gc_disk_headroom="0.1"
--hadoop_home="" --help="false" --hostname_lookup="true" --http_command_executor="false" --http_credentials="/tmp/Endpoint_SlaveEndpointTest_UnauthorizedRequest_0_3jKUjH/http_credentials"
--http_heartbeat_interval="30secs" --initialize_driver_logging="true" --isolation="posix/cpu,posix/mem"
--launcher="posix" --launcher_dir="/mesos/mesos-1.4.0/_build/src" --logbufsecs="0" --logging_level="INFO"
--max_completed_executors_per_framework="150" --oversubscribed_resources_interval="15secs"
--perf_duration="10secs" --perf_interval="1mins" --port="5051" --qos_correction_interval_min="0ns"
--quiet="false" --recover="reconnect" --recovery_timeout="15mins" --registration_backoff_factor="10ms"
--resources="cpus:2;gpus:0;mem:1024;disk:1024;ports:[31000-32000]" --revocable_cpu_low_priority="true"
--runtime_dir="/tmp/Endpoint_SlaveEndpointTest_UnauthorizedRequest_0_3jKUjH" --sandbox_directory="/mnt/mesos/sandbox"
--strict="true" --switch_user="true" --systemd_enable_support="true" --systemd_runtime_directory="/run/systemd/system"
--version="false" --work_dir="/tmp/Endpoint_SlaveEndpointTest_UnauthorizedRequest_0_LCaT8E"
I0701 04:57:05.335891 24128 credentials.hpp:86] Loading credential for authentication from
'/tmp/Endpoint_SlaveEndpointTest_UnauthorizedRequest_0_3jKUjH/credential'
I0701 04:57:05.336138 24128 slave.cpp:283] Agent using credential for: test-principal
I0701 04:57:05.336169 24128 credentials.hpp:37] Loading credentials for authentication from
'/tmp/Endpoint_SlaveEndpointTest_UnauthorizedRequest_0_3jKUjH/http_credentials'
I0701 04:57:05.336495 24128 http.cpp:974] Creating default 'basic' HTTP authenticator for
realm 'mesos-agent-executor'
I0701 04:57:05.336652 24128 http.cpp:995] Creating default 'jwt' HTTP authenticator for realm
'mesos-agent-executor'
I0701 04:57:05.337009 24128 http.cpp:974] Creating default 'basic' HTTP authenticator for
realm 'mesos-agent-readonly'
I0701 04:57:05.337163 24128 http.cpp:995] Creating default 'jwt' HTTP authenticator for realm
'mesos-agent-readonly'
I0701 04:57:05.337443 24128 http.cpp:974] Creating default 'basic' HTTP authenticator for
realm 'mesos-agent-readwrite'
I0701 04:57:05.337585 24128 http.cpp:995] Creating default 'jwt' HTTP authenticator for realm
'mesos-agent-readwrite'
I0701 04:57:05.338889 24128 slave.cpp:565] Agent resources: [{"name":"cpus","scalar":{"value":2.0},"type":"SCALAR"},{"name":"mem","scalar":{"value":1024.0},"type":"SCALAR"},{"name":"disk","scalar":{"value":1024.0},"type":"SCALAR"},{"name":"ports","ranges":{"range":[{"begin":31000,"end":32000}]},"type":"RANGES"}]
I0701 04:57:05.339097 24128 slave.cpp:573] Agent attributes: [  ]
I0701 04:57:05.339110 24128 slave.cpp:578] Agent hostname: 9e697cf0c7e4
I0701 04:57:05.339233 24120 status_update_manager.cpp:177] Pausing sending status updates
I0701 04:57:05.340760 24119 state.cpp:64] Recovering state from '/tmp/Endpoint_SlaveEndpointTest_UnauthorizedRequest_0_LCaT8E/meta'
I0701 04:57:05.341078 24121 status_update_manager.cpp:203] Recovering status update manager
I0701 04:57:05.341423 24118 containerizer.cpp:582] Recovering containerizer
I0701 04:57:05.342866 24122 provisioner.cpp:416] Provisioner recovery complete
I0701 04:57:05.343276 24126 slave.cpp:6189] Finished recovery
I0701 04:57:05.343755 24126 slave.cpp:6371] Querying resource estimator for oversubscribable
resources
I0701 04:57:05.344012 24117 slave.cpp:6385] Received oversubscribable resources {} from the
resource estimator
I0701 04:57:05.346273 24126 process.cpp:3779] Handling HTTP event for process 'slave(779)'
with path: '/slave(779)/monitor/statistics'
I0701 04:57:05.348167 24129 http.cpp:1114] HTTP GET for /slave(779)/monitor/statistics from
172.17.0.5:32921
I0701 04:57:05.348258 24129 http.cpp:935] Authorizing principal 'test-principal' to GET the
'/monitor/statistics' endpoint
I0701 04:57:05.350224 24125 slave.cpp:839] Agent terminating
[       OK ] Endpoint/SlaveEndpointTest.UnauthorizedRequest/0 (31 ms)
[ RUN      ] Endpoint/SlaveEndpointTest.UnauthorizedRequest/1
I0701 04:57:05.360823  5634 containerizer.cpp:230] Using isolation: posix/cpu,posix/mem,filesystem/posix,network/cni,environment_secret
W0701 04:57:05.361359  5634 backend.cpp:76] Failed to create 'aufs' backend: AufsBackend requires
root privileges
W0701 04:57:05.361487  5634 backend.cpp:76] Failed to create 'bind' backend: BindBackend requires
root privileges
I0701 04:57:05.361552  5634 provisioner.cpp:255] Using default backend 'copy'
I0701 04:57:05.365288 24128 slave.cpp:250] Mesos agent started on (780)@172.17.0.5:41030
I0701 04:57:05.365329 24128 slave.cpp:251] Flags at startup: --acls="" --appc_simple_discovery_uri_prefix="http://"
--appc_store_dir="/tmp/Endpoint_SlaveEndpointTest_UnauthorizedRequest_1_JwTejQ/store/appc"
--authenticate_http_executors="true" --authenticate_http_readonly="true" --authenticate_http_readwrite="true"
--authenticatee="crammd5" --authentication_backoff_factor="1secs" --authorizer="local" --cgroups_cpu_enable_pids_and_tids_count="false"
--cgroups_enable_cfs="false" --cgroups_hierarchy="/sys/fs/cgroup" --cgroups_limit_swap="false"
--cgroups_root="mesos" --container_disk_watch_interval="15secs" --containerizers="mesos" --credential="/tmp/Endpoint_SlaveEndpointTest_UnauthorizedRequest_1_JwTejQ/credential"
--default_role="*" --disk_watch_interval="1mins" --docker="docker" --docker_kill_orphans="true"
--docker_registry="https://registry-1.docker.io" --docker_remove_delay="6hrs" --docker_socket="/var/run/docker.sock"
--docker_stop_timeout="0ns" --docker_store_dir="/tmp/Endpoint_SlaveEndpointTest_UnauthorizedRequest_1_JwTejQ/store/docker"
--docker_volume_checkpoint_dir="/var/run/mesos/isolators/docker/volume" --enforce_container_disk_quota="false"
--executor_registration_timeout="1mins" --executor_reregistration_timeout="2secs" --executor_secret_key="/tmp/Endpoint_SlaveEndpointTest_UnauthorizedRequest_1_JwTejQ/executor_secret_key"
--executor_shutdown_grace_period="5secs" --fetcher_cache_dir="/tmp/Endpoint_SlaveEndpointTest_UnauthorizedRequest_1_JwTejQ/fetch"
--fetcher_cache_size="2GB" --frameworks_home="" --gc_delay="1weeks" --gc_disk_headroom="0.1"
--hadoop_home="" --help="false" --hostname_lookup="true" --http_command_executor="false" --http_credentials="/tmp/Endpoint_SlaveEndpointTest_UnauthorizedRequest_1_JwTejQ/http_credentials"
--http_heartbeat_interval="30secs" --initialize_driver_logging="true" --isolation="posix/cpu,posix/mem"
--launcher="posix" --launcher_dir="/mesos/mesos-1.4.0/_build/src" --logbufsecs="0" --logging_level="INFO"
--max_completed_executors_per_framework="150" --oversubscribed_resources_interval="15secs"
--perf_duration="10secs" --perf_interval="1mins" --port="5051" --qos_correction_interval_min="0ns"
--quiet="false" --recover="reconnect" --recovery_timeout="15mins" --registration_backoff_factor="10ms"
--resources="cpus:2;gpus:0;mem:1024;disk:1024;ports:[31000-32000]" --revocable_cpu_low_priority="true"
--runtime_dir="/tmp/Endpoint_SlaveEndpointTest_UnauthorizedRequest_1_JwTejQ" --sandbox_directory="/mnt/mesos/sandbox"
--strict="true" --switch_user="true" --systemd_enable_support="true" --systemd_runtime_directory="/run/systemd/system"
--version="false" --work_dir="/tmp/Endpoint_SlaveEndpointTest_UnauthorizedRequest_1_5Noe3N"
I0701 04:57:05.365794 24128 credentials.hpp:86] Loading credential for authentication from
'/tmp/Endpoint_SlaveEndpointTest_UnauthorizedRequest_1_JwTejQ/credential'
I0701 04:57:05.365928 24128 slave.cpp:283] Agent using credential for: test-principal
I0701 04:57:05.365949 24128 credentials.hpp:37] Loading credentials for authentication from
'/tmp/Endpoint_SlaveEndpointTest_UnauthorizedRequest_1_JwTejQ/http_credentials'
I0701 04:57:05.366192 24128 http.cpp:974] Creating default 'basic' HTTP authenticator for
realm 'mesos-agent-executor'
I0701 04:57:05.366289 24128 http.cpp:995] Creating default 'jwt' HTTP authenticator for realm
'mesos-agent-executor'
I0701 04:57:05.366509 24128 http.cpp:974] Creating default 'basic' HTTP authenticator for
realm 'mesos-agent-readonly'
I0701 04:57:05.366626 24128 http.cpp:995] Creating default 'jwt' HTTP authenticator for realm
'mesos-agent-readonly'
I0701 04:57:05.366878 24128 http.cpp:974] Creating default 'basic' HTTP authenticator for
realm 'mesos-agent-readwrite'
I0701 04:57:05.367009 24128 http.cpp:995] Creating default 'jwt' HTTP authenticator for realm
'mesos-agent-readwrite'
I0701 04:57:05.368396 24128 slave.cpp:565] Agent resources: [{"name":"cpus","scalar":{"value":2.0},"type":"SCALAR"},{"name":"mem","scalar":{"value":1024.0},"type":"SCALAR"},{"name":"disk","scalar":{"value":1024.0},"type":"SCALAR"},{"name":"ports","ranges":{"range":[{"begin":31000,"end":32000}]},"type":"RANGES"}]
I0701 04:57:05.368592 24128 slave.cpp:573] Agent attributes: [  ]
I0701 04:57:05.368607 24128 slave.cpp:578] Agent hostname: 9e697cf0c7e4
I0701 04:57:05.368741 24131 status_update_manager.cpp:177] Pausing sending status updates
I0701 04:57:05.369896 24131 state.cpp:64] Recovering state from '/tmp/Endpoint_SlaveEndpointTest_UnauthorizedRequest_1_5Noe3N/meta'
I0701 04:57:05.370175 24128 status_update_manager.cpp:203] Recovering status update manager
I0701 04:57:05.370616 24124 containerizer.cpp:582] Recovering containerizer
I0701 04:57:05.372072 24129 provisioner.cpp:416] Provisioner recovery complete
I0701 04:57:05.372467 24130 slave.cpp:6189] Finished recovery
I0701 04:57:05.373087 24130 slave.cpp:6371] Querying resource estimator for oversubscribable
resources
I0701 04:57:05.373308 24121 slave.cpp:6385] Received oversubscribable resources {} from the
resource estimator
I0701 04:57:05.375696 24126 process.cpp:3779] Handling HTTP event for process 'slave(780)'
with path: '/slave(780)/monitor/statistics.json'
I0701 04:57:05.377728 24122 http.cpp:1114] HTTP GET for /slave(780)/monitor/statistics.json
from 172.17.0.5:32923
I0701 04:57:05.377832 24122 http.cpp:935] Authorizing principal 'test-principal' to GET the
'/monitor/statistics.json' endpoint
I0701 04:57:05.379767 24119 slave.cpp:839] Agent terminating
[       OK ] Endpoint/SlaveEndpointTest.UnauthorizedRequest/1 (28 ms)
[ RUN      ] Endpoint/SlaveEndpointTest.UnauthorizedRequest/2
I0701 04:57:05.393640  5634 containerizer.cpp:230] Using isolation: posix/cpu,posix/mem,filesystem/posix,network/cni,environment_secret
W0701 04:57:05.394160  5634 backend.cpp:76] Failed to create 'aufs' backend: AufsBackend requires
root privileges
W0701 04:57:05.394269  5634 backend.cpp:76] Failed to create 'bind' backend: BindBackend requires
root privileges
I0701 04:57:05.394314  5634 provisioner.cpp:255] Using default backend 'copy'
I0701 04:57:05.398159 24117 slave.cpp:250] Mesos agent started on (781)@172.17.0.5:41030
I0701 04:57:05.398197 24117 slave.cpp:251] Flags at startup: --acls="" --appc_simple_discovery_uri_prefix="http://"
--appc_store_dir="/tmp/Endpoint_SlaveEndpointTest_UnauthorizedRequest_2_HG26CZ/store/appc"
--authenticate_http_executors="true" --authenticate_http_readonly="true" --authenticate_http_readwrite="true"
--authenticatee="crammd5" --authentication_backoff_factor="1secs" --authorizer="local" --cgroups_cpu_enable_pids_and_tids_count="false"
--cgroups_enable_cfs="false" --cgroups_hierarchy="/sys/fs/cgroup" --cgroups_limit_swap="false"
--cgroups_root="mesos" --container_disk_watch_interval="15secs" --containerizers="mesos" --credential="/tmp/Endpoint_SlaveEndpointTest_UnauthorizedRequest_2_HG26CZ/credential"
--default_role="*" --disk_watch_interval="1mins" --docker="docker" --docker_kill_orphans="true"
--docker_registry="https://registry-1.docker.io" --docker_remove_delay="6hrs" --docker_socket="/var/run/docker.sock"
--docker_stop_timeout="0ns" --docker_store_dir="/tmp/Endpoint_SlaveEndpointTest_UnauthorizedRequest_2_HG26CZ/store/docker"
--docker_volume_checkpoint_dir="/var/run/mesos/isolators/docker/volume" --enforce_container_disk_quota="false"
--executor_registration_timeout="1mins" --executor_reregistration_timeout="2secs" --executor_secret_key="/tmp/Endpoint_SlaveEndpointTest_UnauthorizedRequest_2_HG26CZ/executor_secret_key"
--executor_shutdown_grace_period="5secs" --fetcher_cache_dir="/tmp/Endpoint_SlaveEndpointTest_UnauthorizedRequest_2_HG26CZ/fetch"
--fetcher_cache_size="2GB" --frameworks_home="" --gc_delay="1weeks" --gc_disk_headroom="0.1"
--hadoop_home="" --help="false" --hostname_lookup="true" --http_command_executor="false" --http_credentials="/tmp/Endpoint_SlaveEndpointTest_UnauthorizedRequest_2_HG26CZ/http_credentials"
--http_heartbeat_interval="30secs" --initialize_driver_logging="true" --isolation="posix/cpu,posix/mem"
--launcher="posix" --launcher_dir="/mesos/mesos-1.4.0/_build/src" --logbufsecs="0" --logging_level="INFO"
--max_completed_executors_per_framework="150" --oversubscribed_resources_interval="15secs"
--perf_duration="10secs" --perf_interval="1mins" --port="5051" --qos_correction_interval_min="0ns"
--quiet="false" --recover="reconnect" --recovery_timeout="15mins" --registration_backoff_factor="10ms"
--resources="cpus:2;gpus:0;mem:1024;disk:1024;ports:[31000-32000]" --revocable_cpu_low_priority="true"
--runtime_dir="/tmp/Endpoint_SlaveEndpointTest_UnauthorizedRequest_2_HG26CZ" --sandbox_directory="/mnt/mesos/sandbox"
--strict="true" --switch_user="true" --systemd_enable_support="true" --systemd_runtime_directory="/run/systemd/system"
--version="false" --work_dir="/tmp/Endpoint_SlaveEndpointTest_UnauthorizedRequest_2_zduPhX"
I0701 04:57:05.398807 24117 credentials.hpp:86] Loading credential for authentication from
'/tmp/Endpoint_SlaveEndpointTest_UnauthorizedRequest_2_HG26CZ/credential'
I0701 04:57:05.398969 24117 slave.cpp:283] Agent using credential for: test-principal
I0701 04:57:05.398990 24117 credentials.hpp:37] Loading credentials for authentication from
'/tmp/Endpoint_SlaveEndpointTest_UnauthorizedRequest_2_HG26CZ/http_credentials'
I0701 04:57:05.399241 24117 http.cpp:974] Creating default 'basic' HTTP authenticator for
realm 'mesos-agent-executor'
I0701 04:57:05.399338 24117 http.cpp:995] Creating default 'jwt' HTTP authenticator for realm
'mesos-agent-executor'
I0701 04:57:05.399678 24117 http.cpp:974] Creating default 'basic' HTTP authenticator for
realm 'mesos-agent-readonly'
I0701 04:57:05.399816 24117 http.cpp:995] Creating default 'jwt' HTTP authenticator for realm
'mesos-agent-readonly'
I0701 04:57:05.400063 24117 http.cpp:974] Creating default 'basic' HTTP authenticator for
realm 'mesos-agent-readwrite'
I0701 04:57:05.400178 24117 http.cpp:995] Creating default 'jwt' HTTP authenticator for realm
'mesos-agent-readwrite'
I0701 04:57:05.401473 24117 slave.cpp:565] Agent resources: [{"name":"cpus","scalar":{"value":2.0},"type":"SCALAR"},{"name":"mem","scalar":{"value":1024.0},"type":"SCALAR"},{"name":"disk","scalar":{"value":1024.0},"type":"SCALAR"},{"name":"ports","ranges":{"range":[{"begin":31000,"end":32000}]},"type":"RANGES"}]
I0701 04:57:05.401734 24117 slave.cpp:573] Agent attributes: [  ]
I0701 04:57:05.401748 24117 slave.cpp:578] Agent hostname: 9e697cf0c7e4
I0701 04:57:05.401875 24124 status_update_manager.cpp:177] Pausing sending status updates
I0701 04:57:05.402909 24124 state.cpp:64] Recovering state from '/tmp/Endpoint_SlaveEndpointTest_UnauthorizedRequest_2_zduPhX/meta'
I0701 04:57:05.403193 24127 status_update_manager.cpp:203] Recovering status update manager
I0701 04:57:05.403357 24117 containerizer.cpp:582] Recovering containerizer
I0701 04:57:05.404538 24129 provisioner.cpp:416] Provisioner recovery complete
I0701 04:57:05.404880 24118 slave.cpp:6189] Finished recovery
I0701 04:57:05.405335 24118 slave.cpp:6371] Querying resource estimator for oversubscribable
resources
I0701 04:57:05.405678 24124 slave.cpp:6385] Received oversubscribable resources {} from the
resource estimator
I0701 04:57:05.408344 24122 process.cpp:3779] Handling HTTP event for process 'slave(781)'
with path: '/slave(781)/containers'
I0701 04:57:05.410470 24129 http.cpp:1114] HTTP GET for /slave(781)/containers from 172.17.0.5:32924
I0701 04:57:05.410554 24129 http.cpp:935] Authorizing principal 'test-principal' to GET the
'/containers' endpoint
I0701 04:57:05.413373 24126 slave.cpp:839] Agent terminating
[       OK ] Endpoint/SlaveEndpointTest.UnauthorizedRequest/2 (32 ms)
[ RUN      ] Endpoint/SlaveEndpointTest.NoAuthorizer/0
I0701 04:57:05.427623  5634 containerizer.cpp:230] Using isolation: posix/cpu,posix/mem,filesystem/posix,network/cni,environment_secret
W0701 04:57:05.428254  5634 backend.cpp:76] Failed to create 'aufs' backend: AufsBackend requires
root privileges
W0701 04:57:05.428381  5634 backend.cpp:76] Failed to create 'bind' backend: BindBackend requires
root privileges
I0701 04:57:05.428431  5634 provisioner.cpp:255] Using default backend 'copy'
I0701 04:57:05.430335  5634 cluster.cpp:448] Creating default 'local' authorizer
I0701 04:57:05.431926 24120 slave.cpp:250] Mesos agent started on (782)@172.17.0.5:41030
I0701 04:57:05.431969 24120 slave.cpp:251] Flags at startup: --acls="" --appc_simple_discovery_uri_prefix="http://"
--appc_store_dir="/tmp/Endpoint_SlaveEndpointTest_NoAuthorizer_0_xveli9/store/appc" --authenticate_http_executors="true"
--authenticate_http_readonly="true" --authenticate_http_readwrite="true" --authenticatee="crammd5"
--authentication_backoff_factor="1secs" --authorizer="local" --cgroups_cpu_enable_pids_and_tids_count="false"
--cgroups_enable_cfs="false" --cgroups_hierarchy="/sys/fs/cgroup" --cgroups_limit_swap="false"
--cgroups_root="mesos" --container_disk_watch_interval="15secs" --containerizers="mesos" --credential="/tmp/Endpoint_SlaveEndpointTest_NoAuthorizer_0_xveli9/credential"
--default_role="*" --disk_watch_interval="1mins" --docker="docker" --docker_kill_orphans="true"
--docker_registry="https://registry-1.docker.io" --docker_remove_delay="6hrs" --docker_socket="/var/run/docker.sock"
--docker_stop_timeout="0ns" --docker_store_dir="/tmp/Endpoint_SlaveEndpointTest_NoAuthorizer_0_xveli9/store/docker"
--docker_volume_checkpoint_dir="/var/run/mesos/isolators/docker/volume" --enforce_container_disk_quota="false"
--executor_registration_timeout="1mins" --executor_reregistration_timeout="2secs" --executor_secret_key="/tmp/Endpoint_SlaveEndpointTest_NoAuthorizer_0_xveli9/executor_secret_key"
--executor_shutdown_grace_period="5secs" --fetcher_cache_dir="/tmp/Endpoint_SlaveEndpointTest_NoAuthorizer_0_xveli9/fetch"
--fetcher_cache_size="2GB" --frameworks_home="" --gc_delay="1weeks" --gc_disk_headroom="0.1"
--hadoop_home="" --help="false" --hostname_lookup="true" --http_command_executor="false" --http_credentials="/tmp/Endpoint_SlaveEndpointTest_NoAuthorizer_0_xveli9/http_credentials"
--http_heartbeat_interval="30secs" --initialize_driver_logging="true" --isolation="posix/cpu,posix/mem"
--launcher="posix" --launcher_dir="/mesos/mesos-1.4.0/_build/src" --logbufsecs="0" --logging_level="INFO"
--max_completed_executors_per_framework="150" --oversubscribed_resources_interval="15secs"
--perf_duration="10secs" --perf_interval="1mins" --port="5051" --qos_correction_interval_min="0ns"
--quiet="false" --recover="reconnect" --recovery_timeout="15mins" --registration_backoff_factor="10ms"
--resources="cpus:2;gpus:0;mem:1024;disk:1024;ports:[31000-32000]" --revocable_cpu_low_priority="true"
--runtime_dir="/tmp/Endpoint_SlaveEndpointTest_NoAuthorizer_0_xveli9" --sandbox_directory="/mnt/mesos/sandbox"
--strict="true" --switch_user="true" --systemd_enable_support="true" --systemd_runtime_directory="/run/systemd/system"
--version="false" --work_dir="/tmp/Endpoint_SlaveEndpointTest_NoAuthorizer_0_PCJFR6"
I0701 04:57:05.432633 24120 credentials.hpp:86] Loading credential for authentication from
'/tmp/Endpoint_SlaveEndpointTest_NoAuthorizer_0_xveli9/credential'
I0701 04:57:05.432818 24120 slave.cpp:283] Agent using credential for: test-principal
I0701 04:57:05.432850 24120 credentials.hpp:37] Loading credentials for authentication from
'/tmp/Endpoint_SlaveEndpointTest_NoAuthorizer_0_xveli9/http_credentials'
I0701 04:57:05.433233 24120 http.cpp:974] Creating default 'basic' HTTP authenticator for
realm 'mesos-agent-executor'
I0701 04:57:05.433359 24120 http.cpp:995] Creating default 'jwt' HTTP authenticator for realm
'mesos-agent-executor'
I0701 04:57:05.433652 24120 http.cpp:974] Creating default 'basic' HTTP authenticator for
realm 'mesos-agent-readonly'
I0701 04:57:05.433779 24120 http.cpp:995] Creating default 'jwt' HTTP authenticator for realm
'mesos-agent-readonly'
I0701 04:57:05.434046 24120 http.cpp:974] Creating default 'basic' HTTP authenticator for
realm 'mesos-agent-readwrite'
I0701 04:57:05.434160 24120 http.cpp:995] Creating default 'jwt' HTTP authenticator for realm
'mesos-agent-readwrite'
I0701 04:57:05.436092 24120 slave.cpp:565] Agent resources: [{"name":"cpus","scalar":{"value":2.0},"type":"SCALAR"},{"name":"mem","scalar":{"value":1024.0},"type":"SCALAR"},{"name":"disk","scalar":{"value":1024.0},"type":"SCALAR"},{"name":"ports","ranges":{"range":[{"begin":31000,"end":32000}]},"type":"RANGES"}]
I0701 04:57:05.436403 24120 slave.cpp:573] Agent attributes: [  ]
I0701 04:57:05.436422 24120 slave.cpp:578] Agent hostname: 9e697cf0c7e4
I0701 04:57:05.436573 24123 status_update_manager.cpp:177] Pausing sending status updates
I0701 04:57:05.438288 24121 state.cpp:64] Recovering state from '/tmp/Endpoint_SlaveEndpointTest_NoAuthorizer_0_PCJFR6/meta'
I0701 04:57:05.438607 24124 status_update_manager.cpp:203] Recovering status update manager
I0701 04:57:05.438858 24119 containerizer.cpp:582] Recovering containerizer
I0701 04:57:05.440297 24121 provisioner.cpp:416] Provisioner recovery complete
I0701 04:57:05.440712 24129 slave.cpp:6189] Finished recovery
I0701 04:57:05.441314 24129 slave.cpp:6371] Querying resource estimator for oversubscribable
resources
I0701 04:57:05.441606 24131 slave.cpp:6385] Received oversubscribable resources {} from the
resource estimator
I0701 04:57:05.443660 24121 process.cpp:3779] Handling HTTP event for process 'slave(782)'
with path: '/slave(782)/monitor/statistics'
I0701 04:57:05.445204 24125 http.cpp:1114] HTTP GET for /slave(782)/monitor/statistics from
172.17.0.5:32925
I0701 04:57:05.445310 24125 http.cpp:935] Authorizing principal 'test-principal' to GET the
'/monitor/statistics' endpoint
I0701 04:57:05.448639 24131 slave.cpp:839] Agent terminating
[       OK ] Endpoint/SlaveEndpointTest.NoAuthorizer/0 (33 ms)
[ RUN      ] Endpoint/SlaveEndpointTest.NoAuthorizer/1
I0701 04:57:05.465466  5634 containerizer.cpp:230] Using isolation: posix/cpu,posix/mem,filesystem/posix,network/cni,environment_secret
W0701 04:57:05.465945  5634 backend.cpp:76] Failed to create 'aufs' backend: AufsBackend requires
root privileges
W0701 04:57:05.466037  5634 backend.cpp:76] Failed to create 'bind' backend: BindBackend requires
root privileges
I0701 04:57:05.466075  5634 provisioner.cpp:255] Using default backend 'copy'
I0701 04:57:05.467671  5634 cluster.cpp:448] Creating default 'local' authorizer
I0701 04:57:05.469029 24119 slave.cpp:250] Mesos agent started on (783)@172.17.0.5:41030
I0701 04:57:05.469079 24119 slave.cpp:251] Flags at startup: --acls="" --appc_simple_discovery_uri_prefix="http://"
--appc_store_dir="/tmp/Endpoint_SlaveEndpointTest_NoAuthorizer_1_JOpOlj/store/appc" --authenticate_http_executors="true"
--authenticate_http_readonly="true" --authenticate_http_readwrite="true" --authenticatee="crammd5"
--authentication_backoff_factor="1secs" --authorizer="local" --cgroups_cpu_enable_pids_and_tids_count="false"
--cgroups_enable_cfs="false" --cgroups_hierarchy="/sys/fs/cgroup" --cgroups_limit_swap="false"
--cgroups_root="mesos" --container_disk_watch_interval="15secs" --containerizers="mesos" --credential="/tmp/Endpoint_SlaveEndpointTest_NoAuthorizer_1_JOpOlj/credential"
--default_role="*" --disk_watch_interval="1mins" --docker="docker" --docker_kill_orphans="true"
--docker_registry="https://registry-1.docker.io" --docker_remove_delay="6hrs" --docker_socket="/var/run/docker.sock"
--docker_stop_timeout="0ns" --docker_store_dir="/tmp/Endpoint_SlaveEndpointTest_NoAuthorizer_1_JOpOlj/store/docker"
--docker_volume_checkpoint_dir="/var/run/mesos/isolators/docker/volume" --enforce_container_disk_quota="false"
--executor_registration_timeout="1mins" --executor_reregistration_timeout="2secs" --executor_secret_key="/tmp/Endpoint_SlaveEndpointTest_NoAuthorizer_1_JOpOlj/executor_secret_key"
--executor_shutdown_grace_period="5secs" --fetcher_cache_dir="/tmp/Endpoint_SlaveEndpointTest_NoAuthorizer_1_JOpOlj/fetch"
--fetcher_cache_size="2GB" --frameworks_home="" --gc_delay="1weeks" --gc_disk_headroom="0.1"
--hadoop_home="" --help="false" --hostname_lookup="true" --http_command_executor="false" --http_credentials="/tmp/Endpoint_SlaveEndpointTest_NoAuthorizer_1_JOpOlj/http_credentials"
--http_heartbeat_interval="30secs" --initialize_driver_logging="true" --isolation="posix/cpu,posix/mem"
--launcher="posix" --launcher_dir="/mesos/mesos-1.4.0/_build/src" --logbufsecs="0" --logging_level="INFO"
--max_completed_executors_per_framework="150" --oversubscribed_resources_interval="15secs"
--perf_duration="10secs" --perf_interval="1mins" --port="5051" --qos_correction_interval_min="0ns"
--quiet="false" --recover="reconnect" --recovery_timeout="15mins" --registration_backoff_factor="10ms"
--resources="cpus:2;gpus:0;mem:1024;disk:1024;ports:[31000-32000]" --revocable_cpu_low_priority="true"
--runtime_dir="/tmp/Endpoint_SlaveEndpointTest_NoAuthorizer_1_JOpOlj" --sandbox_directory="/mnt/mesos/sandbox"
--strict="true" --switch_user="true" --systemd_enable_support="true" --systemd_runtime_directory="/run/systemd/system"
--version="false" --work_dir="/tmp/Endpoint_SlaveEndpointTest_NoAuthorizer_1_hCD0Og"
I0701 04:57:05.469444 24119 credentials.hpp:86] Loading credential for authentication from
'/tmp/Endpoint_SlaveEndpointTest_NoAuthorizer_1_JOpOlj/credential'
I0701 04:57:05.469605 24119 slave.cpp:283] Agent using credential for: test-principal
I0701 04:57:05.469626 24119 credentials.hpp:37] Loading credentials for authentication from
'/tmp/Endpoint_SlaveEndpointTest_NoAuthorizer_1_JOpOlj/http_credentials'
I0701 04:57:05.469871 24119 http.cpp:974] Creating default 'basic' HTTP authenticator for
realm 'mesos-agent-executor'
I0701 04:57:05.469971 24119 http.cpp:995] Creating default 'jwt' HTTP authenticator for realm
'mesos-agent-executor'
I0701 04:57:05.470330 24119 http.cpp:974] Creating default 'basic' HTTP authenticator for
realm 'mesos-agent-readonly'
I0701 04:57:05.470474 24119 http.cpp:995] Creating default 'jwt' HTTP authenticator for realm
'mesos-agent-readonly'
I0701 04:57:05.470718 24119 http.cpp:974] Creating default 'basic' HTTP authenticator for
realm 'mesos-agent-readwrite'
I0701 04:57:05.470844 24119 http.cpp:995] Creating default 'jwt' HTTP authenticator for realm
'mesos-agent-readwrite'
I0701 04:57:05.472770 24119 slave.cpp:565] Agent resources: [{"name":"cpus","scalar":{"value":2.0},"type":"SCALAR"},{"name":"mem","scalar":{"value":1024.0},"type":"SCALAR"},{"name":"disk","scalar":{"value":1024.0},"type":"SCALAR"},{"name":"ports","ranges":{"range":[{"begin":31000,"end":32000}]},"type":"RANGES"}]
I0701 04:57:05.473053 24119 slave.cpp:573] Agent attributes: [  ]
I0701 04:57:05.473073 24119 slave.cpp:578] Agent hostname: 9e697cf0c7e4
I0701 04:57:05.473232 24121 status_update_manager.cpp:177] Pausing sending status updates
I0701 04:57:05.474836 24127 state.cpp:64] Recovering state from '/tmp/Endpoint_SlaveEndpointTest_NoAuthorizer_1_hCD0Og/meta'
I0701 04:57:05.475293 24120 status_update_manager.cpp:203] Recovering status update manager
I0701 04:57:05.475538 24125 containerizer.cpp:582] Recovering containerizer
I0701 04:57:05.477180 24118 provisioner.cpp:416] Provisioner recovery complete
I0701 04:57:05.477689 24123 slave.cpp:6189] Finished recovery
I0701 04:57:05.478260 24123 slave.cpp:6371] Querying resource estimator for oversubscribable
resources
I0701 04:57:05.478585 24117 slave.cpp:6385] Received oversubscribable resources {} from the
resource estimator
I0701 04:57:05.480602 24120 process.cpp:3779] Handling HTTP event for process 'slave(783)'
with path: '/slave(783)/monitor/statistics.json'
I0701 04:57:05.482580 24117 http.cpp:1114] HTTP GET for /slave(783)/monitor/statistics.json
from 172.17.0.5:32926
I0701 04:57:05.482671 24117 http.cpp:935] Authorizing principal 'test-principal' to GET the
'/monitor/statistics.json' endpoint
I0701 04:57:05.486078 24117 slave.cpp:839] Agent terminating
[       OK ] Endpoint/SlaveEndpointTest.NoAuthorizer/1 (34 ms)
[ RUN      ] Endpoint/SlaveEndpointTest.NoAuthorizer/2
I0701 04:57:05.499372  5634 containerizer.cpp:230] Using isolation: posix/cpu,posix/mem,filesystem/posix,network/cni,environment_secret
W0701 04:57:05.499835  5634 backend.cpp:76] Failed to create 'aufs' backend: AufsBackend requires
root privileges
W0701 04:57:05.499948  5634 backend.cpp:76] Failed to create 'bind' backend: BindBackend requires
root privileges
I0701 04:57:05.499985  5634 provisioner.cpp:255] Using default backend 'copy'
I0701 04:57:05.501756  5634 cluster.cpp:448] Creating default 'local' authorizer
I0701 04:57:05.504158 24129 slave.cpp:250] Mesos agent started on (784)@172.17.0.5:41030
I0701 04:57:05.504221 24129 slave.cpp:251] Flags at startup: --acls="" --appc_simple_discovery_uri_prefix="http://"
--appc_store_dir="/tmp/Endpoint_SlaveEndpointTest_NoAuthorizer_2_35ufMt/store/appc" --authenticate_http_executors="true"
--authenticate_http_readonly="true" --authenticate_http_readwrite="true" --authenticatee="crammd5"
--authentication_backoff_factor="1secs" --authorizer="local" --cgroups_cpu_enable_pids_and_tids_count="false"
--cgroups_enable_cfs="false" --cgroups_hierarchy="/sys/fs/cgroup" --cgroups_limit_swap="false"
--cgroups_root="mesos" --container_disk_watch_interval="15secs" --containerizers="mesos" --credential="/tmp/Endpoint_SlaveEndpointTest_NoAuthorizer_2_35ufMt/credential"
--default_role="*" --disk_watch_interval="1mins" --docker="docker" --docker_kill_orphans="true"
--docker_registry="https://registry-1.docker.io" --docker_remove_delay="6hrs" --docker_socket="/var/run/docker.sock"
--docker_stop_timeout="0ns" --docker_store_dir="/tmp/Endpoint_SlaveEndpointTest_NoAuthorizer_2_35ufMt/store/docker"
--docker_volume_checkpoint_dir="/var/run/mesos/isolators/docker/volume" --enforce_container_disk_quota="false"
--executor_registration_timeout="1mins" --executor_reregistration_timeout="2secs" --executor_secret_key="/tmp/Endpoint_SlaveEndpointTest_NoAuthorizer_2_35ufMt/executor_secret_key"
--executor_shutdown_grace_period="5secs" --fetcher_cache_dir="/tmp/Endpoint_SlaveEndpointTest_NoAuthorizer_2_35ufMt/fetch"
--fetcher_cache_size="2GB" --frameworks_home="" --gc_delay="1weeks" --gc_disk_headroom="0.1"
--hadoop_home="" --help="false" --hostname_lookup="true" --http_command_executor="false" --http_credentials="/tmp/Endpoint_SlaveEndpointTest_NoAuthorizer_2_35ufMt/http_credentials"
--http_heartbeat_interval="30secs" --initialize_driver_logging="true" --isolation="posix/cpu,posix/mem"
--launcher="posix" --launcher_dir="/mesos/mesos-1.4.0/_build/src" --logbufsecs="0" --logging_level="INFO"
--max_completed_executors_per_framework="150" --oversubscribed_resources_interval="15secs"
--perf_duration="10secs" --perf_interval="1mins" --port="5051" --qos_correction_interval_min="0ns"
--quiet="false" --recover="reconnect" --recovery_timeout="15mins" --registration_backoff_factor="10ms"
--resources="cpus:2;gpus:0;mem:1024;disk:1024;ports:[31000-32000]" --revocable_cpu_low_priority="true"
--runtime_dir="/tmp/Endpoint_SlaveEndpointTest_NoAuthorizer_2_35ufMt" --sandbox_directory="/mnt/mesos/sandbox"
--strict="true" --switch_user="true" --systemd_enable_support="true" --systemd_runtime_directory="/run/systemd/system"
--version="false" --work_dir="/tmp/Endpoint_SlaveEndpointTest_NoAuthorizer_2_NBcN9q"
I0701 04:57:05.505019 24129 credentials.hpp:86] Loading credential for authentication from
'/tmp/Endpoint_SlaveEndpointTest_NoAuthorizer_2_35ufMt/credential'
I0701 04:57:05.505290 24129 slave.cpp:283] Agent using credential for: test-principal
I0701 04:57:05.505316 24129 credentials.hpp:37] Loading credentials for authentication from
'/tmp/Endpoint_SlaveEndpointTest_NoAuthorizer_2_35ufMt/http_credentials'
I0701 04:57:05.505710 24129 http.cpp:974] Creating default 'basic' HTTP authenticator for
realm 'mesos-agent-executor'
I0701 04:57:05.505857 24129 http.cpp:995] Creating default 'jwt' HTTP authenticator for realm
'mesos-agent-executor'
I0701 04:57:05.506139 24129 http.cpp:974] Creating default 'basic' HTTP authenticator for
realm 'mesos-agent-readonly'
I0701 04:57:05.506263 24129 http.cpp:995] Creating default 'jwt' HTTP authenticator for realm
'mesos-agent-readonly'
I0701 04:57:05.506585 24129 http.cpp:974] Creating default 'basic' HTTP authenticator for
realm 'mesos-agent-readwrite'
I0701 04:57:05.506705 24129 http.cpp:995] Creating default 'jwt' HTTP authenticator for realm
'mesos-agent-readwrite'
I0701 04:57:05.508569 24129 slave.cpp:565] Agent resources: [{"name":"cpus","scalar":{"value":2.0},"type":"SCALAR"},{"name":"mem","scalar":{"value":1024.0},"type":"SCALAR"},{"name":"disk","scalar":{"value":1024.0},"type":"SCALAR"},{"name":"ports","ranges":{"range":[{"begin":31000,"end":32000}]},"type":"RANGES"}]
I0701 04:57:05.508865 24129 slave.cpp:573] Agent attributes: [  ]
I0701 04:57:05.508882 24129 slave.cpp:578] Agent hostname: 9e697cf0c7e4
I0701 04:57:05.509044 24128 status_update_manager.cpp:177] Pausing sending status updates
I0701 04:57:05.510493 24125 state.cpp:64] Recovering state from '/tmp/Endpoint_SlaveEndpointTest_NoAuthorizer_2_NBcN9q/meta'
I0701 04:57:05.510751 24129 status_update_manager.cpp:203] Recovering status update manager
I0701 04:57:05.510968 24122 containerizer.cpp:582] Recovering containerizer
I0701 04:57:05.512377 24116 provisioner.cpp:416] Provisioner recovery complete
I0701 04:57:05.512707 24130 slave.cpp:6189] Finished recovery
I0701 04:57:05.513212 24130 slave.cpp:6371] Querying resource estimator for oversubscribable
resources
I0701 04:57:05.513422 24118 slave.cpp:6385] Received oversubscribable resources {} from the
resource estimator
I0701 04:57:05.515503 24116 process.cpp:3779] Handling HTTP event for process 'slave(784)'
with path: '/slave(784)/containers'
I0701 04:57:05.517251 24119 http.cpp:1114] HTTP GET for /slave(784)/containers from 172.17.0.5:32928
I0701 04:57:05.517324 24119 http.cpp:935] Authorizing principal 'test-principal' to GET the
'/containers' endpoint
I0701 04:57:05.520153 24122 slave.cpp:839] Agent terminating
[       OK ] Endpoint/SlaveEndpointTest.NoAuthorizer/2 (33 ms)
[----------] 9 tests from Endpoint/SlaveEndpointTest (310 ms total)

[----------] Global test environment tear-down
[==========] 1628 tests from 181 test cases ran. (610138 ms total)
[  PASSED  ] 1627 tests.
[  FAILED  ] 1 test, listed below:
[  FAILED  ] ExamplesTest.TestHTTPFramework

 1 FAILED TEST
  YOU HAVE 20 DISABLED TESTS

I0701 04:57:05.587832 24132 process.cpp:968] Failed to accept socket: future discarded
make[4]: *** [check-local] Error 1
make[4]: Leaving directory `/mesos/mesos-1.4.0/_build/src'
make[3]: *** [check-am] Error 2
make[3]: Leaving directory `/mesos/mesos-1.4.0/_build/src'
make[2]: *** [check] Error 2
make[2]: Leaving directory `/mesos/mesos-1.4.0/_build/src'
make[1]: *** [check-recursive] Error 1
make[1]: Leaving directory `/mesos/mesos-1.4.0/_build'
make: *** [distcheck] Error 1
+ docker rmi mesos-1498881692-19823
Untagged: mesos-1498881692-19823:latest
Deleted: sha256:4bc952096fedb0789e31ca03e7dc12c092dbe39cc51280fbdc5cc36348f84034
Deleted: sha256:8502137efb2f00521b382b0d3632a6af9cef1f45150105e3970b874c12dabe3b
Deleted: sha256:33a54c76a1e96b3b038f20f55eb291fba61666b64172e2505757531f4d9b431a
Deleted: sha256:fe97787e998a65b663f1a37b2780fc7fdd872f283570b05d892b175663de2998
Deleted: sha256:cab0b6886ea54228e4f5d4de5f0edf2636d6d4430c13ebada061741e7c4f258a
Deleted: sha256:6fd24f80ea78acdcbea4cb675586f0f10411fb2f66f80bc45b41699d897ab7f7
Deleted: sha256:b3578bf1b2ebc755de5dfca04f1d113c6436f65cc72c6cd480c422bc0853370a
Deleted: sha256:088b7257b26c73c7d32f31afa8de4a5bc73b80544eea83e299105b97ae68e0a0
Deleted: sha256:78458143e748cbe41f75b91d80f9e04dd8014828052dd37ffcb54a59287e9085
Deleted: sha256:1310060d066c902795db53f2174ff4e3bc954ad908b9cf33bf0de68131b35277
Deleted: sha256:8d0933868db845fdf12051a71bf8b1df61d8d5cda19afe5f42cc05f52c9264ea
Deleted: sha256:eddc7f47f30aa04c7fa26f89e67d7c4a20f4a56503f14618c4327700191f0871
Deleted: sha256:d1412d9ae0a9da764dae90c19209148e525f1c17e298317ca5c2df3ae08d7c4d
Deleted: sha256:302c3721dd343ec0e2e82819f1a16589be8672eb76706b9bf212f74877b6df0c
Deleted: sha256:4a0d940930c7ed9aa1f3f0d63d839046ff67724e14e4522d2bbd55f45bfbc636
Deleted: sha256:e2883bcdcb5a794d722f5a3e3c7563ec9d2132889c349a87cb2deb8cb5b8b272
Deleted: sha256:3913f8dd0a5363cb80316a028a5188687f892cea659fa5c71842977760d82996
Deleted: sha256:52a05d3ee53d1a0428f7650eb3818b319d163bf67878dc19ec409ed7801cc256
Deleted: sha256:e3320d0bd3bb9d87f1f35f530c672491a777b8b1e5dac2dc0147192fcb0b4aaf
Deleted: sha256:1767d4868f445033fe6eb5c728fb2a60a3d6358252b35a8d9c3fabf7af94afb8
Deleted: sha256:d7f9e6bc0ca33da94c0db4c7ce8570b65c44768888b2052a106d30454db7b6d1
Deleted: sha256:0fee177343b6c3a2ac9bdb245582ef3fc942611be949f86b15d4a0a300207494
Deleted: sha256:32e0fb2f7de372dd1739407b06de3d02723ec4eafcdc061f46131e406269e01b
Deleted: sha256:407e3cdd1c311675995d66fc5c8778ba8350e725ea1992e6ea4db2932908c7f9
Build step 'Execute shell' marked build as failure
Not sending mail to unregistered user yujie.jay@gmail.com

Mime
View raw message