mesos-builds mailing list archives

Site index · List index
Message view « Date » · « Thread »
Top « Date » · « Thread »
From Apache Jenkins Server <jenk...@builds.apache.org>
Subject Build failed in Jenkins: Mesos-Reviewbot #18498
Date Mon, 17 Jul 2017 05:09:46 GMT
See <https://builds.apache.org/job/Mesos-Reviewbot/18498/display/redirect>

------------------------------------------
[...truncated 30.03 MB...]
I0717 05:09:39.365408  4982 containerizer.cpp:230] Using isolation: posix/cpu,posix/mem,filesystem/posix,network/cni,environment_secret
W0717 05:09:39.366242  4982 backend.cpp:76] Failed to create 'overlay' backend: OverlayBackend
requires root privileges
W0717 05:09:39.366446  4982 backend.cpp:76] Failed to create 'bind' backend: BindBackend requires
root privileges
I0717 05:09:39.366488  4982 provisioner.cpp:255] Using default backend 'copy'
I0717 05:09:39.371960  5007 slave.cpp:250] Mesos agent started on (789)@172.17.0.2:40793
I0717 05:09:39.372000  5007 slave.cpp:251] Flags at startup: --acls="" --appc_simple_discovery_uri_prefix="http://"
--appc_store_dir="/tmp/Endpoint_SlaveEndpointTest_AuthorizedRequest_2_htNC6n/store/appc" --authenticate_http_readonly="true"
--authenticate_http_readwrite="true" --authenticatee="crammd5" --authentication_backoff_factor="1secs"
--authorizer="local" --cgroups_cpu_enable_pids_and_tids_count="false" --cgroups_enable_cfs="false"
--cgroups_hierarchy="/sys/fs/cgroup" --cgroups_limit_swap="false" --cgroups_root="mesos" --container_disk_watch_interval="15secs"
--containerizers="mesos" --credential="/tmp/Endpoint_SlaveEndpointTest_AuthorizedRequest_2_htNC6n/credential"
--default_role="*" --disk_watch_interval="1mins" --docker="docker" --docker_kill_orphans="true"
--docker_registry="https://registry-1.docker.io" --docker_remove_delay="6hrs" --docker_socket="/var/run/docker.sock"
--docker_stop_timeout="0ns" --docker_store_dir="/tmp/Endpoint_SlaveEndpointTest_AuthorizedRequest_2_htNC6n/store/docker"
--docker_volume_checkpoint_dir="/var/run/mesos/isolators/docker/volume" --enforce_container_disk_quota="false"
--executor_registration_timeout="1mins" --executor_reregistration_timeout="2secs" --executor_shutdown_grace_period="5secs"
--fetcher_cache_dir="/tmp/Endpoint_SlaveEndpointTest_AuthorizedRequest_2_htNC6n/fetch" --fetcher_cache_size="2GB"
--frameworks_home="" --gc_delay="1weeks" --gc_disk_headroom="0.1" --hadoop_home="" --help="false"
--hostname_lookup="true" --http_command_executor="false" --http_credentials="/tmp/Endpoint_SlaveEndpointTest_AuthorizedRequest_2_htNC6n/http_credentials"
--http_heartbeat_interval="30secs" --initialize_driver_logging="true" --isolation="posix/cpu,posix/mem"
--launcher="posix" --launcher_dir="/mesos/mesos-1.4.0/_build/src" --logbufsecs="0" --logging_level="INFO"
--max_completed_executors_per_framework="150" --oversubscribed_resources_interval="15secs"
--perf_duration="10secs" --perf_interval="1mins" --port="5051" --qos_correction_interval_min="0ns"
--quiet="false" --recover="reconnect" --recovery_timeout="15mins" --registration_backoff_factor="10ms"
--resources="cpus:2;gpus:0;mem:1024;disk:1024;ports:[31000-32000]" --revocable_cpu_low_priority="true"
--runtime_dir="/tmp/Endpoint_SlaveEndpointTest_AuthorizedRequest_2_htNC6n" --sandbox_directory="/mnt/mesos/sandbox"
--strict="true" --switch_user="true" --systemd_enable_support="true" --systemd_runtime_directory="/run/systemd/system"
--version="false" --work_dir="/tmp/Endpoint_SlaveEndpointTest_AuthorizedRequest_2_LpIL9n"
I0717 05:09:39.372731  5007 credentials.hpp:86] Loading credential for authentication from
'/tmp/Endpoint_SlaveEndpointTest_AuthorizedRequest_2_htNC6n/credential'
I0717 05:09:39.372995  5007 slave.cpp:283] Agent using credential for: test-principal
I0717 05:09:39.373018  5007 credentials.hpp:37] Loading credentials for authentication from
'/tmp/Endpoint_SlaveEndpointTest_AuthorizedRequest_2_htNC6n/http_credentials'
I0717 05:09:39.373404  5007 http.cpp:993] Creating default 'basic' HTTP authenticator for
realm 'mesos-agent-readonly'
I0717 05:09:39.373636  5007 http.cpp:993] Creating default 'basic' HTTP authenticator for
realm 'mesos-agent-readwrite'
I0717 05:09:39.375828  5007 slave.cpp:565] Agent resources: [{"name":"cpus","scalar":{"value":2.0},"type":"SCALAR"},{"name":"mem","scalar":{"value":1024.0},"type":"SCALAR"},{"name":"disk","scalar":{"value":1024.0},"type":"SCALAR"},{"name":"ports","ranges":{"range":[{"begin":31000,"end":32000}]},"type":"RANGES"}]
I0717 05:09:39.376256  5007 slave.cpp:573] Agent attributes: [  ]
I0717 05:09:39.376279  5007 slave.cpp:582] Agent hostname: 69941a2f94ab
I0717 05:09:39.376744  5002 status_update_manager.cpp:177] Pausing sending status updates
I0717 05:09:39.378566  5001 state.cpp:64] Recovering state from '/tmp/Endpoint_SlaveEndpointTest_AuthorizedRequest_2_LpIL9n/meta'
I0717 05:09:39.379523  5001 status_update_manager.cpp:203] Recovering status update manager
I0717 05:09:39.380050  5001 containerizer.cpp:582] Recovering containerizer
I0717 05:09:39.383397  5001 provisioner.cpp:416] Provisioner recovery complete
I0717 05:09:39.384384  5005 slave.cpp:6229] Finished recovery
I0717 05:09:39.385192  5005 slave.cpp:6411] Querying resource estimator for oversubscribable
resources
I0717 05:09:39.385675  5003 slave.cpp:6425] Received oversubscribable resources {} from the
resource estimator
I0717 05:09:39.390472  5005 process.cpp:3820] Handling HTTP event for process 'slave(789)'
with path: '/slave(789)/containers'
I0717 05:09:39.392709  5004 http.cpp:1133] HTTP GET for /slave(789)/containers from 172.17.0.2:51818
I0717 05:09:39.392976  5004 http.cpp:957] Authorizing principal 'test-principal' to GET the
'/containers' endpoint
I0717 05:09:39.398639  4982 slave.cpp:843] Agent terminating
[       OK ] Endpoint/SlaveEndpointTest.AuthorizedRequest/2 (48 ms)
[ RUN      ] Endpoint/SlaveEndpointTest.UnauthorizedRequest/0
I0717 05:09:39.413969  4982 containerizer.cpp:230] Using isolation: posix/cpu,posix/mem,filesystem/posix,network/cni,environment_secret
W0717 05:09:39.414796  4982 backend.cpp:76] Failed to create 'overlay' backend: OverlayBackend
requires root privileges
W0717 05:09:39.414984  4982 backend.cpp:76] Failed to create 'bind' backend: BindBackend requires
root privileges
I0717 05:09:39.415041  4982 provisioner.cpp:255] Using default backend 'copy'
I0717 05:09:39.420513  5006 slave.cpp:250] Mesos agent started on (790)@172.17.0.2:40793
I0717 05:09:39.420557  5006 slave.cpp:251] Flags at startup: --acls="" --appc_simple_discovery_uri_prefix="http://"
--appc_store_dir="/tmp/Endpoint_SlaveEndpointTest_UnauthorizedRequest_0_dzv0ko/store/appc"
--authenticate_http_readonly="true" --authenticate_http_readwrite="true" --authenticatee="crammd5"
--authentication_backoff_factor="1secs" --authorizer="local" --cgroups_cpu_enable_pids_and_tids_count="false"
--cgroups_enable_cfs="false" --cgroups_hierarchy="/sys/fs/cgroup" --cgroups_limit_swap="false"
--cgroups_root="mesos" --container_disk_watch_interval="15secs" --containerizers="mesos" --credential="/tmp/Endpoint_SlaveEndpointTest_UnauthorizedRequest_0_dzv0ko/credential"
--default_role="*" --disk_watch_interval="1mins" --docker="docker" --docker_kill_orphans="true"
--docker_registry="https://registry-1.docker.io" --docker_remove_delay="6hrs" --docker_socket="/var/run/docker.sock"
--docker_stop_timeout="0ns" --docker_store_dir="/tmp/Endpoint_SlaveEndpointTest_UnauthorizedRequest_0_dzv0ko/store/docker"
--docker_volume_checkpoint_dir="/var/run/mesos/isolators/docker/volume" --enforce_container_disk_quota="false"
--executor_registration_timeout="1mins" --executor_reregistration_timeout="2secs" --executor_shutdown_grace_period="5secs"
--fetcher_cache_dir="/tmp/Endpoint_SlaveEndpointTest_UnauthorizedRequest_0_dzv0ko/fetch" --fetcher_cache_size="2GB"
--frameworks_home="" --gc_delay="1weeks" --gc_disk_headroom="0.1" --hadoop_home="" --help="false"
--hostname_lookup="true" --http_command_executor="false" --http_credentials="/tmp/Endpoint_SlaveEndpointTest_UnauthorizedRequest_0_dzv0ko/http_credentials"
--http_heartbeat_interval="30secs" --initialize_driver_logging="true" --isolation="posix/cpu,posix/mem"
--launcher="posix" --launcher_dir="/mesos/mesos-1.4.0/_build/src" --logbufsecs="0" --logging_level="INFO"
--max_completed_executors_per_framework="150" --oversubscribed_resources_interval="15secs"
--perf_duration="10secs" --perf_interval="1mins" --port="5051" --qos_correction_interval_min="0ns"
--quiet="false" --recover="reconnect" --recovery_timeout="15mins" --registration_backoff_factor="10ms"
--resources="cpus:2;gpus:0;mem:1024;disk:1024;ports:[31000-32000]" --revocable_cpu_low_priority="true"
--runtime_dir="/tmp/Endpoint_SlaveEndpointTest_UnauthorizedRequest_0_dzv0ko" --sandbox_directory="/mnt/mesos/sandbox"
--strict="true" --switch_user="true" --systemd_enable_support="true" --systemd_runtime_directory="/run/systemd/system"
--version="false" --work_dir="/tmp/Endpoint_SlaveEndpointTest_UnauthorizedRequest_0_hWwhgo"
I0717 05:09:39.421289  5006 credentials.hpp:86] Loading credential for authentication from
'/tmp/Endpoint_SlaveEndpointTest_UnauthorizedRequest_0_dzv0ko/credential'
I0717 05:09:39.421574  5006 slave.cpp:283] Agent using credential for: test-principal
I0717 05:09:39.421598  5006 credentials.hpp:37] Loading credentials for authentication from
'/tmp/Endpoint_SlaveEndpointTest_UnauthorizedRequest_0_dzv0ko/http_credentials'
I0717 05:09:39.421957  5006 http.cpp:993] Creating default 'basic' HTTP authenticator for
realm 'mesos-agent-readonly'
I0717 05:09:39.422194  5006 http.cpp:993] Creating default 'basic' HTTP authenticator for
realm 'mesos-agent-readwrite'
I0717 05:09:39.424394  5006 slave.cpp:565] Agent resources: [{"name":"cpus","scalar":{"value":2.0},"type":"SCALAR"},{"name":"mem","scalar":{"value":1024.0},"type":"SCALAR"},{"name":"disk","scalar":{"value":1024.0},"type":"SCALAR"},{"name":"ports","ranges":{"range":[{"begin":31000,"end":32000}]},"type":"RANGES"}]
I0717 05:09:39.424823  5006 slave.cpp:573] Agent attributes: [  ]
I0717 05:09:39.424845  5006 slave.cpp:582] Agent hostname: 69941a2f94ab
I0717 05:09:39.425067  5003 status_update_manager.cpp:177] Pausing sending status updates
I0717 05:09:39.427173  5002 state.cpp:64] Recovering state from '/tmp/Endpoint_SlaveEndpointTest_UnauthorizedRequest_0_hWwhgo/meta'
I0717 05:09:39.427759  5008 status_update_manager.cpp:203] Recovering status update manager
I0717 05:09:39.428148  5008 containerizer.cpp:582] Recovering containerizer
I0717 05:09:39.430647  5002 provisioner.cpp:416] Provisioner recovery complete
I0717 05:09:39.431185  5004 slave.cpp:6229] Finished recovery
I0717 05:09:39.431923  5004 slave.cpp:6411] Querying resource estimator for oversubscribable
resources
I0717 05:09:39.432449  5008 slave.cpp:6425] Received oversubscribable resources {} from the
resource estimator
I0717 05:09:39.437185  5001 process.cpp:3820] Handling HTTP event for process 'slave(790)'
with path: '/slave(790)/monitor/statistics'
I0717 05:09:39.439993  5001 http.cpp:1133] HTTP GET for /slave(790)/monitor/statistics from
172.17.0.2:51820
I0717 05:09:39.440119  5001 http.cpp:957] Authorizing principal 'test-principal' to GET the
'/monitor/statistics' endpoint
I0717 05:09:39.444500  5001 slave.cpp:843] Agent terminating
[       OK ] Endpoint/SlaveEndpointTest.UnauthorizedRequest/0 (46 ms)
[ RUN      ] Endpoint/SlaveEndpointTest.UnauthorizedRequest/1
I0717 05:09:39.460893  4982 containerizer.cpp:230] Using isolation: posix/cpu,posix/mem,filesystem/posix,network/cni,environment_secret
W0717 05:09:39.461716  4982 backend.cpp:76] Failed to create 'overlay' backend: OverlayBackend
requires root privileges
W0717 05:09:39.461918  4982 backend.cpp:76] Failed to create 'bind' backend: BindBackend requires
root privileges
I0717 05:09:39.461961  4982 provisioner.cpp:255] Using default backend 'copy'
I0717 05:09:39.467370  5008 slave.cpp:250] Mesos agent started on (791)@172.17.0.2:40793
I0717 05:09:39.467411  5008 slave.cpp:251] Flags at startup: --acls="" --appc_simple_discovery_uri_prefix="http://"
--appc_store_dir="/tmp/Endpoint_SlaveEndpointTest_UnauthorizedRequest_1_pvuB3o/store/appc"
--authenticate_http_readonly="true" --authenticate_http_readwrite="true" --authenticatee="crammd5"
--authentication_backoff_factor="1secs" --authorizer="local" --cgroups_cpu_enable_pids_and_tids_count="false"
--cgroups_enable_cfs="false" --cgroups_hierarchy="/sys/fs/cgroup" --cgroups_limit_swap="false"
--cgroups_root="mesos" --container_disk_watch_interval="15secs" --containerizers="mesos" --credential="/tmp/Endpoint_SlaveEndpointTest_UnauthorizedRequest_1_pvuB3o/credential"
--default_role="*" --disk_watch_interval="1mins" --docker="docker" --docker_kill_orphans="true"
--docker_registry="https://registry-1.docker.io" --docker_remove_delay="6hrs" --docker_socket="/var/run/docker.sock"
--docker_stop_timeout="0ns" --docker_store_dir="/tmp/Endpoint_SlaveEndpointTest_UnauthorizedRequest_1_pvuB3o/store/docker"
--docker_volume_checkpoint_dir="/var/run/mesos/isolators/docker/volume" --enforce_container_disk_quota="false"
--executor_registration_timeout="1mins" --executor_reregistration_timeout="2secs" --executor_shutdown_grace_period="5secs"
--fetcher_cache_dir="/tmp/Endpoint_SlaveEndpointTest_UnauthorizedRequest_1_pvuB3o/fetch" --fetcher_cache_size="2GB"
--frameworks_home="" --gc_delay="1weeks" --gc_disk_headroom="0.1" --hadoop_home="" --help="false"
--hostname_lookup="true" --http_command_executor="false" --http_credentials="/tmp/Endpoint_SlaveEndpointTest_UnauthorizedRequest_1_pvuB3o/http_credentials"
--http_heartbeat_interval="30secs" --initialize_driver_logging="true" --isolation="posix/cpu,posix/mem"
--launcher="posix" --launcher_dir="/mesos/mesos-1.4.0/_build/src" --logbufsecs="0" --logging_level="INFO"
--max_completed_executors_per_framework="150" --oversubscribed_resources_interval="15secs"
--perf_duration="10secs" --perf_interval="1mins" --port="5051" --qos_correction_interval_min="0ns"
--quiet="false" --recover="reconnect" --recovery_timeout="15mins" --registration_backoff_factor="10ms"
--resources="cpus:2;gpus:0;mem:1024;disk:1024;ports:[31000-32000]" --revocable_cpu_low_priority="true"
--runtime_dir="/tmp/Endpoint_SlaveEndpointTest_UnauthorizedRequest_1_pvuB3o" --sandbox_directory="/mnt/mesos/sandbox"
--strict="true" --switch_user="true" --systemd_enable_support="true" --systemd_runtime_directory="/run/systemd/system"
--version="false" --work_dir="/tmp/Endpoint_SlaveEndpointTest_UnauthorizedRequest_1_XfMkRo"
I0717 05:09:39.468240  5008 credentials.hpp:86] Loading credential for authentication from
'/tmp/Endpoint_SlaveEndpointTest_UnauthorizedRequest_1_pvuB3o/credential'
I0717 05:09:39.468832  5008 slave.cpp:283] Agent using credential for: test-principal
I0717 05:09:39.468868  5008 credentials.hpp:37] Loading credentials for authentication from
'/tmp/Endpoint_SlaveEndpointTest_UnauthorizedRequest_1_pvuB3o/http_credentials'
I0717 05:09:39.469369  5008 http.cpp:993] Creating default 'basic' HTTP authenticator for
realm 'mesos-agent-readonly'
I0717 05:09:39.469707  5008 http.cpp:993] Creating default 'basic' HTTP authenticator for
realm 'mesos-agent-readwrite'
I0717 05:09:39.472126  5008 slave.cpp:565] Agent resources: [{"name":"cpus","scalar":{"value":2.0},"type":"SCALAR"},{"name":"mem","scalar":{"value":1024.0},"type":"SCALAR"},{"name":"disk","scalar":{"value":1024.0},"type":"SCALAR"},{"name":"ports","ranges":{"range":[{"begin":31000,"end":32000}]},"type":"RANGES"}]
I0717 05:09:39.472559  5008 slave.cpp:573] Agent attributes: [  ]
I0717 05:09:39.472579  5008 slave.cpp:582] Agent hostname: 69941a2f94ab
I0717 05:09:39.472951  5005 status_update_manager.cpp:177] Pausing sending status updates
I0717 05:09:39.475072  5003 state.cpp:64] Recovering state from '/tmp/Endpoint_SlaveEndpointTest_UnauthorizedRequest_1_XfMkRo/meta'
I0717 05:09:39.475697  5007 status_update_manager.cpp:203] Recovering status update manager
I0717 05:09:39.476011  5003 containerizer.cpp:582] Recovering containerizer
I0717 05:09:39.478282  5007 provisioner.cpp:416] Provisioner recovery complete
I0717 05:09:39.479064  5003 slave.cpp:6229] Finished recovery
I0717 05:09:39.479723  5003 slave.cpp:6411] Querying resource estimator for oversubscribable
resources
I0717 05:09:39.480161  5005 slave.cpp:6425] Received oversubscribable resources {} from the
resource estimator
I0717 05:09:39.484725  5006 process.cpp:3820] Handling HTTP event for process 'slave(791)'
with path: '/slave(791)/monitor/statistics.json'
I0717 05:09:39.487363  5003 http.cpp:1133] HTTP GET for /slave(791)/monitor/statistics.json
from 172.17.0.2:51822
I0717 05:09:39.487493  5003 http.cpp:957] Authorizing principal 'test-principal' to GET the
'/monitor/statistics.json' endpoint
I0717 05:09:39.491324  5007 slave.cpp:843] Agent terminating
[       OK ] Endpoint/SlaveEndpointTest.UnauthorizedRequest/1 (47 ms)
[ RUN      ] Endpoint/SlaveEndpointTest.UnauthorizedRequest/2
I0717 05:09:39.507531  4982 containerizer.cpp:230] Using isolation: posix/cpu,posix/mem,filesystem/posix,network/cni,environment_secret
W0717 05:09:39.508360  4982 backend.cpp:76] Failed to create 'overlay' backend: OverlayBackend
requires root privileges
W0717 05:09:39.508564  4982 backend.cpp:76] Failed to create 'bind' backend: BindBackend requires
root privileges
I0717 05:09:39.508637  4982 provisioner.cpp:255] Using default backend 'copy'
I0717 05:09:39.514055  5005 slave.cpp:250] Mesos agent started on (792)@172.17.0.2:40793
I0717 05:09:39.514155  5005 slave.cpp:251] Flags at startup: --acls="" --appc_simple_discovery_uri_prefix="http://"
--appc_store_dir="/tmp/Endpoint_SlaveEndpointTest_UnauthorizedRequest_2_lhKLgq/store/appc"
--authenticate_http_readonly="true" --authenticate_http_readwrite="true" --authenticatee="crammd5"
--authentication_backoff_factor="1secs" --authorizer="local" --cgroups_cpu_enable_pids_and_tids_count="false"
--cgroups_enable_cfs="false" --cgroups_hierarchy="/sys/fs/cgroup" --cgroups_limit_swap="false"
--cgroups_root="mesos" --container_disk_watch_interval="15secs" --containerizers="mesos" --credential="/tmp/Endpoint_SlaveEndpointTest_UnauthorizedRequest_2_lhKLgq/credential"
--default_role="*" --disk_watch_interval="1mins" --docker="docker" --docker_kill_orphans="true"
--docker_registry="https://registry-1.docker.io" --docker_remove_delay="6hrs" --docker_socket="/var/run/docker.sock"
--docker_stop_timeout="0ns" --docker_store_dir="/tmp/Endpoint_SlaveEndpointTest_UnauthorizedRequest_2_lhKLgq/store/docker"
--docker_volume_checkpoint_dir="/var/run/mesos/isolators/docker/volume" --enforce_container_disk_quota="false"
--executor_registration_timeout="1mins" --executor_reregistration_timeout="2secs" --executor_shutdown_grace_period="5secs"
--fetcher_cache_dir="/tmp/Endpoint_SlaveEndpointTest_UnauthorizedRequest_2_lhKLgq/fetch" --fetcher_cache_size="2GB"
--frameworks_home="" --gc_delay="1weeks" --gc_disk_headroom="0.1" --hadoop_home="" --help="false"
--hostname_lookup="true" --http_command_executor="false" --http_credentials="/tmp/Endpoint_SlaveEndpointTest_UnauthorizedRequest_2_lhKLgq/http_credentials"
--http_heartbeat_interval="30secs" --initialize_driver_logging="true" --isolation="posix/cpu,posix/mem"
--launcher="posix" --launcher_dir="/mesos/mesos-1.4.0/_build/src" --logbufsecs="0" --logging_level="INFO"
--max_completed_executors_per_framework="150" --oversubscribed_resources_interval="15secs"
--perf_duration="10secs" --perf_interval="1mins" --port="5051" --qos_correction_interval_min="0ns"
--quiet="false" --recover="reconnect" --recovery_timeout="15mins" --registration_backoff_factor="10ms"
--resources="cpus:2;gpus:0;mem:1024;disk:1024;ports:[31000-32000]" --revocable_cpu_low_priority="true"
--runtime_dir="/tmp/Endpoint_SlaveEndpointTest_UnauthorizedRequest_2_lhKLgq" --sandbox_directory="/mnt/mesos/sandbox"
--strict="true" --switch_user="true" --systemd_enable_support="true" --systemd_runtime_directory="/run/systemd/system"
--version="false" --work_dir="/tmp/Endpoint_SlaveEndpointTest_UnauthorizedRequest_2_vDnTWp"
I0717 05:09:39.515084  5005 credentials.hpp:86] Loading credential for authentication from
'/tmp/Endpoint_SlaveEndpointTest_UnauthorizedRequest_2_lhKLgq/credential'
I0717 05:09:39.515426  5005 slave.cpp:283] Agent using credential for: test-principal
I0717 05:09:39.515482  5005 credentials.hpp:37] Loading credentials for authentication from
'/tmp/Endpoint_SlaveEndpointTest_UnauthorizedRequest_2_lhKLgq/http_credentials'
I0717 05:09:39.515900  5005 http.cpp:993] Creating default 'basic' HTTP authenticator for
realm 'mesos-agent-readonly'
I0717 05:09:39.516185  5005 http.cpp:993] Creating default 'basic' HTTP authenticator for
realm 'mesos-agent-readwrite'
I0717 05:09:39.518471  5005 slave.cpp:565] Agent resources: [{"name":"cpus","scalar":{"value":2.0},"type":"SCALAR"},{"name":"mem","scalar":{"value":1024.0},"type":"SCALAR"},{"name":"disk","scalar":{"value":1024.0},"type":"SCALAR"},{"name":"ports","ranges":{"range":[{"begin":31000,"end":32000}]},"type":"RANGES"}]
I0717 05:09:39.518946  5005 slave.cpp:573] Agent attributes: [  ]
I0717 05:09:39.518997  5005 slave.cpp:582] Agent hostname: 69941a2f94ab
I0717 05:09:39.519317  5003 status_update_manager.cpp:177] Pausing sending status updates
I0717 05:09:39.521237  5006 state.cpp:64] Recovering state from '/tmp/Endpoint_SlaveEndpointTest_UnauthorizedRequest_2_vDnTWp/meta'
I0717 05:09:39.521826  5002 status_update_manager.cpp:203] Recovering status update manager
I0717 05:09:39.522392  5005 containerizer.cpp:582] Recovering containerizer
I0717 05:09:39.524682  5003 provisioner.cpp:416] Provisioner recovery complete
I0717 05:09:39.525444  5004 slave.cpp:6229] Finished recovery
I0717 05:09:39.526175  5004 slave.cpp:6411] Querying resource estimator for oversubscribable
resources
I0717 05:09:39.526659  5006 slave.cpp:6425] Received oversubscribable resources {} from the
resource estimator
I0717 05:09:39.531447  5007 process.cpp:3820] Handling HTTP event for process 'slave(792)'
with path: '/slave(792)/containers'
I0717 05:09:39.534036  5007 http.cpp:1133] HTTP GET for /slave(792)/containers from 172.17.0.2:51824
I0717 05:09:39.534215  5007 http.cpp:957] Authorizing principal 'test-principal' to GET the
'/containers' endpoint
I0717 05:09:39.538594  4982 slave.cpp:843] Agent terminating
[       OK ] Endpoint/SlaveEndpointTest.UnauthorizedRequest/2 (68 ms)
[ RUN      ] Endpoint/SlaveEndpointTest.NoAuthorizer/0
I0717 05:09:39.575785  4982 containerizer.cpp:230] Using isolation: posix/cpu,posix/mem,filesystem/posix,network/cni,environment_secret
W0717 05:09:39.576650  4982 backend.cpp:76] Failed to create 'overlay' backend: OverlayBackend
requires root privileges
W0717 05:09:39.576838  4982 backend.cpp:76] Failed to create 'bind' backend: BindBackend requires
root privileges
I0717 05:09:39.576895  4982 provisioner.cpp:255] Using default backend 'copy'
I0717 05:09:39.579303  4982 cluster.cpp:448] Creating default 'local' authorizer
I0717 05:09:39.582213  5002 slave.cpp:250] Mesos agent started on (793)@172.17.0.2:40793
I0717 05:09:39.582255  5002 slave.cpp:251] Flags at startup: --acls="" --appc_simple_discovery_uri_prefix="http://"
--appc_store_dir="/tmp/Endpoint_SlaveEndpointTest_NoAuthorizer_0_RJWq8r/store/appc" --authenticate_http_readonly="true"
--authenticate_http_readwrite="true" --authenticatee="crammd5" --authentication_backoff_factor="1secs"
--authorizer="local" --cgroups_cpu_enable_pids_and_tids_count="false" --cgroups_enable_cfs="false"
--cgroups_hierarchy="/sys/fs/cgroup" --cgroups_limit_swap="false" --cgroups_root="mesos" --container_disk_watch_interval="15secs"
--containerizers="mesos" --credential="/tmp/Endpoint_SlaveEndpointTest_NoAuthorizer_0_RJWq8r/credential"
--default_role="*" --disk_watch_interval="1mins" --docker="docker" --docker_kill_orphans="true"
--docker_registry="https://registry-1.docker.io" --docker_remove_delay="6hrs" --docker_socket="/var/run/docker.sock"
--docker_stop_timeout="0ns" --docker_store_dir="/tmp/Endpoint_SlaveEndpointTest_NoAuthorizer_0_RJWq8r/store/docker"
--docker_volume_checkpoint_dir="/var/run/mesos/isolators/docker/volume" --enforce_container_disk_quota="false"
--executor_registration_timeout="1mins" --executor_reregistration_timeout="2secs" --executor_shutdown_grace_period="5secs"
--fetcher_cache_dir="/tmp/Endpoint_SlaveEndpointTest_NoAuthorizer_0_RJWq8r/fetch" --fetcher_cache_size="2GB"
--frameworks_home="" --gc_delay="1weeks" --gc_disk_headroom="0.1" --hadoop_home="" --help="false"
--hostname_lookup="true" --http_command_executor="false" --http_credentials="/tmp/Endpoint_SlaveEndpointTest_NoAuthorizer_0_RJWq8r/http_credentials"
--http_heartbeat_interval="30secs" --initialize_driver_logging="true" --isolation="posix/cpu,posix/mem"
--launcher="posix" --launcher_dir="/mesos/mesos-1.4.0/_build/src" --logbufsecs="0" --logging_level="INFO"
--max_completed_executors_per_framework="150" --oversubscribed_resources_interval="15secs"
--perf_duration="10secs" --perf_interval="1mins" --port="5051" --qos_correction_interval_min="0ns"
--quiet="false" --recover="reconnect" --recovery_timeout="15mins" --registration_backoff_factor="10ms"
--resources="cpus:2;gpus:0;mem:1024;disk:1024;ports:[31000-32000]" --revocable_cpu_low_priority="true"
--runtime_dir="/tmp/Endpoint_SlaveEndpointTest_NoAuthorizer_0_RJWq8r" --sandbox_directory="/mnt/mesos/sandbox"
--strict="true" --switch_user="true" --systemd_enable_support="true" --systemd_runtime_directory="/run/systemd/system"
--version="false" --work_dir="/tmp/Endpoint_SlaveEndpointTest_NoAuthorizer_0_XbazDr"
I0717 05:09:39.583173  5002 credentials.hpp:86] Loading credential for authentication from
'/tmp/Endpoint_SlaveEndpointTest_NoAuthorizer_0_RJWq8r/credential'
I0717 05:09:39.583753  5002 slave.cpp:283] Agent using credential for: test-principal
I0717 05:09:39.583793  5002 credentials.hpp:37] Loading credentials for authentication from
'/tmp/Endpoint_SlaveEndpointTest_NoAuthorizer_0_RJWq8r/http_credentials'
I0717 05:09:39.584640  5002 http.cpp:993] Creating default 'basic' HTTP authenticator for
realm 'mesos-agent-readonly'
I0717 05:09:39.585208  5002 http.cpp:993] Creating default 'basic' HTTP authenticator for
realm 'mesos-agent-readwrite'
I0717 05:09:39.587656  5002 slave.cpp:565] Agent resources: [{"name":"cpus","scalar":{"value":2.0},"type":"SCALAR"},{"name":"mem","scalar":{"value":1024.0},"type":"SCALAR"},{"name":"disk","scalar":{"value":1024.0},"type":"SCALAR"},{"name":"ports","ranges":{"range":[{"begin":31000,"end":32000}]},"type":"RANGES"}]
I0717 05:09:39.588088  5002 slave.cpp:573] Agent attributes: [  ]
I0717 05:09:39.588434  5002 slave.cpp:582] Agent hostname: 69941a2f94ab
I0717 05:09:39.588865  5005 status_update_manager.cpp:177] Pausing sending status updates
I0717 05:09:39.591065  5005 state.cpp:64] Recovering state from '/tmp/Endpoint_SlaveEndpointTest_NoAuthorizer_0_XbazDr/meta'
I0717 05:09:39.591748  5006 status_update_manager.cpp:203] Recovering status update manager
I0717 05:09:39.592075  5004 containerizer.cpp:582] Recovering containerizer
I0717 05:09:39.594512  5005 provisioner.cpp:416] Provisioner recovery complete
I0717 05:09:39.595196  5006 slave.cpp:6229] Finished recovery
I0717 05:09:39.595929  5006 slave.cpp:6411] Querying resource estimator for oversubscribable
resources
I0717 05:09:39.596325  5008 slave.cpp:6425] Received oversubscribable resources {} from the
resource estimator
I0717 05:09:39.601169  5007 process.cpp:3820] Handling HTTP event for process 'slave(793)'
with path: '/slave(793)/monitor/statistics'
I0717 05:09:39.603689  5007 http.cpp:1133] HTTP GET for /slave(793)/monitor/statistics from
172.17.0.2:51826
I0717 05:09:39.603910  5007 http.cpp:957] Authorizing principal 'test-principal' to GET the
'/monitor/statistics' endpoint
I0717 05:09:39.609217  5006 slave.cpp:843] Agent terminating
[       OK ] Endpoint/SlaveEndpointTest.NoAuthorizer/0 (51 ms)
[ RUN      ] Endpoint/SlaveEndpointTest.NoAuthorizer/1
I0717 05:09:39.627025  4982 containerizer.cpp:230] Using isolation: posix/cpu,posix/mem,filesystem/posix,network/cni,environment_secret
W0717 05:09:39.627868  4982 backend.cpp:76] Failed to create 'overlay' backend: OverlayBackend
requires root privileges
W0717 05:09:39.628092  4982 backend.cpp:76] Failed to create 'bind' backend: BindBackend requires
root privileges
I0717 05:09:39.628134  4982 provisioner.cpp:255] Using default backend 'copy'
I0717 05:09:39.630717  4982 cluster.cpp:448] Creating default 'local' authorizer
I0717 05:09:39.633572  5008 slave.cpp:250] Mesos agent started on (794)@172.17.0.2:40793
I0717 05:09:39.633612  5008 slave.cpp:251] Flags at startup: --acls="" --appc_simple_discovery_uri_prefix="http://"
--appc_store_dir="/tmp/Endpoint_SlaveEndpointTest_NoAuthorizer_1_t1NjAu/store/appc" --authenticate_http_readonly="true"
--authenticate_http_readwrite="true" --authenticatee="crammd5" --authentication_backoff_factor="1secs"
--authorizer="local" --cgroups_cpu_enable_pids_and_tids_count="false" --cgroups_enable_cfs="false"
--cgroups_hierarchy="/sys/fs/cgroup" --cgroups_limit_swap="false" --cgroups_root="mesos" --container_disk_watch_interval="15secs"
--containerizers="mesos" --credential="/tmp/Endpoint_SlaveEndpointTest_NoAuthorizer_1_t1NjAu/credential"
--default_role="*" --disk_watch_interval="1mins" --docker="docker" --docker_kill_orphans="true"
--docker_registry="https://registry-1.docker.io" --docker_remove_delay="6hrs" --docker_socket="/var/run/docker.sock"
--docker_stop_timeout="0ns" --docker_store_dir="/tmp/Endpoint_SlaveEndpointTest_NoAuthorizer_1_t1NjAu/store/docker"
--docker_volume_checkpoint_dir="/var/run/mesos/isolators/docker/volume" --enforce_container_disk_quota="false"
--executor_registration_timeout="1mins" --executor_reregistration_timeout="2secs" --executor_shutdown_grace_period="5secs"
--fetcher_cache_dir="/tmp/Endpoint_SlaveEndpointTest_NoAuthorizer_1_t1NjAu/fetch" --fetcher_cache_size="2GB"
--frameworks_home="" --gc_delay="1weeks" --gc_disk_headroom="0.1" --hadoop_home="" --help="false"
--hostname_lookup="true" --http_command_executor="false" --http_credentials="/tmp/Endpoint_SlaveEndpointTest_NoAuthorizer_1_t1NjAu/http_credentials"
--http_heartbeat_interval="30secs" --initialize_driver_logging="true" --isolation="posix/cpu,posix/mem"
--launcher="posix" --launcher_dir="/mesos/mesos-1.4.0/_build/src" --logbufsecs="0" --logging_level="INFO"
--max_completed_executors_per_framework="150" --oversubscribed_resources_interval="15secs"
--perf_duration="10secs" --perf_interval="1mins" --port="5051" --qos_correction_interval_min="0ns"
--quiet="false" --recover="reconnect" --recovery_timeout="15mins" --registration_backoff_factor="10ms"
--resources="cpus:2;gpus:0;mem:1024;disk:1024;ports:[31000-32000]" --revocable_cpu_low_priority="true"
--runtime_dir="/tmp/Endpoint_SlaveEndpointTest_NoAuthorizer_1_t1NjAu" --sandbox_directory="/mnt/mesos/sandbox"
--strict="true" --switch_user="true" --systemd_enable_support="true" --systemd_runtime_directory="/run/systemd/system"
--version="false" --work_dir="/tmp/Endpoint_SlaveEndpointTest_NoAuthorizer_1_fXP8Wt"
I0717 05:09:39.634461  5008 credentials.hpp:86] Loading credential for authentication from
'/tmp/Endpoint_SlaveEndpointTest_NoAuthorizer_1_t1NjAu/credential'
I0717 05:09:39.634884  5008 slave.cpp:283] Agent using credential for: test-principal
I0717 05:09:39.634912  5008 credentials.hpp:37] Loading credentials for authentication from
'/tmp/Endpoint_SlaveEndpointTest_NoAuthorizer_1_t1NjAu/http_credentials'
I0717 05:09:39.635368  5008 http.cpp:993] Creating default 'basic' HTTP authenticator for
realm 'mesos-agent-readonly'
I0717 05:09:39.635684  5008 http.cpp:993] Creating default 'basic' HTTP authenticator for
realm 'mesos-agent-readwrite'
I0717 05:09:39.638020  5008 slave.cpp:565] Agent resources: [{"name":"cpus","scalar":{"value":2.0},"type":"SCALAR"},{"name":"mem","scalar":{"value":1024.0},"type":"SCALAR"},{"name":"disk","scalar":{"value":1024.0},"type":"SCALAR"},{"name":"ports","ranges":{"range":[{"begin":31000,"end":32000}]},"type":"RANGES"}]
I0717 05:09:39.638450  5008 slave.cpp:573] Agent attributes: [  ]
I0717 05:09:39.638473  5008 slave.cpp:582] Agent hostname: 69941a2f94ab
I0717 05:09:39.638955  5003 status_update_manager.cpp:177] Pausing sending status updates
I0717 05:09:39.641013  5006 state.cpp:64] Recovering state from '/tmp/Endpoint_SlaveEndpointTest_NoAuthorizer_1_fXP8Wt/meta'
I0717 05:09:39.641923  5004 status_update_manager.cpp:203] Recovering status update manager
I0717 05:09:39.642360  5001 containerizer.cpp:582] Recovering containerizer
I0717 05:09:39.644815  5001 provisioner.cpp:416] Provisioner recovery complete
I0717 05:09:39.645774  5006 slave.cpp:6229] Finished recovery
I0717 05:09:39.646494  5006 slave.cpp:6411] Querying resource estimator for oversubscribable
resources
I0717 05:09:39.647606  5006 slave.cpp:6425] Received oversubscribable resources {} from the
resource estimator
I0717 05:09:39.652104  5002 process.cpp:3820] Handling HTTP event for process 'slave(794)'
with path: '/slave(794)/monitor/statistics.json'
I0717 05:09:39.654803  5005 http.cpp:1133] HTTP GET for /slave(794)/monitor/statistics.json
from 172.17.0.2:51828
I0717 05:09:39.654974  5005 http.cpp:957] Authorizing principal 'test-principal' to GET the
'/monitor/statistics.json' endpoint
I0717 05:09:39.660610  5001 slave.cpp:843] Agent terminating
[       OK ] Endpoint/SlaveEndpointTest.NoAuthorizer/1 (50 ms)
[ RUN      ] Endpoint/SlaveEndpointTest.NoAuthorizer/2
I0717 05:09:39.677163  4982 containerizer.cpp:230] Using isolation: posix/cpu,posix/mem,filesystem/posix,network/cni,environment_secret
W0717 05:09:39.678019  4982 backend.cpp:76] Failed to create 'overlay' backend: OverlayBackend
requires root privileges
W0717 05:09:39.678230  4982 backend.cpp:76] Failed to create 'bind' backend: BindBackend requires
root privileges
I0717 05:09:39.678287  4982 provisioner.cpp:255] Using default backend 'copy'
I0717 05:09:39.680950  4982 cluster.cpp:448] Creating default 'local' authorizer
I0717 05:09:39.683960  5005 slave.cpp:250] Mesos agent started on (795)@172.17.0.2:40793
I0717 05:09:39.684034  5005 slave.cpp:251] Flags at startup: --acls="" --appc_simple_discovery_uri_prefix="http://"
--appc_store_dir="/tmp/Endpoint_SlaveEndpointTest_NoAuthorizer_2_F5sKyx/store/appc" --authenticate_http_readonly="true"
--authenticate_http_readwrite="true" --authenticatee="crammd5" --authentication_backoff_factor="1secs"
--authorizer="local" --cgroups_cpu_enable_pids_and_tids_count="false" --cgroups_enable_cfs="false"
--cgroups_hierarchy="/sys/fs/cgroup" --cgroups_limit_swap="false" --cgroups_root="mesos" --container_disk_watch_interval="15secs"
--containerizers="mesos" --credential="/tmp/Endpoint_SlaveEndpointTest_NoAuthorizer_2_F5sKyx/credential"
--default_role="*" --disk_watch_interval="1mins" --docker="docker" --docker_kill_orphans="true"
--docker_registry="https://registry-1.docker.io" --docker_remove_delay="6hrs" --docker_socket="/var/run/docker.sock"
--docker_stop_timeout="0ns" --docker_store_dir="/tmp/Endpoint_SlaveEndpointTest_NoAuthorizer_2_F5sKyx/store/docker"
--docker_volume_checkpoint_dir="/var/run/mesos/isolators/docker/volume" --enforce_container_disk_quota="false"
--executor_registration_timeout="1mins" --executor_reregistration_timeout="2secs" --executor_shutdown_grace_period="5secs"
--fetcher_cache_dir="/tmp/Endpoint_SlaveEndpointTest_NoAuthorizer_2_F5sKyx/fetch" --fetcher_cache_size="2GB"
--frameworks_home="" --gc_delay="1weeks" --gc_disk_headroom="0.1" --hadoop_home="" --help="false"
--hostname_lookup="true" --http_command_executor="false" --http_credentials="/tmp/Endpoint_SlaveEndpointTest_NoAuthorizer_2_F5sKyx/http_credentials"
--http_heartbeat_interval="30secs" --initialize_driver_logging="true" --isolation="posix/cpu,posix/mem"
--launcher="posix" --launcher_dir="/mesos/mesos-1.4.0/_build/src" --logbufsecs="0" --logging_level="INFO"
--max_completed_executors_per_framework="150" --oversubscribed_resources_interval="15secs"
--perf_duration="10secs" --perf_interval="1mins" --port="5051" --qos_correction_interval_min="0ns"
--quiet="false" --recover="reconnect" --recovery_timeout="15mins" --registration_backoff_factor="10ms"
--resources="cpus:2;gpus:0;mem:1024;disk:1024;ports:[31000-32000]" --revocable_cpu_low_priority="true"
--runtime_dir="/tmp/Endpoint_SlaveEndpointTest_NoAuthorizer_2_F5sKyx" --sandbox_directory="/mnt/mesos/sandbox"
--strict="true" --switch_user="true" --systemd_enable_support="true" --systemd_runtime_directory="/run/systemd/system"
--version="false" --work_dir="/tmp/Endpoint_SlaveEndpointTest_NoAuthorizer_2_b5qsNw"
I0717 05:09:39.684862  5005 credentials.hpp:86] Loading credential for authentication from
'/tmp/Endpoint_SlaveEndpointTest_NoAuthorizer_2_F5sKyx/credential'
I0717 05:09:39.685176  5005 slave.cpp:283] Agent using credential for: test-principal
I0717 05:09:39.685235  5005 credentials.hpp:37] Loading credentials for authentication from
'/tmp/Endpoint_SlaveEndpointTest_NoAuthorizer_2_F5sKyx/http_credentials'
I0717 05:09:39.685706  5005 http.cpp:993] Creating default 'basic' HTTP authenticator for
realm 'mesos-agent-readonly'
I0717 05:09:39.685997  5005 http.cpp:993] Creating default 'basic' HTTP authenticator for
realm 'mesos-agent-readwrite'
I0717 05:09:39.688199  5005 slave.cpp:565] Agent resources: [{"name":"cpus","scalar":{"value":2.0},"type":"SCALAR"},{"name":"mem","scalar":{"value":1024.0},"type":"SCALAR"},{"name":"disk","scalar":{"value":1024.0},"type":"SCALAR"},{"name":"ports","ranges":{"range":[{"begin":31000,"end":32000}]},"type":"RANGES"}]
I0717 05:09:39.688716  5005 slave.cpp:573] Agent attributes: [  ]
I0717 05:09:39.688762  5005 slave.cpp:582] Agent hostname: 69941a2f94ab
I0717 05:09:39.689057  5003 status_update_manager.cpp:177] Pausing sending status updates
I0717 05:09:39.691128  5005 state.cpp:64] Recovering state from '/tmp/Endpoint_SlaveEndpointTest_NoAuthorizer_2_b5qsNw/meta'
I0717 05:09:39.691681  5003 status_update_manager.cpp:203] Recovering status update manager
I0717 05:09:39.692150  5004 containerizer.cpp:582] Recovering containerizer
I0717 05:09:39.694700  5001 provisioner.cpp:416] Provisioner recovery complete
I0717 05:09:39.695417  5007 slave.cpp:6229] Finished recovery
I0717 05:09:39.696159  5007 slave.cpp:6411] Querying resource estimator for oversubscribable
resources
I0717 05:09:39.696568  5001 slave.cpp:6425] Received oversubscribable resources {} from the
resource estimator
I0717 05:09:39.701398  5007 process.cpp:3820] Handling HTTP event for process 'slave(795)'
with path: '/slave(795)/containers'
I0717 05:09:39.703954  5007 http.cpp:1133] HTTP GET for /slave(795)/containers from 172.17.0.2:51830
I0717 05:09:39.704082  5007 http.cpp:957] Authorizing principal 'test-principal' to GET the
'/containers' endpoint
I0717 05:09:39.709549  5001 slave.cpp:843] Agent terminating
[       OK ] Endpoint/SlaveEndpointTest.NoAuthorizer/2 (49 ms)
[----------] 9 tests from Endpoint/SlaveEndpointTest (459 ms total)

[----------] Global test environment tear-down
[==========] 1636 tests from 179 test cases ran. (730223 ms total)
[  PASSED  ] 1632 tests.
[  FAILED  ] 4 tests, listed below:
[  FAILED  ] DefaultExecutorCheckTest.CommandCheckDeliveredAndReconciled
[  FAILED  ] DefaultExecutorCheckTest.CommandCheckStatusChange
[  FAILED  ] DefaultExecutorCheckTest.CommandCheckSeesParentsEnv
[  FAILED  ] DefaultExecutorCheckTest.CommandCheckSharesWorkDirWithTask

 4 FAILED TESTS
  YOU HAVE 20 DISABLED TESTS

I0717 05:09:39.854094  5009 process.cpp:993] Failed to accept socket: future discarded
make[4]: *** [check-local] Error 1
make[4]: Leaving directory `/mesos/mesos-1.4.0/_build/src'
make[3]: *** [check-am] Error 2
make[3]: Leaving directory `/mesos/mesos-1.4.0/_build/src'
make[2]: *** [check] Error 2
make[2]: Leaving directory `/mesos/mesos-1.4.0/_build/src'
make[1]: *** [check-recursive] Error 1
make[1]: Leaving directory `/mesos/mesos-1.4.0/_build'
make: *** [distcheck] Error 1
+ docker rmi mesos-1500262480-18534
Untagged: mesos-1500262480-18534:latest
Deleted: sha256:e13692c7df2f13e4118ebca2fb679a79e9346c19c3877e7601c69b9ff211842f
Deleted: sha256:c87090a5d89c86a4ca90a112506cb12c176efd3e52211f783473d38fdc8c67ae
Deleted: sha256:0251ce2d6ee09e025afc8a14bd524bd34159d1b9286291b1886ebdad1a22b33a
Deleted: sha256:bad6e3915b88fa35915d25d13f8d851f46cf71c6f89d72de4064362879ff31c7
Deleted: sha256:0c4b58174a16f9788a6fcfcb850b1b30f607fae51502e67750cb150c784838b3
Deleted: sha256:743345fbe00d7ff41af1f50568ea4dfeda25e8f80c375ce1eb776d744d4b6feb
Deleted: sha256:0e3f457b53cea77be95aa196f6282d31c2c07cca23786ea3a93a4f4343974d5f
Deleted: sha256:18b861e3c60f8c333087f39cac0916dc615df5e1e0f69418f842846b11c90e17
Deleted: sha256:f86b1bd1e93a6020ca977fc69b7f9b8dcd1ff5659bde1ec84751f858de579763
Deleted: sha256:3c1cf015178c9f39567500cd6eeae1da15c4d2b1179183b26d9e9f6ac1f299f1
Deleted: sha256:71436337886ab2b0c2ff208d831ad2e3200c13f2872f7744b2e0f2e0510158f7
Deleted: sha256:a4f41c5a802cd1ee6ea000b70fb7d1d7bca88a826703afbcf422af03fc55a9d5
Deleted: sha256:cb88b30ed4a7ded2638d1f431bb08fd3accedad07c6bcf4ac9ca63b8cc433c47
Deleted: sha256:b32884f58dbdb5e335675c9a81f556928b73eb24ea597dd9f98692ee7364530a
Deleted: sha256:cebf06765d7b4685c1863f15f0c8c6e3b483ef265e8bdda47e62990dc12b822e
Deleted: sha256:caace4fd325b7cb0b14a250a5dacc1c8ee46a5b141fd3917eff29afca897bc42
Deleted: sha256:42042aa8f0e10c4dff5dd2f7333462b013ae10df4191b525b707fd4e488ef70e
Deleted: sha256:bca9a1cb37e01dbac68b0318e5de7ee35fb5e4c79ce2fbbe42d6d9e23f91a91e
Deleted: sha256:8748c2adf0a471a32ef6c7f0673be403d1f6bccbca5c4708e1fad0ec2223fcfb
Deleted: sha256:91be8c14d0e91227ec5baef64365de927ec2747733713f2252a5447614ba88fe
Deleted: sha256:07fa12776aff9910a6f6f8bac18719d9e665b0f820f058d19ba8de4260485e66
Deleted: sha256:47a582fc33abd6a41fcf10b27228793bd8b1e4d2c73185ee31fe8acf8d10b560
Deleted: sha256:8b96d16451df981c39dd7146856993ad8cc85b0d2f0cf81892a92b60ed3ad620
Deleted: sha256:f8a169c7d3b4a286e6b18285e7c20a59140286e34f8cc6c65efba1f0bbf19938
Build step 'Execute shell' marked build as failure

Mime
View raw message