mesos-builds mailing list archives

Site index · List index
Message view « Date » · « Thread »
Top « Date » · « Thread »
From Apache Jenkins Server <jenk...@builds.apache.org>
Subject Build failed in Jenkins: Mesos-Buildbot » autotools,gcc,--verbose,GLOG_v=1 MESOS_VERBOSE=1,centos:7,(ubuntu)&&(!ubuntu-us1)&&(!ubuntu-eu2) #3856
Date Sat, 01 Jul 2017 13:30:16 GMT
See <https://builds.apache.org/job/Mesos-Buildbot/BUILDTOOL=autotools,COMPILER=gcc,CONFIGURATION=--verbose,ENVIRONMENT=GLOG_v=1%20MESOS_VERBOSE=1,OS=centos%3A7,label_exp=(ubuntu)&&(!ubuntu-us1)&&(!ubuntu-eu2)/3856/display/redirect?page=changes>

Changes:

[yujie.jay] Add bounding_capabilities to LinuxInfo.

[yujie.jay] Add bounding set support to linux/capabilities tests.

[yujie.jay] Allow frameworks to specify the capabilities bounding set.

[yujie.jay] Add more linux/capabilities isolator test cases.

[yujie.jay] Rename and deprecate the LinuxInfo capability_info field.

[yujie.jay] Update documentation for framework bounding capabilities.

[yujie.jay] Update mesos-execute capabilities options.

[gregorywmann] Added filtering to the '/tasks' endpoint.

------------------------------------------
[...truncated 29.29 MB...]
W0701 13:30:07.418431  6295 backend.cpp:76] Failed to create 'bind' backend: BindBackend requires
root privileges
I0701 13:30:07.418468  6295 provisioner.cpp:255] Using default backend 'copy'
I0701 13:30:07.422443  6324 slave.cpp:250] Mesos agent started on (769)@172.17.0.6:45414
I0701 13:30:07.422472  6324 slave.cpp:251] Flags at startup: --acls="" --appc_simple_discovery_uri_prefix="http://"
--appc_store_dir="/tmp/Endpoint_SlaveEndpointTest_AuthorizedRequest_2_4jsfJ9/store/appc" --authenticate_http_readonly="true"
--authenticate_http_readwrite="true" --authenticatee="crammd5" --authentication_backoff_factor="1secs"
--authorizer="local" --cgroups_cpu_enable_pids_and_tids_count="false" --cgroups_enable_cfs="false"
--cgroups_hierarchy="/sys/fs/cgroup" --cgroups_limit_swap="false" --cgroups_root="mesos" --container_disk_watch_interval="15secs"
--containerizers="mesos" --credential="/tmp/Endpoint_SlaveEndpointTest_AuthorizedRequest_2_4jsfJ9/credential"
--default_role="*" --disk_watch_interval="1mins" --docker="docker" --docker_kill_orphans="true"
--docker_registry="https://registry-1.docker.io" --docker_remove_delay="6hrs" --docker_socket="/var/run/docker.sock"
--docker_stop_timeout="0ns" --docker_store_dir="/tmp/Endpoint_SlaveEndpointTest_AuthorizedRequest_2_4jsfJ9/store/docker"
--docker_volume_checkpoint_dir="/var/run/mesos/isolators/docker/volume" --enforce_container_disk_quota="false"
--executor_registration_timeout="1mins" --executor_reregistration_timeout="2secs" --executor_shutdown_grace_period="5secs"
--fetcher_cache_dir="/tmp/Endpoint_SlaveEndpointTest_AuthorizedRequest_2_4jsfJ9/fetch" --fetcher_cache_size="2GB"
--frameworks_home="" --gc_delay="1weeks" --gc_disk_headroom="0.1" --hadoop_home="" --help="false"
--hostname_lookup="true" --http_command_executor="false" --http_credentials="/tmp/Endpoint_SlaveEndpointTest_AuthorizedRequest_2_4jsfJ9/http_credentials"
--http_heartbeat_interval="30secs" --initialize_driver_logging="true" --isolation="posix/cpu,posix/mem"
--launcher="posix" --launcher_dir="/mesos/mesos-1.4.0/_build/src" --logbufsecs="0" --logging_level="INFO"
--max_completed_executors_per_framework="150" --oversubscribed_resources_interval="15secs"
--perf_duration="10secs" --perf_interval="1mins" --port="5051" --qos_correction_interval_min="0ns"
--quiet="false" --recover="reconnect" --recovery_timeout="15mins" --registration_backoff_factor="10ms"
--resources="cpus:2;gpus:0;mem:1024;disk:1024;ports:[31000-32000]" --revocable_cpu_low_priority="true"
--runtime_dir="/tmp/Endpoint_SlaveEndpointTest_AuthorizedRequest_2_4jsfJ9" --sandbox_directory="/mnt/mesos/sandbox"
--strict="true" --switch_user="true" --systemd_enable_support="true" --systemd_runtime_directory="/run/systemd/system"
--version="false" --work_dir="/tmp/Endpoint_SlaveEndpointTest_AuthorizedRequest_2_BA3TnH"
I0701 13:30:07.423049  6324 credentials.hpp:86] Loading credential for authentication from
'/tmp/Endpoint_SlaveEndpointTest_AuthorizedRequest_2_4jsfJ9/credential'
I0701 13:30:07.423274  6324 slave.cpp:283] Agent using credential for: test-principal
I0701 13:30:07.423295  6324 credentials.hpp:37] Loading credentials for authentication from
'/tmp/Endpoint_SlaveEndpointTest_AuthorizedRequest_2_4jsfJ9/http_credentials'
I0701 13:30:07.423545  6324 http.cpp:976] Creating default 'basic' HTTP authenticator for
realm 'mesos-agent-readonly'
I0701 13:30:07.423718  6324 http.cpp:976] Creating default 'basic' HTTP authenticator for
realm 'mesos-agent-readwrite'
I0701 13:30:07.425104  6324 slave.cpp:565] Agent resources: [{"name":"cpus","scalar":{"value":2.0},"type":"SCALAR"},{"name":"mem","scalar":{"value":1024.0},"type":"SCALAR"},{"name":"disk","scalar":{"value":1024.0},"type":"SCALAR"},{"name":"ports","ranges":{"range":[{"begin":31000,"end":32000}]},"type":"RANGES"}]
I0701 13:30:07.425365  6324 slave.cpp:573] Agent attributes: [  ]
I0701 13:30:07.425380  6324 slave.cpp:578] Agent hostname: 6b4a72ade56a
I0701 13:30:07.425518  6334 status_update_manager.cpp:177] Pausing sending status updates
I0701 13:30:07.427142  6315 state.cpp:64] Recovering state from '/tmp/Endpoint_SlaveEndpointTest_AuthorizedRequest_2_BA3TnH/meta'
I0701 13:30:07.427593  6320 status_update_manager.cpp:203] Recovering status update manager
I0701 13:30:07.427775  6324 containerizer.cpp:582] Recovering containerizer
I0701 13:30:07.429299  6316 provisioner.cpp:416] Provisioner recovery complete
I0701 13:30:07.429713  6315 slave.cpp:6189] Finished recovery
I0701 13:30:07.430254  6315 slave.cpp:6371] Querying resource estimator for oversubscribable
resources
I0701 13:30:07.430670  6321 slave.cpp:6385] Received oversubscribable resources {} from the
resource estimator
I0701 13:30:07.433545  6314 process.cpp:3779] Handling HTTP event for process 'slave(769)'
with path: '/slave(769)/containers'
I0701 13:30:07.435075  6325 http.cpp:1116] HTTP GET for /slave(769)/containers from 172.17.0.6:48312
I0701 13:30:07.435173  6325 http.cpp:937] Authorizing principal 'test-principal' to GET the
'/containers' endpoint
I0701 13:30:07.439088  6319 slave.cpp:839] Agent terminating
[       OK ] Endpoint/SlaveEndpointTest.AuthorizedRequest/2 (33 ms)
[ RUN      ] Endpoint/SlaveEndpointTest.UnauthorizedRequest/0
I0701 13:30:07.451364  6295 containerizer.cpp:230] Using isolation: posix/cpu,posix/mem,filesystem/posix,network/cni,environment_secret
W0701 13:30:07.452093  6295 backend.cpp:76] Failed to create 'aufs' backend: AufsBackend requires
root privileges
W0701 13:30:07.452220  6295 backend.cpp:76] Failed to create 'bind' backend: BindBackend requires
root privileges
I0701 13:30:07.452263  6295 provisioner.cpp:255] Using default backend 'copy'
I0701 13:30:07.456413  6329 slave.cpp:250] Mesos agent started on (770)@172.17.0.6:45414
I0701 13:30:07.456648  6329 slave.cpp:251] Flags at startup: --acls="" --appc_simple_discovery_uri_prefix="http://"
--appc_store_dir="/tmp/Endpoint_SlaveEndpointTest_UnauthorizedRequest_0_IOlfnZ/store/appc"
--authenticate_http_readonly="true" --authenticate_http_readwrite="true" --authenticatee="crammd5"
--authentication_backoff_factor="1secs" --authorizer="local" --cgroups_cpu_enable_pids_and_tids_count="false"
--cgroups_enable_cfs="false" --cgroups_hierarchy="/sys/fs/cgroup" --cgroups_limit_swap="false"
--cgroups_root="mesos" --container_disk_watch_interval="15secs" --containerizers="mesos" --credential="/tmp/Endpoint_SlaveEndpointTest_UnauthorizedRequest_0_IOlfnZ/credential"
--default_role="*" --disk_watch_interval="1mins" --docker="docker" --docker_kill_orphans="true"
--docker_registry="https://registry-1.docker.io" --docker_remove_delay="6hrs" --docker_socket="/var/run/docker.sock"
--docker_stop_timeout="0ns" --docker_store_dir="/tmp/Endpoint_SlaveEndpointTest_UnauthorizedRequest_0_IOlfnZ/store/docker"
--docker_volume_checkpoint_dir="/var/run/mesos/isolators/docker/volume" --enforce_container_disk_quota="false"
--executor_registration_timeout="1mins" --executor_reregistration_timeout="2secs" --executor_shutdown_grace_period="5secs"
--fetcher_cache_dir="/tmp/Endpoint_SlaveEndpointTest_UnauthorizedRequest_0_IOlfnZ/fetch" --fetcher_cache_size="2GB"
--frameworks_home="" --gc_delay="1weeks" --gc_disk_headroom="0.1" --hadoop_home="" --help="false"
--hostname_lookup="true" --http_command_executor="false" --http_credentials="/tmp/Endpoint_SlaveEndpointTest_UnauthorizedRequest_0_IOlfnZ/http_credentials"
--http_heartbeat_interval="30secs" --initialize_driver_logging="true" --isolation="posix/cpu,posix/mem"
--launcher="posix" --launcher_dir="/mesos/mesos-1.4.0/_build/src" --logbufsecs="0" --logging_level="INFO"
--max_completed_executors_per_framework="150" --oversubscribed_resources_interval="15secs"
--perf_duration="10secs" --perf_interval="1mins" --port="5051" --qos_correction_interval_min="0ns"
--quiet="false" --recover="reconnect" --recovery_timeout="15mins" --registration_backoff_factor="10ms"
--resources="cpus:2;gpus:0;mem:1024;disk:1024;ports:[31000-32000]" --revocable_cpu_low_priority="true"
--runtime_dir="/tmp/Endpoint_SlaveEndpointTest_UnauthorizedRequest_0_IOlfnZ" --sandbox_directory="/mnt/mesos/sandbox"
--strict="true" --switch_user="true" --systemd_enable_support="true" --systemd_runtime_directory="/run/systemd/system"
--version="false" --work_dir="/tmp/Endpoint_SlaveEndpointTest_UnauthorizedRequest_0_tKYYWw"
I0701 13:30:07.457067  6329 credentials.hpp:86] Loading credential for authentication from
'/tmp/Endpoint_SlaveEndpointTest_UnauthorizedRequest_0_IOlfnZ/credential'
I0701 13:30:07.457350  6329 slave.cpp:283] Agent using credential for: test-principal
I0701 13:30:07.457382  6329 credentials.hpp:37] Loading credentials for authentication from
'/tmp/Endpoint_SlaveEndpointTest_UnauthorizedRequest_0_IOlfnZ/http_credentials'
I0701 13:30:07.457679  6329 http.cpp:976] Creating default 'basic' HTTP authenticator for
realm 'mesos-agent-readonly'
I0701 13:30:07.457887  6329 http.cpp:976] Creating default 'basic' HTTP authenticator for
realm 'mesos-agent-readwrite'
I0701 13:30:07.462393  6329 slave.cpp:565] Agent resources: [{"name":"cpus","scalar":{"value":2.0},"type":"SCALAR"},{"name":"mem","scalar":{"value":1024.0},"type":"SCALAR"},{"name":"disk","scalar":{"value":1024.0},"type":"SCALAR"},{"name":"ports","ranges":{"range":[{"begin":31000,"end":32000}]},"type":"RANGES"}]
I0701 13:30:07.462679  6329 slave.cpp:573] Agent attributes: [  ]
I0701 13:30:07.462704  6329 slave.cpp:578] Agent hostname: 6b4a72ade56a
I0701 13:30:07.463027  6323 status_update_manager.cpp:177] Pausing sending status updates
I0701 13:30:07.465013  6316 state.cpp:64] Recovering state from '/tmp/Endpoint_SlaveEndpointTest_UnauthorizedRequest_0_tKYYWw/meta'
I0701 13:30:07.465571  6314 status_update_manager.cpp:203] Recovering status update manager
I0701 13:30:07.465804  6314 containerizer.cpp:582] Recovering containerizer
I0701 13:30:07.467720  6314 provisioner.cpp:416] Provisioner recovery complete
I0701 13:30:07.468302  6314 slave.cpp:6189] Finished recovery
I0701 13:30:07.468844  6314 slave.cpp:6371] Querying resource estimator for oversubscribable
resources
I0701 13:30:07.469679  6314 slave.cpp:6385] Received oversubscribable resources {} from the
resource estimator
I0701 13:30:07.477391  6331 process.cpp:3779] Handling HTTP event for process 'slave(770)'
with path: '/slave(770)/monitor/statistics'
I0701 13:30:07.478880  6335 http.cpp:1116] HTTP GET for /slave(770)/monitor/statistics from
172.17.0.6:48316
I0701 13:30:07.478986  6335 http.cpp:937] Authorizing principal 'test-principal' to GET the
'/monitor/statistics' endpoint
I0701 13:30:07.481739  6322 slave.cpp:839] Agent terminating
[       OK ] Endpoint/SlaveEndpointTest.UnauthorizedRequest/0 (45 ms)
[ RUN      ] Endpoint/SlaveEndpointTest.UnauthorizedRequest/1
I0701 13:30:07.494899  6295 containerizer.cpp:230] Using isolation: posix/cpu,posix/mem,filesystem/posix,network/cni,environment_secret
W0701 13:30:07.495525  6295 backend.cpp:76] Failed to create 'aufs' backend: AufsBackend requires
root privileges
W0701 13:30:07.495666  6295 backend.cpp:76] Failed to create 'bind' backend: BindBackend requires
root privileges
I0701 13:30:07.495708  6295 provisioner.cpp:255] Using default backend 'copy'
I0701 13:30:07.500425  6329 slave.cpp:250] Mesos agent started on (771)@172.17.0.6:45414
I0701 13:30:07.500470  6329 slave.cpp:251] Flags at startup: --acls="" --appc_simple_discovery_uri_prefix="http://"
--appc_store_dir="/tmp/Endpoint_SlaveEndpointTest_UnauthorizedRequest_1_5k2VqP/store/appc"
--authenticate_http_readonly="true" --authenticate_http_readwrite="true" --authenticatee="crammd5"
--authentication_backoff_factor="1secs" --authorizer="local" --cgroups_cpu_enable_pids_and_tids_count="false"
--cgroups_enable_cfs="false" --cgroups_hierarchy="/sys/fs/cgroup" --cgroups_limit_swap="false"
--cgroups_root="mesos" --container_disk_watch_interval="15secs" --containerizers="mesos" --credential="/tmp/Endpoint_SlaveEndpointTest_UnauthorizedRequest_1_5k2VqP/credential"
--default_role="*" --disk_watch_interval="1mins" --docker="docker" --docker_kill_orphans="true"
--docker_registry="https://registry-1.docker.io" --docker_remove_delay="6hrs" --docker_socket="/var/run/docker.sock"
--docker_stop_timeout="0ns" --docker_store_dir="/tmp/Endpoint_SlaveEndpointTest_UnauthorizedRequest_1_5k2VqP/store/docker"
--docker_volume_checkpoint_dir="/var/run/mesos/isolators/docker/volume" --enforce_container_disk_quota="false"
--executor_registration_timeout="1mins" --executor_reregistration_timeout="2secs" --executor_shutdown_grace_period="5secs"
--fetcher_cache_dir="/tmp/Endpoint_SlaveEndpointTest_UnauthorizedRequest_1_5k2VqP/fetch" --fetcher_cache_size="2GB"
--frameworks_home="" --gc_delay="1weeks" --gc_disk_headroom="0.1" --hadoop_home="" --help="false"
--hostname_lookup="true" --http_command_executor="false" --http_credentials="/tmp/Endpoint_SlaveEndpointTest_UnauthorizedRequest_1_5k2VqP/http_credentials"
--http_heartbeat_interval="30secs" --initialize_driver_logging="true" --isolation="posix/cpu,posix/mem"
--launcher="posix" --launcher_dir="/mesos/mesos-1.4.0/_build/src" --logbufsecs="0" --logging_level="INFO"
--max_completed_executors_per_framework="150" --oversubscribed_resources_interval="15secs"
--perf_duration="10secs" --perf_interval="1mins" --port="5051" --qos_correction_interval_min="0ns"
--quiet="false" --recover="reconnect" --recovery_timeout="15mins" --registration_backoff_factor="10ms"
--resources="cpus:2;gpus:0;mem:1024;disk:1024;ports:[31000-32000]" --revocable_cpu_low_priority="true"
--runtime_dir="/tmp/Endpoint_SlaveEndpointTest_UnauthorizedRequest_1_5k2VqP" --sandbox_directory="/mnt/mesos/sandbox"
--strict="true" --switch_user="true" --systemd_enable_support="true" --systemd_runtime_directory="/run/systemd/system"
--version="false" --work_dir="/tmp/Endpoint_SlaveEndpointTest_UnauthorizedRequest_1_X7V2Tm"
I0701 13:30:07.500990  6329 credentials.hpp:86] Loading credential for authentication from
'/tmp/Endpoint_SlaveEndpointTest_UnauthorizedRequest_1_5k2VqP/credential'
I0701 13:30:07.501258  6329 slave.cpp:283] Agent using credential for: test-principal
I0701 13:30:07.501287  6329 credentials.hpp:37] Loading credentials for authentication from
'/tmp/Endpoint_SlaveEndpointTest_UnauthorizedRequest_1_5k2VqP/http_credentials'
I0701 13:30:07.501607  6329 http.cpp:976] Creating default 'basic' HTTP authenticator for
realm 'mesos-agent-readonly'
I0701 13:30:07.501790  6329 http.cpp:976] Creating default 'basic' HTTP authenticator for
realm 'mesos-agent-readwrite'
I0701 13:30:07.503453  6329 slave.cpp:565] Agent resources: [{"name":"cpus","scalar":{"value":2.0},"type":"SCALAR"},{"name":"mem","scalar":{"value":1024.0},"type":"SCALAR"},{"name":"disk","scalar":{"value":1024.0},"type":"SCALAR"},{"name":"ports","ranges":{"range":[{"begin":31000,"end":32000}]},"type":"RANGES"}]
I0701 13:30:07.503778  6329 slave.cpp:573] Agent attributes: [  ]
I0701 13:30:07.503799  6329 slave.cpp:578] Agent hostname: 6b4a72ade56a
I0701 13:30:07.505717  6330 status_update_manager.cpp:177] Pausing sending status updates
I0701 13:30:07.506662  6329 state.cpp:64] Recovering state from '/tmp/Endpoint_SlaveEndpointTest_UnauthorizedRequest_1_X7V2Tm/meta'
I0701 13:30:07.507248  6329 status_update_manager.cpp:203] Recovering status update manager
I0701 13:30:07.507442  6329 containerizer.cpp:582] Recovering containerizer
I0701 13:30:07.509557  6330 provisioner.cpp:416] Provisioner recovery complete
I0701 13:30:07.510181  6330 slave.cpp:6189] Finished recovery
I0701 13:30:07.510767  6330 slave.cpp:6371] Querying resource estimator for oversubscribable
resources
I0701 13:30:07.511531  6330 slave.cpp:6385] Received oversubscribable resources {} from the
resource estimator
I0701 13:30:07.516280  6321 process.cpp:3779] Handling HTTP event for process 'slave(771)'
with path: '/slave(771)/monitor/statistics.json'
I0701 13:30:07.518363  6321 http.cpp:1116] HTTP GET for /slave(771)/monitor/statistics.json
from 172.17.0.6:48318
I0701 13:30:07.518448  6321 http.cpp:937] Authorizing principal 'test-principal' to GET the
'/monitor/statistics.json' endpoint
I0701 13:30:07.525797  6295 slave.cpp:839] Agent terminating
[       OK ] Endpoint/SlaveEndpointTest.UnauthorizedRequest/1 (48 ms)
[ RUN      ] Endpoint/SlaveEndpointTest.UnauthorizedRequest/2
I0701 13:30:07.543931  6295 containerizer.cpp:230] Using isolation: posix/cpu,posix/mem,filesystem/posix,network/cni,environment_secret
W0701 13:30:07.544633  6295 backend.cpp:76] Failed to create 'aufs' backend: AufsBackend requires
root privileges
W0701 13:30:07.544759  6295 backend.cpp:76] Failed to create 'bind' backend: BindBackend requires
root privileges
I0701 13:30:07.544808  6295 provisioner.cpp:255] Using default backend 'copy'
I0701 13:30:07.550878  6319 slave.cpp:250] Mesos agent started on (772)@172.17.0.6:45414
I0701 13:30:07.550901  6319 slave.cpp:251] Flags at startup: --acls="" --appc_simple_discovery_uri_prefix="http://"
--appc_store_dir="/tmp/Endpoint_SlaveEndpointTest_UnauthorizedRequest_2_qMWyWF/store/appc"
--authenticate_http_readonly="true" --authenticate_http_readwrite="true" --authenticatee="crammd5"
--authentication_backoff_factor="1secs" --authorizer="local" --cgroups_cpu_enable_pids_and_tids_count="false"
--cgroups_enable_cfs="false" --cgroups_hierarchy="/sys/fs/cgroup" --cgroups_limit_swap="false"
--cgroups_root="mesos" --container_disk_watch_interval="15secs" --containerizers="mesos" --credential="/tmp/Endpoint_SlaveEndpointTest_UnauthorizedRequest_2_qMWyWF/credential"
--default_role="*" --disk_watch_interval="1mins" --docker="docker" --docker_kill_orphans="true"
--docker_registry="https://registry-1.docker.io" --docker_remove_delay="6hrs" --docker_socket="/var/run/docker.sock"
--docker_stop_timeout="0ns" --docker_store_dir="/tmp/Endpoint_SlaveEndpointTest_UnauthorizedRequest_2_qMWyWF/store/docker"
--docker_volume_checkpoint_dir="/var/run/mesos/isolators/docker/volume" --enforce_container_disk_quota="false"
--executor_registration_timeout="1mins" --executor_reregistration_timeout="2secs" --executor_shutdown_grace_period="5secs"
--fetcher_cache_dir="/tmp/Endpoint_SlaveEndpointTest_UnauthorizedRequest_2_qMWyWF/fetch" --fetcher_cache_size="2GB"
--frameworks_home="" --gc_delay="1weeks" --gc_disk_headroom="0.1" --hadoop_home="" --help="false"
--hostname_lookup="true" --http_command_executor="false" --http_credentials="/tmp/Endpoint_SlaveEndpointTest_UnauthorizedRequest_2_qMWyWF/http_credentials"
--http_heartbeat_interval="30secs" --initialize_driver_logging="true" --isolation="posix/cpu,posix/mem"
--launcher="posix" --launcher_dir="/mesos/mesos-1.4.0/_build/src" --logbufsecs="0" --logging_level="INFO"
--max_completed_executors_per_framework="150" --oversubscribed_resources_interval="15secs"
--perf_duration="10secs" --perf_interval="1mins" --port="5051" --qos_correction_interval_min="0ns"
--quiet="false" --recover="reconnect" --recovery_timeout="15mins" --registration_backoff_factor="10ms"
--resources="cpus:2;gpus:0;mem:1024;disk:1024;ports:[31000-32000]" --revocable_cpu_low_priority="true"
--runtime_dir="/tmp/Endpoint_SlaveEndpointTest_UnauthorizedRequest_2_qMWyWF" --sandbox_directory="/mnt/mesos/sandbox"
--strict="true" --switch_user="true" --systemd_enable_support="true" --systemd_runtime_directory="/run/systemd/system"
--version="false" --work_dir="/tmp/Endpoint_SlaveEndpointTest_UnauthorizedRequest_2_WwLqid"
I0701 13:30:07.551364  6319 credentials.hpp:86] Loading credential for authentication from
'/tmp/Endpoint_SlaveEndpointTest_UnauthorizedRequest_2_qMWyWF/credential'
I0701 13:30:07.551548  6319 slave.cpp:283] Agent using credential for: test-principal
I0701 13:30:07.551571  6319 credentials.hpp:37] Loading credentials for authentication from
'/tmp/Endpoint_SlaveEndpointTest_UnauthorizedRequest_2_qMWyWF/http_credentials'
I0701 13:30:07.551853  6319 http.cpp:976] Creating default 'basic' HTTP authenticator for
realm 'mesos-agent-readonly'
I0701 13:30:07.552003  6319 http.cpp:976] Creating default 'basic' HTTP authenticator for
realm 'mesos-agent-readwrite'
I0701 13:30:07.553529  6319 slave.cpp:565] Agent resources: [{"name":"cpus","scalar":{"value":2.0},"type":"SCALAR"},{"name":"mem","scalar":{"value":1024.0},"type":"SCALAR"},{"name":"disk","scalar":{"value":1024.0},"type":"SCALAR"},{"name":"ports","ranges":{"range":[{"begin":31000,"end":32000}]},"type":"RANGES"}]
I0701 13:30:07.553812  6319 slave.cpp:573] Agent attributes: [  ]
I0701 13:30:07.553831  6319 slave.cpp:578] Agent hostname: 6b4a72ade56a
I0701 13:30:07.555842  6319 status_update_manager.cpp:177] Pausing sending status updates
I0701 13:30:07.556552  6319 state.cpp:64] Recovering state from '/tmp/Endpoint_SlaveEndpointTest_UnauthorizedRequest_2_WwLqid/meta'
I0701 13:30:07.557025  6319 status_update_manager.cpp:203] Recovering status update manager
I0701 13:30:07.557212  6319 containerizer.cpp:582] Recovering containerizer
I0701 13:30:07.559216  6319 provisioner.cpp:416] Provisioner recovery complete
I0701 13:30:07.559729  6319 slave.cpp:6189] Finished recovery
I0701 13:30:07.560166  6319 slave.cpp:6371] Querying resource estimator for oversubscribable
resources
I0701 13:30:07.560793  6319 slave.cpp:6385] Received oversubscribable resources {} from the
resource estimator
I0701 13:30:07.564435  6318 process.cpp:3779] Handling HTTP event for process 'slave(772)'
with path: '/slave(772)/containers'
I0701 13:30:07.565892  6318 http.cpp:1116] HTTP GET for /slave(772)/containers from 172.17.0.6:48320
I0701 13:30:07.565971  6318 http.cpp:937] Authorizing principal 'test-principal' to GET the
'/containers' endpoint
I0701 13:30:07.568634  6330 slave.cpp:839] Agent terminating
[       OK ] Endpoint/SlaveEndpointTest.UnauthorizedRequest/2 (36 ms)
[ RUN      ] Endpoint/SlaveEndpointTest.NoAuthorizer/0
I0701 13:30:07.580107  6295 containerizer.cpp:230] Using isolation: posix/cpu,posix/mem,filesystem/posix,network/cni,environment_secret
W0701 13:30:07.580569  6295 backend.cpp:76] Failed to create 'aufs' backend: AufsBackend requires
root privileges
W0701 13:30:07.580672  6295 backend.cpp:76] Failed to create 'bind' backend: BindBackend requires
root privileges
I0701 13:30:07.580714  6295 provisioner.cpp:255] Using default backend 'copy'
I0701 13:30:07.582535  6295 cluster.cpp:448] Creating default 'local' authorizer
I0701 13:30:07.584141  6316 slave.cpp:250] Mesos agent started on (773)@172.17.0.6:45414
I0701 13:30:07.584163  6316 slave.cpp:251] Flags at startup: --acls="" --appc_simple_discovery_uri_prefix="http://"
--appc_store_dir="/tmp/Endpoint_SlaveEndpointTest_NoAuthorizer_0_uf1ZPw/store/appc" --authenticate_http_readonly="true"
--authenticate_http_readwrite="true" --authenticatee="crammd5" --authentication_backoff_factor="1secs"
--authorizer="local" --cgroups_cpu_enable_pids_and_tids_count="false" --cgroups_enable_cfs="false"
--cgroups_hierarchy="/sys/fs/cgroup" --cgroups_limit_swap="false" --cgroups_root="mesos" --container_disk_watch_interval="15secs"
--containerizers="mesos" --credential="/tmp/Endpoint_SlaveEndpointTest_NoAuthorizer_0_uf1ZPw/credential"
--default_role="*" --disk_watch_interval="1mins" --docker="docker" --docker_kill_orphans="true"
--docker_registry="https://registry-1.docker.io" --docker_remove_delay="6hrs" --docker_socket="/var/run/docker.sock"
--docker_stop_timeout="0ns" --docker_store_dir="/tmp/Endpoint_SlaveEndpointTest_NoAuthorizer_0_uf1ZPw/store/docker"
--docker_volume_checkpoint_dir="/var/run/mesos/isolators/docker/volume" --enforce_container_disk_quota="false"
--executor_registration_timeout="1mins" --executor_reregistration_timeout="2secs" --executor_shutdown_grace_period="5secs"
--fetcher_cache_dir="/tmp/Endpoint_SlaveEndpointTest_NoAuthorizer_0_uf1ZPw/fetch" --fetcher_cache_size="2GB"
--frameworks_home="" --gc_delay="1weeks" --gc_disk_headroom="0.1" --hadoop_home="" --help="false"
--hostname_lookup="true" --http_command_executor="false" --http_credentials="/tmp/Endpoint_SlaveEndpointTest_NoAuthorizer_0_uf1ZPw/http_credentials"
--http_heartbeat_interval="30secs" --initialize_driver_logging="true" --isolation="posix/cpu,posix/mem"
--launcher="posix" --launcher_dir="/mesos/mesos-1.4.0/_build/src" --logbufsecs="0" --logging_level="INFO"
--max_completed_executors_per_framework="150" --oversubscribed_resources_interval="15secs"
--perf_duration="10secs" --perf_interval="1mins" --port="5051" --qos_correction_interval_min="0ns"
--quiet="false" --recover="reconnect" --recovery_timeout="15mins" --registration_backoff_factor="10ms"
--resources="cpus:2;gpus:0;mem:1024;disk:1024;ports:[31000-32000]" --revocable_cpu_low_priority="true"
--runtime_dir="/tmp/Endpoint_SlaveEndpointTest_NoAuthorizer_0_uf1ZPw" --sandbox_directory="/mnt/mesos/sandbox"
--strict="true" --switch_user="true" --systemd_enable_support="true" --systemd_runtime_directory="/run/systemd/system"
--version="false" --work_dir="/tmp/Endpoint_SlaveEndpointTest_NoAuthorizer_0_HfPp63"
I0701 13:30:07.584692  6316 credentials.hpp:86] Loading credential for authentication from
'/tmp/Endpoint_SlaveEndpointTest_NoAuthorizer_0_uf1ZPw/credential'
I0701 13:30:07.584849  6316 slave.cpp:283] Agent using credential for: test-principal
I0701 13:30:07.584872  6316 credentials.hpp:37] Loading credentials for authentication from
'/tmp/Endpoint_SlaveEndpointTest_NoAuthorizer_0_uf1ZPw/http_credentials'
I0701 13:30:07.585094  6316 http.cpp:976] Creating default 'basic' HTTP authenticator for
realm 'mesos-agent-readonly'
I0701 13:30:07.585263  6316 http.cpp:976] Creating default 'basic' HTTP authenticator for
realm 'mesos-agent-readwrite'
I0701 13:30:07.586526  6316 slave.cpp:565] Agent resources: [{"name":"cpus","scalar":{"value":2.0},"type":"SCALAR"},{"name":"mem","scalar":{"value":1024.0},"type":"SCALAR"},{"name":"disk","scalar":{"value":1024.0},"type":"SCALAR"},{"name":"ports","ranges":{"range":[{"begin":31000,"end":32000}]},"type":"RANGES"}]
I0701 13:30:07.586738  6316 slave.cpp:573] Agent attributes: [  ]
I0701 13:30:07.586753  6316 slave.cpp:578] Agent hostname: 6b4a72ade56a
I0701 13:30:07.586890  6319 status_update_manager.cpp:177] Pausing sending status updates
I0701 13:30:07.588536  6314 state.cpp:64] Recovering state from '/tmp/Endpoint_SlaveEndpointTest_NoAuthorizer_0_HfPp63/meta'
I0701 13:30:07.588942  6327 status_update_manager.cpp:203] Recovering status update manager
I0701 13:30:07.589193  6334 containerizer.cpp:582] Recovering containerizer
I0701 13:30:07.590831  6315 provisioner.cpp:416] Provisioner recovery complete
I0701 13:30:07.591321  6315 slave.cpp:6189] Finished recovery
I0701 13:30:07.591712  6315 slave.cpp:6371] Querying resource estimator for oversubscribable
resources
I0701 13:30:07.592303  6315 slave.cpp:6385] Received oversubscribable resources {} from the
resource estimator
I0701 13:30:07.594815  6323 process.cpp:3779] Handling HTTP event for process 'slave(773)'
with path: '/slave(773)/monitor/statistics'
I0701 13:30:07.596566  6323 http.cpp:1116] HTTP GET for /slave(773)/monitor/statistics from
172.17.0.6:48324
I0701 13:30:07.596640  6323 http.cpp:937] Authorizing principal 'test-principal' to GET the
'/monitor/statistics' endpoint
I0701 13:30:07.600173  6328 slave.cpp:839] Agent terminating
[       OK ] Endpoint/SlaveEndpointTest.NoAuthorizer/0 (40 ms)
[ RUN      ] Endpoint/SlaveEndpointTest.NoAuthorizer/1
I0701 13:30:07.620406  6295 containerizer.cpp:230] Using isolation: posix/cpu,posix/mem,filesystem/posix,network/cni,environment_secret
W0701 13:30:07.620854  6295 backend.cpp:76] Failed to create 'aufs' backend: AufsBackend requires
root privileges
W0701 13:30:07.620950  6295 backend.cpp:76] Failed to create 'bind' backend: BindBackend requires
root privileges
I0701 13:30:07.620987  6295 provisioner.cpp:255] Using default backend 'copy'
I0701 13:30:07.622660  6295 cluster.cpp:448] Creating default 'local' authorizer
I0701 13:30:07.624193  6337 slave.cpp:250] Mesos agent started on (774)@172.17.0.6:45414
I0701 13:30:07.624213  6337 slave.cpp:251] Flags at startup: --acls="" --appc_simple_discovery_uri_prefix="http://"
--appc_store_dir="/tmp/Endpoint_SlaveEndpointTest_NoAuthorizer_1_Vmse6n/store/appc" --authenticate_http_readonly="true"
--authenticate_http_readwrite="true" --authenticatee="crammd5" --authentication_backoff_factor="1secs"
--authorizer="local" --cgroups_cpu_enable_pids_and_tids_count="false" --cgroups_enable_cfs="false"
--cgroups_hierarchy="/sys/fs/cgroup" --cgroups_limit_swap="false" --cgroups_root="mesos" --container_disk_watch_interval="15secs"
--containerizers="mesos" --credential="/tmp/Endpoint_SlaveEndpointTest_NoAuthorizer_1_Vmse6n/credential"
--default_role="*" --disk_watch_interval="1mins" --docker="docker" --docker_kill_orphans="true"
--docker_registry="https://registry-1.docker.io" --docker_remove_delay="6hrs" --docker_socket="/var/run/docker.sock"
--docker_stop_timeout="0ns" --docker_store_dir="/tmp/Endpoint_SlaveEndpointTest_NoAuthorizer_1_Vmse6n/store/docker"
--docker_volume_checkpoint_dir="/var/run/mesos/isolators/docker/volume" --enforce_container_disk_quota="false"
--executor_registration_timeout="1mins" --executor_reregistration_timeout="2secs" --executor_shutdown_grace_period="5secs"
--fetcher_cache_dir="/tmp/Endpoint_SlaveEndpointTest_NoAuthorizer_1_Vmse6n/fetch" --fetcher_cache_size="2GB"
--frameworks_home="" --gc_delay="1weeks" --gc_disk_headroom="0.1" --hadoop_home="" --help="false"
--hostname_lookup="true" --http_command_executor="false" --http_credentials="/tmp/Endpoint_SlaveEndpointTest_NoAuthorizer_1_Vmse6n/http_credentials"
--http_heartbeat_interval="30secs" --initialize_driver_logging="true" --isolation="posix/cpu,posix/mem"
--launcher="posix" --launcher_dir="/mesos/mesos-1.4.0/_build/src" --logbufsecs="0" --logging_level="INFO"
--max_completed_executors_per_framework="150" --oversubscribed_resources_interval="15secs"
--perf_duration="10secs" --perf_interval="1mins" --port="5051" --qos_correction_interval_min="0ns"
--quiet="false" --recover="reconnect" --recovery_timeout="15mins" --registration_backoff_factor="10ms"
--resources="cpus:2;gpus:0;mem:1024;disk:1024;ports:[31000-32000]" --revocable_cpu_low_priority="true"
--runtime_dir="/tmp/Endpoint_SlaveEndpointTest_NoAuthorizer_1_Vmse6n" --sandbox_directory="/mnt/mesos/sandbox"
--strict="true" --switch_user="true" --systemd_enable_support="true" --systemd_runtime_directory="/run/systemd/system"
--version="false" --work_dir="/tmp/Endpoint_SlaveEndpointTest_NoAuthorizer_1_Tk1CgV"
I0701 13:30:07.624647  6337 credentials.hpp:86] Loading credential for authentication from
'/tmp/Endpoint_SlaveEndpointTest_NoAuthorizer_1_Vmse6n/credential'
I0701 13:30:07.624802  6337 slave.cpp:283] Agent using credential for: test-principal
I0701 13:30:07.624825  6337 credentials.hpp:37] Loading credentials for authentication from
'/tmp/Endpoint_SlaveEndpointTest_NoAuthorizer_1_Vmse6n/http_credentials'
I0701 13:30:07.625093  6337 http.cpp:976] Creating default 'basic' HTTP authenticator for
realm 'mesos-agent-readonly'
I0701 13:30:07.625252  6337 http.cpp:976] Creating default 'basic' HTTP authenticator for
realm 'mesos-agent-readwrite'
I0701 13:30:07.626704  6337 slave.cpp:565] Agent resources: [{"name":"cpus","scalar":{"value":2.0},"type":"SCALAR"},{"name":"mem","scalar":{"value":1024.0},"type":"SCALAR"},{"name":"disk","scalar":{"value":1024.0},"type":"SCALAR"},{"name":"ports","ranges":{"range":[{"begin":31000,"end":32000}]},"type":"RANGES"}]
I0701 13:30:07.626976  6337 slave.cpp:573] Agent attributes: [  ]
I0701 13:30:07.626992  6337 slave.cpp:578] Agent hostname: 6b4a72ade56a
I0701 13:30:07.627107  6314 status_update_manager.cpp:177] Pausing sending status updates
I0701 13:30:07.628475  6316 state.cpp:64] Recovering state from '/tmp/Endpoint_SlaveEndpointTest_NoAuthorizer_1_Tk1CgV/meta'
I0701 13:30:07.628758  6315 status_update_manager.cpp:203] Recovering status update manager
I0701 13:30:07.629066  6325 containerizer.cpp:582] Recovering containerizer
I0701 13:30:07.630345  6337 provisioner.cpp:416] Provisioner recovery complete
I0701 13:30:07.630730  6317 slave.cpp:6189] Finished recovery
I0701 13:30:07.631183  6317 slave.cpp:6371] Querying resource estimator for oversubscribable
resources
I0701 13:30:07.631414  6320 slave.cpp:6385] Received oversubscribable resources {} from the
resource estimator
I0701 13:30:07.633641  6328 process.cpp:3779] Handling HTTP event for process 'slave(774)'
with path: '/slave(774)/monitor/statistics.json'
I0701 13:30:07.634768  6319 http.cpp:1116] HTTP GET for /slave(774)/monitor/statistics.json
from 172.17.0.6:48326
I0701 13:30:07.634837  6319 http.cpp:937] Authorizing principal 'test-principal' to GET the
'/monitor/statistics.json' endpoint
I0701 13:30:07.637688  6329 slave.cpp:839] Agent terminating
[       OK ] Endpoint/SlaveEndpointTest.NoAuthorizer/1 (28 ms)
[ RUN      ] Endpoint/SlaveEndpointTest.NoAuthorizer/2
I0701 13:30:07.649103  6295 containerizer.cpp:230] Using isolation: posix/cpu,posix/mem,filesystem/posix,network/cni,environment_secret
W0701 13:30:07.649708  6295 backend.cpp:76] Failed to create 'aufs' backend: AufsBackend requires
root privileges
W0701 13:30:07.649807  6295 backend.cpp:76] Failed to create 'bind' backend: BindBackend requires
root privileges
I0701 13:30:07.649842  6295 provisioner.cpp:255] Using default backend 'copy'
I0701 13:30:07.651635  6295 cluster.cpp:448] Creating default 'local' authorizer
I0701 13:30:07.653368  6337 slave.cpp:250] Mesos agent started on (775)@172.17.0.6:45414
I0701 13:30:07.653389  6337 slave.cpp:251] Flags at startup: --acls="" --appc_simple_discovery_uri_prefix="http://"
--appc_store_dir="/tmp/Endpoint_SlaveEndpointTest_NoAuthorizer_2_yWJNEf/store/appc" --authenticate_http_readonly="true"
--authenticate_http_readwrite="true" --authenticatee="crammd5" --authentication_backoff_factor="1secs"
--authorizer="local" --cgroups_cpu_enable_pids_and_tids_count="false" --cgroups_enable_cfs="false"
--cgroups_hierarchy="/sys/fs/cgroup" --cgroups_limit_swap="false" --cgroups_root="mesos" --container_disk_watch_interval="15secs"
--containerizers="mesos" --credential="/tmp/Endpoint_SlaveEndpointTest_NoAuthorizer_2_yWJNEf/credential"
--default_role="*" --disk_watch_interval="1mins" --docker="docker" --docker_kill_orphans="true"
--docker_registry="https://registry-1.docker.io" --docker_remove_delay="6hrs" --docker_socket="/var/run/docker.sock"
--docker_stop_timeout="0ns" --docker_store_dir="/tmp/Endpoint_SlaveEndpointTest_NoAuthorizer_2_yWJNEf/store/docker"
--docker_volume_checkpoint_dir="/var/run/mesos/isolators/docker/volume" --enforce_container_disk_quota="false"
--executor_registration_timeout="1mins" --executor_reregistration_timeout="2secs" --executor_shutdown_grace_period="5secs"
--fetcher_cache_dir="/tmp/Endpoint_SlaveEndpointTest_NoAuthorizer_2_yWJNEf/fetch" --fetcher_cache_size="2GB"
--frameworks_home="" --gc_delay="1weeks" --gc_disk_headroom="0.1" --hadoop_home="" --help="false"
--hostname_lookup="true" --http_command_executor="false" --http_credentials="/tmp/Endpoint_SlaveEndpointTest_NoAuthorizer_2_yWJNEf/http_credentials"
--http_heartbeat_interval="30secs" --initialize_driver_logging="true" --isolation="posix/cpu,posix/mem"
--launcher="posix" --launcher_dir="/mesos/mesos-1.4.0/_build/src" --logbufsecs="0" --logging_level="INFO"
--max_completed_executors_per_framework="150" --oversubscribed_resources_interval="15secs"
--perf_duration="10secs" --perf_interval="1mins" --port="5051" --qos_correction_interval_min="0ns"
--quiet="false" --recover="reconnect" --recovery_timeout="15mins" --registration_backoff_factor="10ms"
--resources="cpus:2;gpus:0;mem:1024;disk:1024;ports:[31000-32000]" --revocable_cpu_low_priority="true"
--runtime_dir="/tmp/Endpoint_SlaveEndpointTest_NoAuthorizer_2_yWJNEf" --sandbox_directory="/mnt/mesos/sandbox"
--strict="true" --switch_user="true" --systemd_enable_support="true" --systemd_runtime_directory="/run/systemd/system"
--version="false" --work_dir="/tmp/Endpoint_SlaveEndpointTest_NoAuthorizer_2_OAA1KM"
I0701 13:30:07.653818  6337 credentials.hpp:86] Loading credential for authentication from
'/tmp/Endpoint_SlaveEndpointTest_NoAuthorizer_2_yWJNEf/credential'
I0701 13:30:07.653964  6337 slave.cpp:283] Agent using credential for: test-principal
I0701 13:30:07.653985  6337 credentials.hpp:37] Loading credentials for authentication from
'/tmp/Endpoint_SlaveEndpointTest_NoAuthorizer_2_yWJNEf/http_credentials'
I0701 13:30:07.654271  6337 http.cpp:976] Creating default 'basic' HTTP authenticator for
realm 'mesos-agent-readonly'
I0701 13:30:07.654417  6337 http.cpp:976] Creating default 'basic' HTTP authenticator for
realm 'mesos-agent-readwrite'
I0701 13:30:07.655906  6337 slave.cpp:565] Agent resources: [{"name":"cpus","scalar":{"value":2.0},"type":"SCALAR"},{"name":"mem","scalar":{"value":1024.0},"type":"SCALAR"},{"name":"disk","scalar":{"value":1024.0},"type":"SCALAR"},{"name":"ports","ranges":{"range":[{"begin":31000,"end":32000}]},"type":"RANGES"}]
I0701 13:30:07.656111  6337 slave.cpp:573] Agent attributes: [  ]
I0701 13:30:07.656123  6337 slave.cpp:578] Agent hostname: 6b4a72ade56a
I0701 13:30:07.656255  6328 status_update_manager.cpp:177] Pausing sending status updates
I0701 13:30:07.657505  6326 state.cpp:64] Recovering state from '/tmp/Endpoint_SlaveEndpointTest_NoAuthorizer_2_OAA1KM/meta'
I0701 13:30:07.657863  6316 status_update_manager.cpp:203] Recovering status update manager
I0701 13:30:07.658028  6336 containerizer.cpp:582] Recovering containerizer
I0701 13:30:07.659456  6318 provisioner.cpp:416] Provisioner recovery complete
I0701 13:30:07.659754  6321 slave.cpp:6189] Finished recovery
I0701 13:30:07.660166  6321 slave.cpp:6371] Querying resource estimator for oversubscribable
resources
I0701 13:30:07.660462  6317 slave.cpp:6385] Received oversubscribable resources {} from the
resource estimator
I0701 13:30:07.662492  6320 process.cpp:3779] Handling HTTP event for process 'slave(775)'
with path: '/slave(775)/containers'
I0701 13:30:07.664033  6320 http.cpp:1116] HTTP GET for /slave(775)/containers from 172.17.0.6:48328
I0701 13:30:07.664100  6320 http.cpp:937] Authorizing principal 'test-principal' to GET the
'/containers' endpoint
I0701 13:30:07.667893  6320 slave.cpp:839] Agent terminating
[       OK ] Endpoint/SlaveEndpointTest.NoAuthorizer/2 (29 ms)
[----------] 9 tests from Endpoint/SlaveEndpointTest (351 ms total)

[----------] Global test environment tear-down
[==========] 1617 tests from 179 test cases ran. (570875 ms total)
[  PASSED  ] 1614 tests.
[  FAILED  ] 3 tests, listed below:
[  FAILED  ] CommandExecutorCheckTest.CommandCheckDeliveredAndReconciled
[  FAILED  ] DefaultExecutorCheckTest.CommandCheckDeliveredAndReconciled
[  FAILED  ] PersistentVolumeEndpointsTest.ReserveAndSlaveRemoval

 3 FAILED TESTS
  YOU HAVE 20 DISABLED TESTS

I0701 13:30:07.725401  6338 process.cpp:968] Failed to accept socket: future discarded
make[4]: *** [check-local] Error 1
make[4]: Leaving directory `/mesos/mesos-1.4.0/_build/src'
make[3]: *** [check-am] Error 2
make[3]: Leaving directory `/mesos/mesos-1.4.0/_build/src'
make[2]: *** [check] Error 2
make[2]: Leaving directory `/mesos/mesos-1.4.0/_build/src'
make[1]: *** [check-recursive] Error 1
make[1]: Leaving directory `/mesos/mesos-1.4.0/_build'
make: *** [distcheck] Error 1
+ docker rmi mesos-1498912717-31711
Untagged: mesos-1498912717-31711:latest
Deleted: sha256:6a5a8b7492ee8ea5e8080b587b232c9368f98e1eaec848944290da3e35f930de
Deleted: sha256:054777335f9ccdb9765bef5b22083e669e2a7be1ba714f53780247bfeb9e31df
Deleted: sha256:0746e7bab937436a58b90e9ada9f968b98e37c908a56cf08c1d0b3b6cb831e5c
Deleted: sha256:a5fc7285b0f2654381fc4d6865bc3e83cc14eea5090abc19535d6d5cb7740cb0
Deleted: sha256:50d83416c370c464addc5e8c9bad0e0d1c6db93769d83cbef1b1bdb62988bd7e
Deleted: sha256:219ee7e1e6873388b099c297dcbba783a72f23d2efb1122a04e27a207c24f1c3
Deleted: sha256:13a706adefaa271314edfcac8406031b000fd79b96fc886e9c83584078d918e9
Deleted: sha256:f121ced9dc2a42549020543d2ce3c49231e181a5382b111dc79277d2da90f297
Deleted: sha256:b3b198b2e211ac576b6caa335dbb76cbbf93571c44585ade526b6b65e1aadf47
Deleted: sha256:666a7fede837b4971ef5f197c15083bd1fc66793e9c73aa4a46fbe09eb0a292e
Deleted: sha256:21a3c4afe7c75a4739ffe95b69ae1e0547d20a5af1dc66046d8dfbb6461c2075
Deleted: sha256:0ef649b68689ecf8f6a5712aaf39a45d6adffc3a06f9bee29a4596bdd8a73b34
Deleted: sha256:2a73779b9a7c3e00def1dbc2576190661f47d2075fa34a541f5f622e2edd5cad
Deleted: sha256:6aaaf1b8cd496e646af843f9ef71cc202148d3bee6476b9b420f9af09aa00376
Deleted: sha256:edfc3e807fe32eb91247007198b99c47be3deb22a32e7ec4a75a5259f0f087b2
Deleted: sha256:e8371265891a62fdb5a3be4711263d0cbd6e226e4bb9858715b38377e8e9abdc
Deleted: sha256:0d5de5afe49dbc426bc9328b9d54fb46c5cf5a4eefbb69aa0ff2a51245bcb7c5
Deleted: sha256:68ac17ba902ad298cfa192bb045d7d07d92f08f99bb5b5d0b4536788419e84a3
Deleted: sha256:c6aae4e90ccbaf645f629c58400a1072e54b100cc3ceb7674e6008c4ffd54031
Deleted: sha256:50284dae0fd56a72da4acc0d9e9b63ce49d7e3b7d061fdde5ce68f956df0caf5
Deleted: sha256:2a26ba206ff2ae8d1366a77a8096c945f0f9dbe885c8027663898a50b76571a3
Deleted: sha256:00469a0ab0b050800b7cc1cd5e9a4a3af3184bf7d71061d8c7812469f37a860b
Deleted: sha256:f86e9c7e29eb8ec26cdb86b0f0c713e22be4a48e564d6d55ba3dd9b17914c38d
Deleted: sha256:3b00157a8bca85c6775857e96e6799242c1cc9f1a045b33fa291e45124c1c6e8
Deleted: sha256:692515c8ff3f1753937f7498e112b5b255c7ff72dbc5fa86e48e5aaf563f90dd
Build step 'Execute shell' marked build as failure
Not sending mail to unregistered user yujie.jay@gmail.com
Not sending mail to unregistered user gregorywmann@gmail.com

Mime
View raw message