mesos-builds mailing list archives

Site index · List index
Message view « Date » · « Thread »
Top « Date » · « Thread »
From Apache Jenkins Server <jenk...@builds.apache.org>
Subject Build failed in Jenkins: Mesos-Reviewbot #18478
Date Tue, 11 Jul 2017 22:44:39 GMT
See <https://builds.apache.org/job/Mesos-Reviewbot/18478/display/redirect?page=changes>

Changes:

[yujie.jay] Fixed persistent volume and host volume conflict issue.

[yujie.jay] Added unit tests for persistent volume and host volume conflict issue.

------------------------------------------
[...truncated 29.91 MB...]
I0711 22:44:35.338744  5344 slave.cpp:843] Agent terminating
[       OK ] Endpoint/SlaveEndpointTest.AuthorizedRequest/1 (33 ms)
[ RUN      ] Endpoint/SlaveEndpointTest.AuthorizedRequest/2
I0711 22:44:35.351502  5313 containerizer.cpp:230] Using isolation: posix/cpu,posix/mem,filesystem/posix,network/cni,environment_secret
W0711 22:44:35.352128  5313 backend.cpp:76] Failed to create 'aufs' backend: AufsBackend requires
root privileges
W0711 22:44:35.352247  5313 backend.cpp:76] Failed to create 'bind' backend: BindBackend requires
root privileges
I0711 22:44:35.352283  5313 provisioner.cpp:255] Using default backend 'copy'
I0711 22:44:35.356744  5341 slave.cpp:250] Mesos agent started on (787)@172.17.0.6:34238
I0711 22:44:35.356940  5341 slave.cpp:251] Flags at startup: --acls="" --appc_simple_discovery_uri_prefix="http://"
--appc_store_dir="/tmp/Endpoint_SlaveEndpointTest_AuthorizedRequest_2_4egSCY/store/appc" --authenticate_http_readonly="true"
--authenticate_http_readwrite="true" --authenticatee="crammd5" --authentication_backoff_factor="1secs"
--authorizer="local" --cgroups_cpu_enable_pids_and_tids_count="false" --cgroups_enable_cfs="false"
--cgroups_hierarchy="/sys/fs/cgroup" --cgroups_limit_swap="false" --cgroups_root="mesos" --container_disk_watch_interval="15secs"
--containerizers="mesos" --credential="/tmp/Endpoint_SlaveEndpointTest_AuthorizedRequest_2_4egSCY/credential"
--default_role="*" --disk_watch_interval="1mins" --docker="docker" --docker_kill_orphans="true"
--docker_registry="https://registry-1.docker.io" --docker_remove_delay="6hrs" --docker_socket="/var/run/docker.sock"
--docker_stop_timeout="0ns" --docker_store_dir="/tmp/Endpoint_SlaveEndpointTest_AuthorizedRequest_2_4egSCY/store/docker"
--docker_volume_checkpoint_dir="/var/run/mesos/isolators/docker/volume" --enforce_container_disk_quota="false"
--executor_registration_timeout="1mins" --executor_reregistration_timeout="2secs" --executor_shutdown_grace_period="5secs"
--fetcher_cache_dir="/tmp/Endpoint_SlaveEndpointTest_AuthorizedRequest_2_4egSCY/fetch" --fetcher_cache_size="2GB"
--frameworks_home="" --gc_delay="1weeks" --gc_disk_headroom="0.1" --hadoop_home="" --help="false"
--hostname_lookup="true" --http_command_executor="false" --http_credentials="/tmp/Endpoint_SlaveEndpointTest_AuthorizedRequest_2_4egSCY/http_credentials"
--http_heartbeat_interval="30secs" --initialize_driver_logging="true" --isolation="posix/cpu,posix/mem"
--launcher="posix" --launcher_dir="/mesos/mesos-1.4.0/_build/src" --logbufsecs="0" --logging_level="INFO"
--max_completed_executors_per_framework="150" --oversubscribed_resources_interval="15secs"
--perf_duration="10secs" --perf_interval="1mins" --port="5051" --qos_correction_interval_min="0ns"
--quiet="false" --recover="reconnect" --recovery_timeout="15mins" --registration_backoff_factor="10ms"
--resources="cpus:2;gpus:0;mem:1024;disk:1024;ports:[31000-32000]" --revocable_cpu_low_priority="true"
--runtime_dir="/tmp/Endpoint_SlaveEndpointTest_AuthorizedRequest_2_4egSCY" --sandbox_directory="/mnt/mesos/sandbox"
--strict="true" --switch_user="true" --systemd_enable_support="true" --systemd_runtime_directory="/run/systemd/system"
--version="false" --work_dir="/tmp/Endpoint_SlaveEndpointTest_AuthorizedRequest_2_pyl5Z3"
I0711 22:44:35.357434  5341 credentials.hpp:86] Loading credential for authentication from
'/tmp/Endpoint_SlaveEndpointTest_AuthorizedRequest_2_4egSCY/credential'
I0711 22:44:35.357687  5341 slave.cpp:283] Agent using credential for: test-principal
I0711 22:44:35.357712  5341 credentials.hpp:37] Loading credentials for authentication from
'/tmp/Endpoint_SlaveEndpointTest_AuthorizedRequest_2_4egSCY/http_credentials'
I0711 22:44:35.357980  5341 http.cpp:1009] Creating default 'basic' HTTP authenticator for
realm 'mesos-agent-readonly'
I0711 22:44:35.358170  5341 http.cpp:1009] Creating default 'basic' HTTP authenticator for
realm 'mesos-agent-readwrite'
I0711 22:44:35.359930  5341 slave.cpp:565] Agent resources: [{"name":"cpus","scalar":{"value":2.0},"type":"SCALAR"},{"name":"mem","scalar":{"value":1024.0},"type":"SCALAR"},{"name":"disk","scalar":{"value":1024.0},"type":"SCALAR"},{"name":"ports","ranges":{"range":[{"begin":31000,"end":32000}]},"type":"RANGES"}]
I0711 22:44:35.360261  5341 slave.cpp:573] Agent attributes: [  ]
I0711 22:44:35.360281  5341 slave.cpp:582] Agent hostname: 2645ab09ac08
I0711 22:44:35.360450  5343 status_update_manager.cpp:177] Pausing sending status updates
I0711 22:44:35.362107  5348 state.cpp:64] Recovering state from '/tmp/Endpoint_SlaveEndpointTest_AuthorizedRequest_2_pyl5Z3/meta'
I0711 22:44:35.362517  5347 status_update_manager.cpp:203] Recovering status update manager
I0711 22:44:35.362741  5352 containerizer.cpp:582] Recovering containerizer
I0711 22:44:35.364363  5348 provisioner.cpp:416] Provisioner recovery complete
I0711 22:44:35.364823  5338 slave.cpp:6207] Finished recovery
I0711 22:44:35.365465  5338 slave.cpp:6389] Querying resource estimator for oversubscribable
resources
I0711 22:44:35.365767  5335 slave.cpp:6403] Received oversubscribable resources {} from the
resource estimator
I0711 22:44:35.368757  5350 process.cpp:3820] Handling HTTP event for process 'slave(787)'
with path: '/slave(787)/containers'
I0711 22:44:35.370111  5352 http.cpp:1149] HTTP GET for /slave(787)/containers from 172.17.0.6:36232
I0711 22:44:35.370221  5352 http.cpp:970] Authorizing principal 'test-principal' to GET the
'/containers' endpoint
I0711 22:44:35.373647  5344 slave.cpp:843] Agent terminating
[       OK ] Endpoint/SlaveEndpointTest.AuthorizedRequest/2 (33 ms)
[ RUN      ] Endpoint/SlaveEndpointTest.UnauthorizedRequest/0
I0711 22:44:35.385047  5313 containerizer.cpp:230] Using isolation: posix/cpu,posix/mem,filesystem/posix,network/cni,environment_secret
W0711 22:44:35.385607  5313 backend.cpp:76] Failed to create 'aufs' backend: AufsBackend requires
root privileges
W0711 22:44:35.385713  5313 backend.cpp:76] Failed to create 'bind' backend: BindBackend requires
root privileges
I0711 22:44:35.385756  5313 provisioner.cpp:255] Using default backend 'copy'
I0711 22:44:35.389199  5343 slave.cpp:250] Mesos agent started on (788)@172.17.0.6:34238
I0711 22:44:35.389245  5343 slave.cpp:251] Flags at startup: --acls="" --appc_simple_discovery_uri_prefix="http://"
--appc_store_dir="/tmp/Endpoint_SlaveEndpointTest_UnauthorizedRequest_0_ofDcpD/store/appc"
--authenticate_http_readonly="true" --authenticate_http_readwrite="true" --authenticatee="crammd5"
--authentication_backoff_factor="1secs" --authorizer="local" --cgroups_cpu_enable_pids_and_tids_count="false"
--cgroups_enable_cfs="false" --cgroups_hierarchy="/sys/fs/cgroup" --cgroups_limit_swap="false"
--cgroups_root="mesos" --container_disk_watch_interval="15secs" --containerizers="mesos" --credential="/tmp/Endpoint_SlaveEndpointTest_UnauthorizedRequest_0_ofDcpD/credential"
--default_role="*" --disk_watch_interval="1mins" --docker="docker" --docker_kill_orphans="true"
--docker_registry="https://registry-1.docker.io" --docker_remove_delay="6hrs" --docker_socket="/var/run/docker.sock"
--docker_stop_timeout="0ns" --docker_store_dir="/tmp/Endpoint_SlaveEndpointTest_UnauthorizedRequest_0_ofDcpD/store/docker"
--docker_volume_checkpoint_dir="/var/run/mesos/isolators/docker/volume" --enforce_container_disk_quota="false"
--executor_registration_timeout="1mins" --executor_reregistration_timeout="2secs" --executor_shutdown_grace_period="5secs"
--fetcher_cache_dir="/tmp/Endpoint_SlaveEndpointTest_UnauthorizedRequest_0_ofDcpD/fetch" --fetcher_cache_size="2GB"
--frameworks_home="" --gc_delay="1weeks" --gc_disk_headroom="0.1" --hadoop_home="" --help="false"
--hostname_lookup="true" --http_command_executor="false" --http_credentials="/tmp/Endpoint_SlaveEndpointTest_UnauthorizedRequest_0_ofDcpD/http_credentials"
--http_heartbeat_interval="30secs" --initialize_driver_logging="true" --isolation="posix/cpu,posix/mem"
--launcher="posix" --launcher_dir="/mesos/mesos-1.4.0/_build/src" --logbufsecs="0" --logging_level="INFO"
--max_completed_executors_per_framework="150" --oversubscribed_resources_interval="15secs"
--perf_duration="10secs" --perf_interval="1mins" --port="5051" --qos_correction_interval_min="0ns"
--quiet="false" --recover="reconnect" --recovery_timeout="15mins" --registration_backoff_factor="10ms"
--resources="cpus:2;gpus:0;mem:1024;disk:1024;ports:[31000-32000]" --revocable_cpu_low_priority="true"
--runtime_dir="/tmp/Endpoint_SlaveEndpointTest_UnauthorizedRequest_0_ofDcpD" --sandbox_directory="/mnt/mesos/sandbox"
--strict="true" --switch_user="true" --systemd_enable_support="true" --systemd_runtime_directory="/run/systemd/system"
--version="false" --work_dir="/tmp/Endpoint_SlaveEndpointTest_UnauthorizedRequest_0_FvSoHI"
I0711 22:44:35.389788  5343 credentials.hpp:86] Loading credential for authentication from
'/tmp/Endpoint_SlaveEndpointTest_UnauthorizedRequest_0_ofDcpD/credential'
I0711 22:44:35.390019  5343 slave.cpp:283] Agent using credential for: test-principal
I0711 22:44:35.390043  5343 credentials.hpp:37] Loading credentials for authentication from
'/tmp/Endpoint_SlaveEndpointTest_UnauthorizedRequest_0_ofDcpD/http_credentials'
I0711 22:44:35.390322  5343 http.cpp:1009] Creating default 'basic' HTTP authenticator for
realm 'mesos-agent-readonly'
I0711 22:44:35.390494  5343 http.cpp:1009] Creating default 'basic' HTTP authenticator for
realm 'mesos-agent-readwrite'
I0711 22:44:35.392137  5343 slave.cpp:565] Agent resources: [{"name":"cpus","scalar":{"value":2.0},"type":"SCALAR"},{"name":"mem","scalar":{"value":1024.0},"type":"SCALAR"},{"name":"disk","scalar":{"value":1024.0},"type":"SCALAR"},{"name":"ports","ranges":{"range":[{"begin":31000,"end":32000}]},"type":"RANGES"}]
I0711 22:44:35.392395  5343 slave.cpp:573] Agent attributes: [  ]
I0711 22:44:35.392416  5343 slave.cpp:582] Agent hostname: 2645ab09ac08
I0711 22:44:35.392612  5334 status_update_manager.cpp:177] Pausing sending status updates
I0711 22:44:35.394421  5336 state.cpp:64] Recovering state from '/tmp/Endpoint_SlaveEndpointTest_UnauthorizedRequest_0_FvSoHI/meta'
I0711 22:44:35.394697  5354 status_update_manager.cpp:203] Recovering status update manager
I0711 22:44:35.395112  5346 containerizer.cpp:582] Recovering containerizer
I0711 22:44:35.396704  5347 provisioner.cpp:416] Provisioner recovery complete
I0711 22:44:35.397086  5345 slave.cpp:6207] Finished recovery
I0711 22:44:35.397547  5345 slave.cpp:6389] Querying resource estimator for oversubscribable
resources
I0711 22:44:35.397824  5351 slave.cpp:6403] Received oversubscribable resources {} from the
resource estimator
I0711 22:44:35.400470  5349 process.cpp:3820] Handling HTTP event for process 'slave(788)'
with path: '/slave(788)/monitor/statistics'
I0711 22:44:35.401921  5354 http.cpp:1149] HTTP GET for /slave(788)/monitor/statistics from
172.17.0.6:36234
I0711 22:44:35.402017  5354 http.cpp:970] Authorizing principal 'test-principal' to GET the
'/monitor/statistics' endpoint
I0711 22:44:35.404861  5349 slave.cpp:843] Agent terminating
[       OK ] Endpoint/SlaveEndpointTest.UnauthorizedRequest/0 (36 ms)
[ RUN      ] Endpoint/SlaveEndpointTest.UnauthorizedRequest/1
I0711 22:44:35.421506  5313 containerizer.cpp:230] Using isolation: posix/cpu,posix/mem,filesystem/posix,network/cni,environment_secret
W0711 22:44:35.422052  5313 backend.cpp:76] Failed to create 'aufs' backend: AufsBackend requires
root privileges
W0711 22:44:35.422161  5313 backend.cpp:76] Failed to create 'bind' backend: BindBackend requires
root privileges
I0711 22:44:35.422205  5313 provisioner.cpp:255] Using default backend 'copy'
I0711 22:44:35.425694  5338 slave.cpp:250] Mesos agent started on (789)@172.17.0.6:34238
I0711 22:44:35.425715  5338 slave.cpp:251] Flags at startup: --acls="" --appc_simple_discovery_uri_prefix="http://"
--appc_store_dir="/tmp/Endpoint_SlaveEndpointTest_UnauthorizedRequest_1_U2lCwi/store/appc"
--authenticate_http_readonly="true" --authenticate_http_readwrite="true" --authenticatee="crammd5"
--authentication_backoff_factor="1secs" --authorizer="local" --cgroups_cpu_enable_pids_and_tids_count="false"
--cgroups_enable_cfs="false" --cgroups_hierarchy="/sys/fs/cgroup" --cgroups_limit_swap="false"
--cgroups_root="mesos" --container_disk_watch_interval="15secs" --containerizers="mesos" --credential="/tmp/Endpoint_SlaveEndpointTest_UnauthorizedRequest_1_U2lCwi/credential"
--default_role="*" --disk_watch_interval="1mins" --docker="docker" --docker_kill_orphans="true"
--docker_registry="https://registry-1.docker.io" --docker_remove_delay="6hrs" --docker_socket="/var/run/docker.sock"
--docker_stop_timeout="0ns" --docker_store_dir="/tmp/Endpoint_SlaveEndpointTest_UnauthorizedRequest_1_U2lCwi/store/docker"
--docker_volume_checkpoint_dir="/var/run/mesos/isolators/docker/volume" --enforce_container_disk_quota="false"
--executor_registration_timeout="1mins" --executor_reregistration_timeout="2secs" --executor_shutdown_grace_period="5secs"
--fetcher_cache_dir="/tmp/Endpoint_SlaveEndpointTest_UnauthorizedRequest_1_U2lCwi/fetch" --fetcher_cache_size="2GB"
--frameworks_home="" --gc_delay="1weeks" --gc_disk_headroom="0.1" --hadoop_home="" --help="false"
--hostname_lookup="true" --http_command_executor="false" --http_credentials="/tmp/Endpoint_SlaveEndpointTest_UnauthorizedRequest_1_U2lCwi/http_credentials"
--http_heartbeat_interval="30secs" --initialize_driver_logging="true" --isolation="posix/cpu,posix/mem"
--launcher="posix" --launcher_dir="/mesos/mesos-1.4.0/_build/src" --logbufsecs="0" --logging_level="INFO"
--max_completed_executors_per_framework="150" --oversubscribed_resources_interval="15secs"
--perf_duration="10secs" --perf_interval="1mins" --port="5051" --qos_correction_interval_min="0ns"
--quiet="false" --recover="reconnect" --recovery_timeout="15mins" --registration_backoff_factor="10ms"
--resources="cpus:2;gpus:0;mem:1024;disk:1024;ports:[31000-32000]" --revocable_cpu_low_priority="true"
--runtime_dir="/tmp/Endpoint_SlaveEndpointTest_UnauthorizedRequest_1_U2lCwi" --sandbox_directory="/mnt/mesos/sandbox"
--strict="true" --switch_user="true" --systemd_enable_support="true" --systemd_runtime_directory="/run/systemd/system"
--version="false" --work_dir="/tmp/Endpoint_SlaveEndpointTest_UnauthorizedRequest_1_dnHnJn"
I0711 22:44:35.426138  5338 credentials.hpp:86] Loading credential for authentication from
'/tmp/Endpoint_SlaveEndpointTest_UnauthorizedRequest_1_U2lCwi/credential'
I0711 22:44:35.426328  5338 slave.cpp:283] Agent using credential for: test-principal
I0711 22:44:35.426354  5338 credentials.hpp:37] Loading credentials for authentication from
'/tmp/Endpoint_SlaveEndpointTest_UnauthorizedRequest_1_U2lCwi/http_credentials'
I0711 22:44:35.426610  5338 http.cpp:1009] Creating default 'basic' HTTP authenticator for
realm 'mesos-agent-readonly'
I0711 22:44:35.426772  5338 http.cpp:1009] Creating default 'basic' HTTP authenticator for
realm 'mesos-agent-readwrite'
I0711 22:44:35.428525  5338 slave.cpp:565] Agent resources: [{"name":"cpus","scalar":{"value":2.0},"type":"SCALAR"},{"name":"mem","scalar":{"value":1024.0},"type":"SCALAR"},{"name":"disk","scalar":{"value":1024.0},"type":"SCALAR"},{"name":"ports","ranges":{"range":[{"begin":31000,"end":32000}]},"type":"RANGES"}]
I0711 22:44:35.428864  5338 slave.cpp:573] Agent attributes: [  ]
I0711 22:44:35.428879  5338 slave.cpp:582] Agent hostname: 2645ab09ac08
I0711 22:44:35.429036  5332 status_update_manager.cpp:177] Pausing sending status updates
I0711 22:44:35.430824  5337 state.cpp:64] Recovering state from '/tmp/Endpoint_SlaveEndpointTest_UnauthorizedRequest_1_dnHnJn/meta'
I0711 22:44:35.431183  5338 status_update_manager.cpp:203] Recovering status update manager
I0711 22:44:35.431519  5342 containerizer.cpp:582] Recovering containerizer
I0711 22:44:35.433085  5353 provisioner.cpp:416] Provisioner recovery complete
I0711 22:44:35.433416  5332 slave.cpp:6207] Finished recovery
I0711 22:44:35.433974  5332 slave.cpp:6389] Querying resource estimator for oversubscribable
resources
I0711 22:44:35.434320  5334 slave.cpp:6403] Received oversubscribable resources {} from the
resource estimator
I0711 22:44:35.437410  5333 process.cpp:3820] Handling HTTP event for process 'slave(789)'
with path: '/slave(789)/monitor/statistics.json'
I0711 22:44:35.439656  5351 http.cpp:1149] HTTP GET for /slave(789)/monitor/statistics.json
from 172.17.0.6:36236
I0711 22:44:35.439766  5351 http.cpp:970] Authorizing principal 'test-principal' to GET the
'/monitor/statistics.json' endpoint
I0711 22:44:35.442942  5345 slave.cpp:843] Agent terminating
[       OK ] Endpoint/SlaveEndpointTest.UnauthorizedRequest/1 (33 ms)
[ RUN      ] Endpoint/SlaveEndpointTest.UnauthorizedRequest/2
I0711 22:44:35.455375  5313 containerizer.cpp:230] Using isolation: posix/cpu,posix/mem,filesystem/posix,network/cni,environment_secret
W0711 22:44:35.455950  5313 backend.cpp:76] Failed to create 'aufs' backend: AufsBackend requires
root privileges
W0711 22:44:35.456063  5313 backend.cpp:76] Failed to create 'bind' backend: BindBackend requires
root privileges
I0711 22:44:35.456100  5313 provisioner.cpp:255] Using default backend 'copy'
I0711 22:44:35.459779  5344 slave.cpp:250] Mesos agent started on (790)@172.17.0.6:34238
I0711 22:44:35.459805  5344 slave.cpp:251] Flags at startup: --acls="" --appc_simple_discovery_uri_prefix="http://"
--appc_store_dir="/tmp/Endpoint_SlaveEndpointTest_UnauthorizedRequest_2_KHBvYX/store/appc"
--authenticate_http_readonly="true" --authenticate_http_readwrite="true" --authenticatee="crammd5"
--authentication_backoff_factor="1secs" --authorizer="local" --cgroups_cpu_enable_pids_and_tids_count="false"
--cgroups_enable_cfs="false" --cgroups_hierarchy="/sys/fs/cgroup" --cgroups_limit_swap="false"
--cgroups_root="mesos" --container_disk_watch_interval="15secs" --containerizers="mesos" --credential="/tmp/Endpoint_SlaveEndpointTest_UnauthorizedRequest_2_KHBvYX/credential"
--default_role="*" --disk_watch_interval="1mins" --docker="docker" --docker_kill_orphans="true"
--docker_registry="https://registry-1.docker.io" --docker_remove_delay="6hrs" --docker_socket="/var/run/docker.sock"
--docker_stop_timeout="0ns" --docker_store_dir="/tmp/Endpoint_SlaveEndpointTest_UnauthorizedRequest_2_KHBvYX/store/docker"
--docker_volume_checkpoint_dir="/var/run/mesos/isolators/docker/volume" --enforce_container_disk_quota="false"
--executor_registration_timeout="1mins" --executor_reregistration_timeout="2secs" --executor_shutdown_grace_period="5secs"
--fetcher_cache_dir="/tmp/Endpoint_SlaveEndpointTest_UnauthorizedRequest_2_KHBvYX/fetch" --fetcher_cache_size="2GB"
--frameworks_home="" --gc_delay="1weeks" --gc_disk_headroom="0.1" --hadoop_home="" --help="false"
--hostname_lookup="true" --http_command_executor="false" --http_credentials="/tmp/Endpoint_SlaveEndpointTest_UnauthorizedRequest_2_KHBvYX/http_credentials"
--http_heartbeat_interval="30secs" --initialize_driver_logging="true" --isolation="posix/cpu,posix/mem"
--launcher="posix" --launcher_dir="/mesos/mesos-1.4.0/_build/src" --logbufsecs="0" --logging_level="INFO"
--max_completed_executors_per_framework="150" --oversubscribed_resources_interval="15secs"
--perf_duration="10secs" --perf_interval="1mins" --port="5051" --qos_correction_interval_min="0ns"
--quiet="false" --recover="reconnect" --recovery_timeout="15mins" --registration_backoff_factor="10ms"
--resources="cpus:2;gpus:0;mem:1024;disk:1024;ports:[31000-32000]" --revocable_cpu_low_priority="true"
--runtime_dir="/tmp/Endpoint_SlaveEndpointTest_UnauthorizedRequest_2_KHBvYX" --sandbox_directory="/mnt/mesos/sandbox"
--strict="true" --switch_user="true" --systemd_enable_support="true" --systemd_runtime_directory="/run/systemd/system"
--version="false" --work_dir="/tmp/Endpoint_SlaveEndpointTest_UnauthorizedRequest_2_beif62"
I0711 22:44:35.460238  5344 credentials.hpp:86] Loading credential for authentication from
'/tmp/Endpoint_SlaveEndpointTest_UnauthorizedRequest_2_KHBvYX/credential'
I0711 22:44:35.460418  5344 slave.cpp:283] Agent using credential for: test-principal
I0711 22:44:35.460441  5344 credentials.hpp:37] Loading credentials for authentication from
'/tmp/Endpoint_SlaveEndpointTest_UnauthorizedRequest_2_KHBvYX/http_credentials'
I0711 22:44:35.460695  5344 http.cpp:1009] Creating default 'basic' HTTP authenticator for
realm 'mesos-agent-readonly'
I0711 22:44:35.460860  5344 http.cpp:1009] Creating default 'basic' HTTP authenticator for
realm 'mesos-agent-readwrite'
I0711 22:44:35.462607  5344 slave.cpp:565] Agent resources: [{"name":"cpus","scalar":{"value":2.0},"type":"SCALAR"},{"name":"mem","scalar":{"value":1024.0},"type":"SCALAR"},{"name":"disk","scalar":{"value":1024.0},"type":"SCALAR"},{"name":"ports","ranges":{"range":[{"begin":31000,"end":32000}]},"type":"RANGES"}]
I0711 22:44:35.462910  5344 slave.cpp:573] Agent attributes: [  ]
I0711 22:44:35.462927  5344 slave.cpp:582] Agent hostname: 2645ab09ac08
I0711 22:44:35.463102  5353 status_update_manager.cpp:177] Pausing sending status updates
I0711 22:44:35.465071  5342 state.cpp:64] Recovering state from '/tmp/Endpoint_SlaveEndpointTest_UnauthorizedRequest_2_beif62/meta'
I0711 22:44:35.465564  5336 status_update_manager.cpp:203] Recovering status update manager
I0711 22:44:35.465837  5340 containerizer.cpp:582] Recovering containerizer
I0711 22:44:35.467628  5345 provisioner.cpp:416] Provisioner recovery complete
I0711 22:44:35.468091  5343 slave.cpp:6207] Finished recovery
I0711 22:44:35.468722  5343 slave.cpp:6389] Querying resource estimator for oversubscribable
resources
I0711 22:44:35.469028  5345 slave.cpp:6403] Received oversubscribable resources {} from the
resource estimator
I0711 22:44:35.471917  5352 process.cpp:3820] Handling HTTP event for process 'slave(790)'
with path: '/slave(790)/containers'
I0711 22:44:35.473594  5340 http.cpp:1149] HTTP GET for /slave(790)/containers from 172.17.0.6:36238
I0711 22:44:35.473690  5340 http.cpp:970] Authorizing principal 'test-principal' to GET the
'/containers' endpoint
I0711 22:44:35.476045  5338 slave.cpp:843] Agent terminating
[       OK ] Endpoint/SlaveEndpointTest.UnauthorizedRequest/2 (32 ms)
[ RUN      ] Endpoint/SlaveEndpointTest.NoAuthorizer/0
I0711 22:44:35.487469  5313 containerizer.cpp:230] Using isolation: posix/cpu,posix/mem,filesystem/posix,network/cni,environment_secret
W0711 22:44:35.488016  5313 backend.cpp:76] Failed to create 'aufs' backend: AufsBackend requires
root privileges
W0711 22:44:35.488122  5313 backend.cpp:76] Failed to create 'bind' backend: BindBackend requires
root privileges
I0711 22:44:35.488162  5313 provisioner.cpp:255] Using default backend 'copy'
I0711 22:44:35.490049  5313 cluster.cpp:448] Creating default 'local' authorizer
I0711 22:44:35.491788  5346 slave.cpp:250] Mesos agent started on (791)@172.17.0.6:34238
I0711 22:44:35.491822  5346 slave.cpp:251] Flags at startup: --acls="" --appc_simple_discovery_uri_prefix="http://"
--appc_store_dir="/tmp/Endpoint_SlaveEndpointTest_NoAuthorizer_0_YIASJD/store/appc" --authenticate_http_readonly="true"
--authenticate_http_readwrite="true" --authenticatee="crammd5" --authentication_backoff_factor="1secs"
--authorizer="local" --cgroups_cpu_enable_pids_and_tids_count="false" --cgroups_enable_cfs="false"
--cgroups_hierarchy="/sys/fs/cgroup" --cgroups_limit_swap="false" --cgroups_root="mesos" --container_disk_watch_interval="15secs"
--containerizers="mesos" --credential="/tmp/Endpoint_SlaveEndpointTest_NoAuthorizer_0_YIASJD/credential"
--default_role="*" --disk_watch_interval="1mins" --docker="docker" --docker_kill_orphans="true"
--docker_registry="https://registry-1.docker.io" --docker_remove_delay="6hrs" --docker_socket="/var/run/docker.sock"
--docker_stop_timeout="0ns" --docker_store_dir="/tmp/Endpoint_SlaveEndpointTest_NoAuthorizer_0_YIASJD/store/docker"
--docker_volume_checkpoint_dir="/var/run/mesos/isolators/docker/volume" --enforce_container_disk_quota="false"
--executor_registration_timeout="1mins" --executor_reregistration_timeout="2secs" --executor_shutdown_grace_period="5secs"
--fetcher_cache_dir="/tmp/Endpoint_SlaveEndpointTest_NoAuthorizer_0_YIASJD/fetch" --fetcher_cache_size="2GB"
--frameworks_home="" --gc_delay="1weeks" --gc_disk_headroom="0.1" --hadoop_home="" --help="false"
--hostname_lookup="true" --http_command_executor="false" --http_credentials="/tmp/Endpoint_SlaveEndpointTest_NoAuthorizer_0_YIASJD/http_credentials"
--http_heartbeat_interval="30secs" --initialize_driver_logging="true" --isolation="posix/cpu,posix/mem"
--launcher="posix" --launcher_dir="/mesos/mesos-1.4.0/_build/src" --logbufsecs="0" --logging_level="INFO"
--max_completed_executors_per_framework="150" --oversubscribed_resources_interval="15secs"
--perf_duration="10secs" --perf_interval="1mins" --port="5051" --qos_correction_interval_min="0ns"
--quiet="false" --recover="reconnect" --recovery_timeout="15mins" --registration_backoff_factor="10ms"
--resources="cpus:2;gpus:0;mem:1024;disk:1024;ports:[31000-32000]" --revocable_cpu_low_priority="true"
--runtime_dir="/tmp/Endpoint_SlaveEndpointTest_NoAuthorizer_0_YIASJD" --sandbox_directory="/mnt/mesos/sandbox"
--strict="true" --switch_user="true" --systemd_enable_support="true" --systemd_runtime_directory="/run/systemd/system"
--version="false" --work_dir="/tmp/Endpoint_SlaveEndpointTest_NoAuthorizer_0_ZCnRMI"
I0711 22:44:35.492368  5346 credentials.hpp:86] Loading credential for authentication from
'/tmp/Endpoint_SlaveEndpointTest_NoAuthorizer_0_YIASJD/credential'
I0711 22:44:35.492630  5346 slave.cpp:283] Agent using credential for: test-principal
I0711 22:44:35.492662  5346 credentials.hpp:37] Loading credentials for authentication from
'/tmp/Endpoint_SlaveEndpointTest_NoAuthorizer_0_YIASJD/http_credentials'
I0711 22:44:35.492943  5346 http.cpp:1009] Creating default 'basic' HTTP authenticator for
realm 'mesos-agent-readonly'
I0711 22:44:35.493125  5346 http.cpp:1009] Creating default 'basic' HTTP authenticator for
realm 'mesos-agent-readwrite'
I0711 22:44:35.494946  5346 slave.cpp:565] Agent resources: [{"name":"cpus","scalar":{"value":2.0},"type":"SCALAR"},{"name":"mem","scalar":{"value":1024.0},"type":"SCALAR"},{"name":"disk","scalar":{"value":1024.0},"type":"SCALAR"},{"name":"ports","ranges":{"range":[{"begin":31000,"end":32000}]},"type":"RANGES"}]
I0711 22:44:35.495213  5346 slave.cpp:573] Agent attributes: [  ]
I0711 22:44:35.495230  5346 slave.cpp:582] Agent hostname: 2645ab09ac08
I0711 22:44:35.495404  5351 status_update_manager.cpp:177] Pausing sending status updates
I0711 22:44:35.497138  5347 state.cpp:64] Recovering state from '/tmp/Endpoint_SlaveEndpointTest_NoAuthorizer_0_ZCnRMI/meta'
I0711 22:44:35.497478  5348 status_update_manager.cpp:203] Recovering status update manager
I0711 22:44:35.497684  5355 containerizer.cpp:582] Recovering containerizer
I0711 22:44:35.499418  5342 provisioner.cpp:416] Provisioner recovery complete
I0711 22:44:35.499959  5332 slave.cpp:6207] Finished recovery
I0711 22:44:35.500596  5332 slave.cpp:6389] Querying resource estimator for oversubscribable
resources
I0711 22:44:35.501077  5344 slave.cpp:6403] Received oversubscribable resources {} from the
resource estimator
I0711 22:44:35.503435  5335 process.cpp:3820] Handling HTTP event for process 'slave(791)'
with path: '/slave(791)/monitor/statistics'
I0711 22:44:35.505017  5342 http.cpp:1149] HTTP GET for /slave(791)/monitor/statistics from
172.17.0.6:36240
I0711 22:44:35.505100  5342 http.cpp:970] Authorizing principal 'test-principal' to GET the
'/monitor/statistics' endpoint
I0711 22:44:35.508545  5352 slave.cpp:843] Agent terminating
[       OK ] Endpoint/SlaveEndpointTest.NoAuthorizer/0 (33 ms)
[ RUN      ] Endpoint/SlaveEndpointTest.NoAuthorizer/1
I0711 22:44:35.521364  5313 containerizer.cpp:230] Using isolation: posix/cpu,posix/mem,filesystem/posix,network/cni,environment_secret
W0711 22:44:35.521908  5313 backend.cpp:76] Failed to create 'aufs' backend: AufsBackend requires
root privileges
W0711 22:44:35.522011  5313 backend.cpp:76] Failed to create 'bind' backend: BindBackend requires
root privileges
I0711 22:44:35.522042  5313 provisioner.cpp:255] Using default backend 'copy'
I0711 22:44:35.524334  5313 cluster.cpp:448] Creating default 'local' authorizer
I0711 22:44:35.526314  5332 slave.cpp:250] Mesos agent started on (792)@172.17.0.6:34238
I0711 22:44:35.526338  5332 slave.cpp:251] Flags at startup: --acls="" --appc_simple_discovery_uri_prefix="http://"
--appc_store_dir="/tmp/Endpoint_SlaveEndpointTest_NoAuthorizer_1_c945Oj/store/appc" --authenticate_http_readonly="true"
--authenticate_http_readwrite="true" --authenticatee="crammd5" --authentication_backoff_factor="1secs"
--authorizer="local" --cgroups_cpu_enable_pids_and_tids_count="false" --cgroups_enable_cfs="false"
--cgroups_hierarchy="/sys/fs/cgroup" --cgroups_limit_swap="false" --cgroups_root="mesos" --container_disk_watch_interval="15secs"
--containerizers="mesos" --credential="/tmp/Endpoint_SlaveEndpointTest_NoAuthorizer_1_c945Oj/credential"
--default_role="*" --disk_watch_interval="1mins" --docker="docker" --docker_kill_orphans="true"
--docker_registry="https://registry-1.docker.io" --docker_remove_delay="6hrs" --docker_socket="/var/run/docker.sock"
--docker_stop_timeout="0ns" --docker_store_dir="/tmp/Endpoint_SlaveEndpointTest_NoAuthorizer_1_c945Oj/store/docker"
--docker_volume_checkpoint_dir="/var/run/mesos/isolators/docker/volume" --enforce_container_disk_quota="false"
--executor_registration_timeout="1mins" --executor_reregistration_timeout="2secs" --executor_shutdown_grace_period="5secs"
--fetcher_cache_dir="/tmp/Endpoint_SlaveEndpointTest_NoAuthorizer_1_c945Oj/fetch" --fetcher_cache_size="2GB"
--frameworks_home="" --gc_delay="1weeks" --gc_disk_headroom="0.1" --hadoop_home="" --help="false"
--hostname_lookup="true" --http_command_executor="false" --http_credentials="/tmp/Endpoint_SlaveEndpointTest_NoAuthorizer_1_c945Oj/http_credentials"
--http_heartbeat_interval="30secs" --initialize_driver_logging="true" --isolation="posix/cpu,posix/mem"
--launcher="posix" --launcher_dir="/mesos/mesos-1.4.0/_build/src" --logbufsecs="0" --logging_level="INFO"
--max_completed_executors_per_framework="150" --oversubscribed_resources_interval="15secs"
--perf_duration="10secs" --perf_interval="1mins" --port="5051" --qos_correction_interval_min="0ns"
--quiet="false" --recover="reconnect" --recovery_timeout="15mins" --registration_backoff_factor="10ms"
--resources="cpus:2;gpus:0;mem:1024;disk:1024;ports:[31000-32000]" --revocable_cpu_low_priority="true"
--runtime_dir="/tmp/Endpoint_SlaveEndpointTest_NoAuthorizer_1_c945Oj" --sandbox_directory="/mnt/mesos/sandbox"
--strict="true" --switch_user="true" --systemd_enable_support="true" --systemd_runtime_directory="/run/systemd/system"
--version="false" --work_dir="/tmp/Endpoint_SlaveEndpointTest_NoAuthorizer_1_ZGK2Mo"
I0711 22:44:35.526768  5332 credentials.hpp:86] Loading credential for authentication from
'/tmp/Endpoint_SlaveEndpointTest_NoAuthorizer_1_c945Oj/credential'
I0711 22:44:35.526976  5332 slave.cpp:283] Agent using credential for: test-principal
I0711 22:44:35.527000  5332 credentials.hpp:37] Loading credentials for authentication from
'/tmp/Endpoint_SlaveEndpointTest_NoAuthorizer_1_c945Oj/http_credentials'
I0711 22:44:35.527256  5332 http.cpp:1009] Creating default 'basic' HTTP authenticator for
realm 'mesos-agent-readonly'
I0711 22:44:35.527410  5332 http.cpp:1009] Creating default 'basic' HTTP authenticator for
realm 'mesos-agent-readwrite'
I0711 22:44:35.528964  5332 slave.cpp:565] Agent resources: [{"name":"cpus","scalar":{"value":2.0},"type":"SCALAR"},{"name":"mem","scalar":{"value":1024.0},"type":"SCALAR"},{"name":"disk","scalar":{"value":1024.0},"type":"SCALAR"},{"name":"ports","ranges":{"range":[{"begin":31000,"end":32000}]},"type":"RANGES"}]
I0711 22:44:35.529211  5332 slave.cpp:573] Agent attributes: [  ]
I0711 22:44:35.529227  5332 slave.cpp:582] Agent hostname: 2645ab09ac08
I0711 22:44:35.529383  5350 status_update_manager.cpp:177] Pausing sending status updates
I0711 22:44:35.531023  5343 state.cpp:64] Recovering state from '/tmp/Endpoint_SlaveEndpointTest_NoAuthorizer_1_ZGK2Mo/meta'
I0711 22:44:35.531445  5344 status_update_manager.cpp:203] Recovering status update manager
I0711 22:44:35.531697  5349 containerizer.cpp:582] Recovering containerizer
I0711 22:44:35.533452  5351 provisioner.cpp:416] Provisioner recovery complete
I0711 22:44:35.533838  5343 slave.cpp:6207] Finished recovery
I0711 22:44:35.534468  5343 slave.cpp:6389] Querying resource estimator for oversubscribable
resources
I0711 22:44:35.534770  5353 slave.cpp:6403] Received oversubscribable resources {} from the
resource estimator
I0711 22:44:35.537788  5344 process.cpp:3820] Handling HTTP event for process 'slave(792)'
with path: '/slave(792)/monitor/statistics.json'
I0711 22:44:35.539203  5355 http.cpp:1149] HTTP GET for /slave(792)/monitor/statistics.json
from 172.17.0.6:36242
I0711 22:44:35.539274  5355 http.cpp:970] Authorizing principal 'test-principal' to GET the
'/monitor/statistics.json' endpoint
I0711 22:44:35.543088  5335 slave.cpp:843] Agent terminating
[       OK ] Endpoint/SlaveEndpointTest.NoAuthorizer/1 (33 ms)
[ RUN      ] Endpoint/SlaveEndpointTest.NoAuthorizer/2
I0711 22:44:35.555106  5313 containerizer.cpp:230] Using isolation: posix/cpu,posix/mem,filesystem/posix,network/cni,environment_secret
W0711 22:44:35.555610  5313 backend.cpp:76] Failed to create 'aufs' backend: AufsBackend requires
root privileges
W0711 22:44:35.555702  5313 backend.cpp:76] Failed to create 'bind' backend: BindBackend requires
root privileges
I0711 22:44:35.555735  5313 provisioner.cpp:255] Using default backend 'copy'
I0711 22:44:35.557605  5313 cluster.cpp:448] Creating default 'local' authorizer
I0711 22:44:35.560660  5343 slave.cpp:250] Mesos agent started on (793)@172.17.0.6:34238
I0711 22:44:35.560714  5343 slave.cpp:251] Flags at startup: --acls="" --appc_simple_discovery_uri_prefix="http://"
--appc_store_dir="/tmp/Endpoint_SlaveEndpointTest_NoAuthorizer_2_Ypyk8Y/store/appc" --authenticate_http_readonly="true"
--authenticate_http_readwrite="true" --authenticatee="crammd5" --authentication_backoff_factor="1secs"
--authorizer="local" --cgroups_cpu_enable_pids_and_tids_count="false" --cgroups_enable_cfs="false"
--cgroups_hierarchy="/sys/fs/cgroup" --cgroups_limit_swap="false" --cgroups_root="mesos" --container_disk_watch_interval="15secs"
--containerizers="mesos" --credential="/tmp/Endpoint_SlaveEndpointTest_NoAuthorizer_2_Ypyk8Y/credential"
--default_role="*" --disk_watch_interval="1mins" --docker="docker" --docker_kill_orphans="true"
--docker_registry="https://registry-1.docker.io" --docker_remove_delay="6hrs" --docker_socket="/var/run/docker.sock"
--docker_stop_timeout="0ns" --docker_store_dir="/tmp/Endpoint_SlaveEndpointTest_NoAuthorizer_2_Ypyk8Y/store/docker"
--docker_volume_checkpoint_dir="/var/run/mesos/isolators/docker/volume" --enforce_container_disk_quota="false"
--executor_registration_timeout="1mins" --executor_reregistration_timeout="2secs" --executor_shutdown_grace_period="5secs"
--fetcher_cache_dir="/tmp/Endpoint_SlaveEndpointTest_NoAuthorizer_2_Ypyk8Y/fetch" --fetcher_cache_size="2GB"
--frameworks_home="" --gc_delay="1weeks" --gc_disk_headroom="0.1" --hadoop_home="" --help="false"
--hostname_lookup="true" --http_command_executor="false" --http_credentials="/tmp/Endpoint_SlaveEndpointTest_NoAuthorizer_2_Ypyk8Y/http_credentials"
--http_heartbeat_interval="30secs" --initialize_driver_logging="true" --isolation="posix/cpu,posix/mem"
--launcher="posix" --launcher_dir="/mesos/mesos-1.4.0/_build/src" --logbufsecs="0" --logging_level="INFO"
--max_completed_executors_per_framework="150" --oversubscribed_resources_interval="15secs"
--perf_duration="10secs" --perf_interval="1mins" --port="5051" --qos_correction_interval_min="0ns"
--quiet="false" --recover="reconnect" --recovery_timeout="15mins" --registration_backoff_factor="10ms"
--resources="cpus:2;gpus:0;mem:1024;disk:1024;ports:[31000-32000]" --revocable_cpu_low_priority="true"
--runtime_dir="/tmp/Endpoint_SlaveEndpointTest_NoAuthorizer_2_Ypyk8Y" --sandbox_directory="/mnt/mesos/sandbox"
--strict="true" --switch_user="true" --systemd_enable_support="true" --systemd_runtime_directory="/run/systemd/system"
--version="false" --work_dir="/tmp/Endpoint_SlaveEndpointTest_NoAuthorizer_2_50Me13"
I0711 22:44:35.561209  5343 credentials.hpp:86] Loading credential for authentication from
'/tmp/Endpoint_SlaveEndpointTest_NoAuthorizer_2_Ypyk8Y/credential'
I0711 22:44:35.561444  5343 slave.cpp:283] Agent using credential for: test-principal
I0711 22:44:35.561470  5343 credentials.hpp:37] Loading credentials for authentication from
'/tmp/Endpoint_SlaveEndpointTest_NoAuthorizer_2_Ypyk8Y/http_credentials'
I0711 22:44:35.561750  5343 http.cpp:1009] Creating default 'basic' HTTP authenticator for
realm 'mesos-agent-readonly'
I0711 22:44:35.561954  5343 http.cpp:1009] Creating default 'basic' HTTP authenticator for
realm 'mesos-agent-readwrite'
I0711 22:44:35.563419  5343 slave.cpp:565] Agent resources: [{"name":"cpus","scalar":{"value":2.0},"type":"SCALAR"},{"name":"mem","scalar":{"value":1024.0},"type":"SCALAR"},{"name":"disk","scalar":{"value":1024.0},"type":"SCALAR"},{"name":"ports","ranges":{"range":[{"begin":31000,"end":32000}]},"type":"RANGES"}]
I0711 22:44:35.563666  5343 slave.cpp:573] Agent attributes: [  ]
I0711 22:44:35.563685  5343 slave.cpp:582] Agent hostname: 2645ab09ac08
I0711 22:44:35.563802  5353 status_update_manager.cpp:177] Pausing sending status updates
I0711 22:44:35.565522  5333 state.cpp:64] Recovering state from '/tmp/Endpoint_SlaveEndpointTest_NoAuthorizer_2_50Me13/meta'
I0711 22:44:35.565853  5335 status_update_manager.cpp:203] Recovering status update manager
I0711 22:44:35.566072  5333 containerizer.cpp:582] Recovering containerizer
I0711 22:44:35.567786  5340 provisioner.cpp:416] Provisioner recovery complete
I0711 22:44:35.568225  5347 slave.cpp:6207] Finished recovery
I0711 22:44:35.568747  5347 slave.cpp:6389] Querying resource estimator for oversubscribable
resources
I0711 22:44:35.569202  5344 slave.cpp:6403] Received oversubscribable resources {} from the
resource estimator
I0711 22:44:35.572782  5349 process.cpp:3820] Handling HTTP event for process 'slave(793)'
with path: '/slave(793)/containers'
I0711 22:44:35.573972  5341 http.cpp:1149] HTTP GET for /slave(793)/containers from 172.17.0.6:36244
I0711 22:44:35.574048  5341 http.cpp:970] Authorizing principal 'test-principal' to GET the
'/containers' endpoint
I0711 22:44:35.577750  5344 slave.cpp:843] Agent terminating
[       OK ] Endpoint/SlaveEndpointTest.NoAuthorizer/2 (35 ms)
[----------] 9 tests from Endpoint/SlaveEndpointTest (310 ms total)

[----------] Global test environment tear-down
[==========] 1635 tests from 179 test cases ran. (541432 ms total)
[  PASSED  ] 1634 tests.
[  FAILED  ] 1 test, listed below:
[  FAILED  ] DefaultExecutorCheckTest.CommandCheckDeliveredAndReconciled

 1 FAILED TEST
  YOU HAVE 20 DISABLED TESTS

I0711 22:44:35.649009  5356 process.cpp:993] Failed to accept socket: future discarded
make[4]: *** [check-local] Error 1
make[4]: Leaving directory `/mesos/mesos-1.4.0/_build/src'
make[3]: *** [check-am] Error 2
make[3]: Leaving directory `/mesos/mesos-1.4.0/_build/src'
make[2]: *** [check] Error 2
make[2]: Leaving directory `/mesos/mesos-1.4.0/_build/src'
make[1]: *** [check-recursive] Error 1
make[1]: Leaving directory `/mesos/mesos-1.4.0/_build'
make: *** [distcheck] Error 1
+ docker rmi mesos-1499810111-7837
Untagged: mesos-1499810111-7837:latest
Deleted: sha256:1b74edbb07ab7fdb91bc321a87262d3000cb566194cb91c5eabe950a82142914
Deleted: sha256:dcbaa676610fb9aa3f6b1a0fe091960a80e13720d0146865e7d335080903b48b
Deleted: sha256:70e72b7da386cb8b73edc4721b2e59607deed916a035f57545495911a652afe5
Deleted: sha256:56ec84156a22e474e08c3bcf7aa872e2c5a1c9537220f8df6403e479eb6d0c0b
Deleted: sha256:943c5336edb7cc9aab635b3d104a425d9d162aff78c36a3e6291f60a0caa4cf1
Deleted: sha256:933985ceab1aa38e809c7f9e4e0d1fb3e154a7e89bcb5a8afa1b77cd34fb31cc
Deleted: sha256:40de0276e525c97d9c7e844bef029aff2d90b20a1518998370d64e37028cf39e
Deleted: sha256:ef86965f065266afb452db2f1167615480d3fef9207f594b900ac11ca04ccbdb
Deleted: sha256:2fd9fc7cac3bb843090eef7aba9da78fd8d459ab5c6ad87134b2a79e181f1e16
Deleted: sha256:d4328cc34649a54fd6b0112309f8b066455e097fb32859a35288ff446beed016
Deleted: sha256:0dfcb542f6178471db705aae6b348f84f8e48c8cb58d39a74574f65284e857af
Deleted: sha256:a96a8ecf5273eae3fed39b5d54083a6aab27367f67c83b41a80a2a8ad8345368
Deleted: sha256:24937c965e3bd5dfcebd41c45fb8383335903194d23268d8bf640f42e2014b7f
Deleted: sha256:b922cf7a2b31bc4e8c4ce119794dc6aa8520574052015c6fea17be0f6a09eaa6
Deleted: sha256:0744d6efff855c5af5630344a0176d7eb5c0d2fe03ca62a209e759623c51d74c
Deleted: sha256:a820327adb06a2ea00588949311d4407e3daeec4c8b399910b6795714067202d
Deleted: sha256:64517e7a86b1e542b67348dcd0f87fc81d88f5a1fae9106e30a3eb7fad904ca3
Deleted: sha256:5c2bef56caa926f04399353d786717748bc6f3c0e43706f602a2137a7d7a85bf
Deleted: sha256:f2e6c8293621c13ec290e48e22c2184a72d66db19b05df8ed693f27de7d93583
Deleted: sha256:203b1836f46c8cc3dd13dd43247f32a111cf890a60877562cffc349e8c850233
Deleted: sha256:0b8605113b27ceaa734c128bd340e923a96a1cabf23851c91d6393a6741d7809
Deleted: sha256:94ff2cd114fcd12ffb85f07ff8c23bf55676449b2ec0ba683225613cf24ca05e
Deleted: sha256:a121e36ac9eccb08cbd28d5d168fa029a7514c488c162c96db5354eb3a9010e5
Deleted: sha256:1876ecfac82aa92946793d9e7389b69631cbb4a6fd674d9613a0dcff605d0e1a
Build step 'Execute shell' marked build as failure

Mime
View raw message