mesos-builds mailing list archives

Site index · List index
Message view « Date » · « Thread »
Top « Date » · « Thread »
From Apache Jenkins Server <jenk...@builds.apache.org>
Subject Build failed in Jenkins: Mesos-Reviewbot #18587
Date Mon, 24 Jul 2017 13:49:56 GMT
See <https://builds.apache.org/job/Mesos-Reviewbot/18587/display/redirect>

------------------------------------------
[...truncated 30.15 MB...]
I0724 13:49:48.859040  5017 containerizer.cpp:230] Using isolation: posix/cpu,posix/mem,filesystem/posix,network/cni,environment_secret
W0724 13:49:48.859939  5017 backend.cpp:76] Failed to create 'overlay' backend: OverlayBackend
requires root privileges
W0724 13:49:48.860107  5017 backend.cpp:76] Failed to create 'bind' backend: BindBackend requires
root privileges
I0724 13:49:48.860231  5017 provisioner.cpp:255] Using default backend 'copy'
I0724 13:49:48.865583  5042 slave.cpp:250] Mesos agent started on (792)@172.17.0.2:38947
I0724 13:49:48.865623  5042 slave.cpp:251] Flags at startup: --acls="" --appc_simple_discovery_uri_prefix="http://"
--appc_store_dir="/tmp/Endpoint_SlaveEndpointTest_AuthorizedRequest_2_Z4BFP3/store/appc" --authenticate_http_readonly="true"
--authenticate_http_readwrite="true" --authenticatee="crammd5" --authentication_backoff_factor="1secs"
--authorizer="local" --cgroups_cpu_enable_pids_and_tids_count="false" --cgroups_enable_cfs="false"
--cgroups_hierarchy="/sys/fs/cgroup" --cgroups_limit_swap="false" --cgroups_root="mesos" --container_disk_watch_interval="15secs"
--containerizers="mesos" --credential="/tmp/Endpoint_SlaveEndpointTest_AuthorizedRequest_2_Z4BFP3/credential"
--default_role="*" --disk_watch_interval="1mins" --docker="docker" --docker_kill_orphans="true"
--docker_registry="https://registry-1.docker.io" --docker_remove_delay="6hrs" --docker_socket="/var/run/docker.sock"
--docker_stop_timeout="0ns" --docker_store_dir="/tmp/Endpoint_SlaveEndpointTest_AuthorizedRequest_2_Z4BFP3/store/docker"
--docker_volume_checkpoint_dir="/var/run/mesos/isolators/docker/volume" --enforce_container_disk_quota="false"
--executor_registration_timeout="1mins" --executor_reregistration_timeout="2secs" --executor_shutdown_grace_period="5secs"
--fetcher_cache_dir="/tmp/Endpoint_SlaveEndpointTest_AuthorizedRequest_2_Z4BFP3/fetch" --fetcher_cache_size="2GB"
--frameworks_home="" --gc_delay="1weeks" --gc_disk_headroom="0.1" --hadoop_home="" --help="false"
--hostname_lookup="true" --http_command_executor="false" --http_credentials="/tmp/Endpoint_SlaveEndpointTest_AuthorizedRequest_2_Z4BFP3/http_credentials"
--http_heartbeat_interval="30secs" --initialize_driver_logging="true" --isolation="posix/cpu,posix/mem"
--launcher="posix" --launcher_dir="/mesos/mesos-1.4.0/_build/src" --logbufsecs="0" --logging_level="INFO"
--max_completed_executors_per_framework="150" --oversubscribed_resources_interval="15secs"
--perf_duration="10secs" --perf_interval="1mins" --port="5051" --qos_correction_interval_min="0ns"
--quiet="false" --recover="reconnect" --recovery_timeout="15mins" --registration_backoff_factor="10ms"
--resources="cpus:2;gpus:0;mem:1024;disk:1024;ports:[31000-32000]" --revocable_cpu_low_priority="true"
--runtime_dir="/tmp/Endpoint_SlaveEndpointTest_AuthorizedRequest_2_Z4BFP3" --sandbox_directory="/mnt/mesos/sandbox"
--strict="true" --switch_user="true" --systemd_enable_support="true" --systemd_runtime_directory="/run/systemd/system"
--version="false" --work_dir="/tmp/Endpoint_SlaveEndpointTest_AuthorizedRequest_2_269Lwg"
I0724 13:49:48.866386  5042 credentials.hpp:86] Loading credential for authentication from
'/tmp/Endpoint_SlaveEndpointTest_AuthorizedRequest_2_Z4BFP3/credential'
I0724 13:49:48.866699  5042 slave.cpp:283] Agent using credential for: test-principal
I0724 13:49:48.866724  5042 credentials.hpp:37] Loading credentials for authentication from
'/tmp/Endpoint_SlaveEndpointTest_AuthorizedRequest_2_Z4BFP3/http_credentials'
I0724 13:49:48.867123  5042 http.cpp:993] Creating default 'basic' HTTP authenticator for
realm 'mesos-agent-readonly'
I0724 13:49:48.867400  5042 http.cpp:993] Creating default 'basic' HTTP authenticator for
realm 'mesos-agent-readwrite'
I0724 13:49:48.869622  5042 slave.cpp:565] Agent resources: [{"name":"cpus","scalar":{"value":2.0},"type":"SCALAR"},{"name":"mem","scalar":{"value":1024.0},"type":"SCALAR"},{"name":"disk","scalar":{"value":1024.0},"type":"SCALAR"},{"name":"ports","ranges":{"range":[{"begin":31000,"end":32000}]},"type":"RANGES"}]
I0724 13:49:48.870085  5042 slave.cpp:573] Agent attributes: [  ]
I0724 13:49:48.870110  5042 slave.cpp:582] Agent hostname: d5b92e5cd630
I0724 13:49:48.870437  5040 status_update_manager.cpp:177] Pausing sending status updates
I0724 13:49:48.872378  5036 state.cpp:64] Recovering state from '/tmp/Endpoint_SlaveEndpointTest_AuthorizedRequest_2_269Lwg/meta'
I0724 13:49:48.872920  5037 status_update_manager.cpp:203] Recovering status update manager
I0724 13:49:48.873260  5043 containerizer.cpp:582] Recovering containerizer
I0724 13:49:48.875486  5042 provisioner.cpp:416] Provisioner recovery complete
I0724 13:49:48.875923  5041 slave.cpp:6207] Finished recovery
I0724 13:49:48.876600  5041 slave.cpp:6389] Querying resource estimator for oversubscribable
resources
I0724 13:49:48.877301  5041 slave.cpp:6403] Received oversubscribable resources {} from the
resource estimator
I0724 13:49:48.881330  5040 process.cpp:3837] Handling HTTP event for process 'slave(792)'
with path: '/slave(792)/containers'
I0724 13:49:48.883297  5042 http.cpp:1133] HTTP GET for /slave(792)/containers from 172.17.0.2:35342
I0724 13:49:48.883426  5042 http.cpp:957] Authorizing principal 'test-principal' to GET the
'/containers' endpoint
I0724 13:49:48.889627  5038 slave.cpp:843] Agent terminating
[       OK ] Endpoint/SlaveEndpointTest.AuthorizedRequest/2 (45 ms)
[ RUN      ] Endpoint/SlaveEndpointTest.UnauthorizedRequest/0
I0724 13:49:48.905161  5017 containerizer.cpp:230] Using isolation: posix/cpu,posix/mem,filesystem/posix,network/cni,environment_secret
W0724 13:49:48.905913  5017 backend.cpp:76] Failed to create 'overlay' backend: OverlayBackend
requires root privileges
W0724 13:49:48.906074  5017 backend.cpp:76] Failed to create 'bind' backend: BindBackend requires
root privileges
I0724 13:49:48.906113  5017 provisioner.cpp:255] Using default backend 'copy'
I0724 13:49:48.911069  5039 slave.cpp:250] Mesos agent started on (793)@172.17.0.2:38947
I0724 13:49:48.911108  5039 slave.cpp:251] Flags at startup: --acls="" --appc_simple_discovery_uri_prefix="http://"
--appc_store_dir="/tmp/Endpoint_SlaveEndpointTest_UnauthorizedRequest_0_XlKMsf/store/appc"
--authenticate_http_readonly="true" --authenticate_http_readwrite="true" --authenticatee="crammd5"
--authentication_backoff_factor="1secs" --authorizer="local" --cgroups_cpu_enable_pids_and_tids_count="false"
--cgroups_enable_cfs="false" --cgroups_hierarchy="/sys/fs/cgroup" --cgroups_limit_swap="false"
--cgroups_root="mesos" --container_disk_watch_interval="15secs" --containerizers="mesos" --credential="/tmp/Endpoint_SlaveEndpointTest_UnauthorizedRequest_0_XlKMsf/credential"
--default_role="*" --disk_watch_interval="1mins" --docker="docker" --docker_kill_orphans="true"
--docker_registry="https://registry-1.docker.io" --docker_remove_delay="6hrs" --docker_socket="/var/run/docker.sock"
--docker_stop_timeout="0ns" --docker_store_dir="/tmp/Endpoint_SlaveEndpointTest_UnauthorizedRequest_0_XlKMsf/store/docker"
--docker_volume_checkpoint_dir="/var/run/mesos/isolators/docker/volume" --enforce_container_disk_quota="false"
--executor_registration_timeout="1mins" --executor_reregistration_timeout="2secs" --executor_shutdown_grace_period="5secs"
--fetcher_cache_dir="/tmp/Endpoint_SlaveEndpointTest_UnauthorizedRequest_0_XlKMsf/fetch" --fetcher_cache_size="2GB"
--frameworks_home="" --gc_delay="1weeks" --gc_disk_headroom="0.1" --hadoop_home="" --help="false"
--hostname_lookup="true" --http_command_executor="false" --http_credentials="/tmp/Endpoint_SlaveEndpointTest_UnauthorizedRequest_0_XlKMsf/http_credentials"
--http_heartbeat_interval="30secs" --initialize_driver_logging="true" --isolation="posix/cpu,posix/mem"
--launcher="posix" --launcher_dir="/mesos/mesos-1.4.0/_build/src" --logbufsecs="0" --logging_level="INFO"
--max_completed_executors_per_framework="150" --oversubscribed_resources_interval="15secs"
--perf_duration="10secs" --perf_interval="1mins" --port="5051" --qos_correction_interval_min="0ns"
--quiet="false" --recover="reconnect" --recovery_timeout="15mins" --registration_backoff_factor="10ms"
--resources="cpus:2;gpus:0;mem:1024;disk:1024;ports:[31000-32000]" --revocable_cpu_low_priority="true"
--runtime_dir="/tmp/Endpoint_SlaveEndpointTest_UnauthorizedRequest_0_XlKMsf" --sandbox_directory="/mnt/mesos/sandbox"
--strict="true" --switch_user="true" --systemd_enable_support="true" --systemd_runtime_directory="/run/systemd/system"
--version="false" --work_dir="/tmp/Endpoint_SlaveEndpointTest_UnauthorizedRequest_0_KToo2r"
I0724 13:49:48.912009  5039 credentials.hpp:86] Loading credential for authentication from
'/tmp/Endpoint_SlaveEndpointTest_UnauthorizedRequest_0_XlKMsf/credential'
I0724 13:49:48.912358  5039 slave.cpp:283] Agent using credential for: test-principal
I0724 13:49:48.912389  5039 credentials.hpp:37] Loading credentials for authentication from
'/tmp/Endpoint_SlaveEndpointTest_UnauthorizedRequest_0_XlKMsf/http_credentials'
I0724 13:49:48.912878  5039 http.cpp:993] Creating default 'basic' HTTP authenticator for
realm 'mesos-agent-readonly'
I0724 13:49:48.913197  5039 http.cpp:993] Creating default 'basic' HTTP authenticator for
realm 'mesos-agent-readwrite'
I0724 13:49:48.915494  5039 slave.cpp:565] Agent resources: [{"name":"cpus","scalar":{"value":2.0},"type":"SCALAR"},{"name":"mem","scalar":{"value":1024.0},"type":"SCALAR"},{"name":"disk","scalar":{"value":1024.0},"type":"SCALAR"},{"name":"ports","ranges":{"range":[{"begin":31000,"end":32000}]},"type":"RANGES"}]
I0724 13:49:48.915984  5039 slave.cpp:573] Agent attributes: [  ]
I0724 13:49:48.916029  5039 slave.cpp:582] Agent hostname: d5b92e5cd630
I0724 13:49:48.916373  5037 status_update_manager.cpp:177] Pausing sending status updates
I0724 13:49:48.918274  5040 state.cpp:64] Recovering state from '/tmp/Endpoint_SlaveEndpointTest_UnauthorizedRequest_0_KToo2r/meta'
I0724 13:49:48.918746  5041 status_update_manager.cpp:203] Recovering status update manager
I0724 13:49:48.919133  5043 containerizer.cpp:582] Recovering containerizer
I0724 13:49:48.921314  5041 provisioner.cpp:416] Provisioner recovery complete
I0724 13:49:48.921841  5038 slave.cpp:6207] Finished recovery
I0724 13:49:48.922739  5038 slave.cpp:6389] Querying resource estimator for oversubscribable
resources
I0724 13:49:48.923096  5039 slave.cpp:6403] Received oversubscribable resources {} from the
resource estimator
I0724 13:49:48.927376  5039 process.cpp:3837] Handling HTTP event for process 'slave(793)'
with path: '/slave(793)/monitor/statistics'
I0724 13:49:48.929344  5043 http.cpp:1133] HTTP GET for /slave(793)/monitor/statistics from
172.17.0.2:35344
I0724 13:49:48.929468  5043 http.cpp:957] Authorizing principal 'test-principal' to GET the
'/monitor/statistics' endpoint
I0724 13:49:48.933383  5041 slave.cpp:843] Agent terminating
[       OK ] Endpoint/SlaveEndpointTest.UnauthorizedRequest/0 (43 ms)
[ RUN      ] Endpoint/SlaveEndpointTest.UnauthorizedRequest/1
I0724 13:49:48.948752  5017 containerizer.cpp:230] Using isolation: posix/cpu,posix/mem,filesystem/posix,network/cni,environment_secret
W0724 13:49:48.949548  5017 backend.cpp:76] Failed to create 'overlay' backend: OverlayBackend
requires root privileges
W0724 13:49:48.949714  5017 backend.cpp:76] Failed to create 'bind' backend: BindBackend requires
root privileges
I0724 13:49:48.949759  5017 provisioner.cpp:255] Using default backend 'copy'
I0724 13:49:48.955438  5036 slave.cpp:250] Mesos agent started on (794)@172.17.0.2:38947
I0724 13:49:48.955476  5036 slave.cpp:251] Flags at startup: --acls="" --appc_simple_discovery_uri_prefix="http://"
--appc_store_dir="/tmp/Endpoint_SlaveEndpointTest_UnauthorizedRequest_1_xuqwyr/store/appc"
--authenticate_http_readonly="true" --authenticate_http_readwrite="true" --authenticatee="crammd5"
--authentication_backoff_factor="1secs" --authorizer="local" --cgroups_cpu_enable_pids_and_tids_count="false"
--cgroups_enable_cfs="false" --cgroups_hierarchy="/sys/fs/cgroup" --cgroups_limit_swap="false"
--cgroups_root="mesos" --container_disk_watch_interval="15secs" --containerizers="mesos" --credential="/tmp/Endpoint_SlaveEndpointTest_UnauthorizedRequest_1_xuqwyr/credential"
--default_role="*" --disk_watch_interval="1mins" --docker="docker" --docker_kill_orphans="true"
--docker_registry="https://registry-1.docker.io" --docker_remove_delay="6hrs" --docker_socket="/var/run/docker.sock"
--docker_stop_timeout="0ns" --docker_store_dir="/tmp/Endpoint_SlaveEndpointTest_UnauthorizedRequest_1_xuqwyr/store/docker"
--docker_volume_checkpoint_dir="/var/run/mesos/isolators/docker/volume" --enforce_container_disk_quota="false"
--executor_registration_timeout="1mins" --executor_reregistration_timeout="2secs" --executor_shutdown_grace_period="5secs"
--fetcher_cache_dir="/tmp/Endpoint_SlaveEndpointTest_UnauthorizedRequest_1_xuqwyr/fetch" --fetcher_cache_size="2GB"
--frameworks_home="" --gc_delay="1weeks" --gc_disk_headroom="0.1" --hadoop_home="" --help="false"
--hostname_lookup="true" --http_command_executor="false" --http_credentials="/tmp/Endpoint_SlaveEndpointTest_UnauthorizedRequest_1_xuqwyr/http_credentials"
--http_heartbeat_interval="30secs" --initialize_driver_logging="true" --isolation="posix/cpu,posix/mem"
--launcher="posix" --launcher_dir="/mesos/mesos-1.4.0/_build/src" --logbufsecs="0" --logging_level="INFO"
--max_completed_executors_per_framework="150" --oversubscribed_resources_interval="15secs"
--perf_duration="10secs" --perf_interval="1mins" --port="5051" --qos_correction_interval_min="0ns"
--quiet="false" --recover="reconnect" --recovery_timeout="15mins" --registration_backoff_factor="10ms"
--resources="cpus:2;gpus:0;mem:1024;disk:1024;ports:[31000-32000]" --revocable_cpu_low_priority="true"
--runtime_dir="/tmp/Endpoint_SlaveEndpointTest_UnauthorizedRequest_1_xuqwyr" --sandbox_directory="/mnt/mesos/sandbox"
--strict="true" --switch_user="true" --systemd_enable_support="true" --systemd_runtime_directory="/run/systemd/system"
--version="false" --work_dir="/tmp/Endpoint_SlaveEndpointTest_UnauthorizedRequest_1_KtY40D"
I0724 13:49:48.956214  5036 credentials.hpp:86] Loading credential for authentication from
'/tmp/Endpoint_SlaveEndpointTest_UnauthorizedRequest_1_xuqwyr/credential'
I0724 13:49:48.956486  5036 slave.cpp:283] Agent using credential for: test-principal
I0724 13:49:48.956512  5036 credentials.hpp:37] Loading credentials for authentication from
'/tmp/Endpoint_SlaveEndpointTest_UnauthorizedRequest_1_xuqwyr/http_credentials'
I0724 13:49:48.956866  5036 http.cpp:993] Creating default 'basic' HTTP authenticator for
realm 'mesos-agent-readonly'
I0724 13:49:48.957093  5036 http.cpp:993] Creating default 'basic' HTTP authenticator for
realm 'mesos-agent-readwrite'
I0724 13:49:48.959249  5036 slave.cpp:565] Agent resources: [{"name":"cpus","scalar":{"value":2.0},"type":"SCALAR"},{"name":"mem","scalar":{"value":1024.0},"type":"SCALAR"},{"name":"disk","scalar":{"value":1024.0},"type":"SCALAR"},{"name":"ports","ranges":{"range":[{"begin":31000,"end":32000}]},"type":"RANGES"}]
I0724 13:49:48.959678  5036 slave.cpp:573] Agent attributes: [  ]
I0724 13:49:48.959700  5036 slave.cpp:582] Agent hostname: d5b92e5cd630
I0724 13:49:48.960008  5041 status_update_manager.cpp:177] Pausing sending status updates
I0724 13:49:48.961938  5042 state.cpp:64] Recovering state from '/tmp/Endpoint_SlaveEndpointTest_UnauthorizedRequest_1_KtY40D/meta'
I0724 13:49:48.962393  5038 status_update_manager.cpp:203] Recovering status update manager
I0724 13:49:48.962713  5043 containerizer.cpp:582] Recovering containerizer
I0724 13:49:48.964802  5041 provisioner.cpp:416] Provisioner recovery complete
I0724 13:49:48.965344  5039 slave.cpp:6207] Finished recovery
I0724 13:49:48.966259  5039 slave.cpp:6389] Querying resource estimator for oversubscribable
resources
I0724 13:49:48.966758  5040 slave.cpp:6403] Received oversubscribable resources {} from the
resource estimator
I0724 13:49:48.971196  5036 process.cpp:3837] Handling HTTP event for process 'slave(794)'
with path: '/slave(794)/monitor/statistics.json'
I0724 13:49:48.973383  5040 http.cpp:1133] HTTP GET for /slave(794)/monitor/statistics.json
from 172.17.0.2:35346
I0724 13:49:48.973592  5040 http.cpp:957] Authorizing principal 'test-principal' to GET the
'/monitor/statistics.json' endpoint
I0724 13:49:48.976881  5041 slave.cpp:843] Agent terminating
[       OK ] Endpoint/SlaveEndpointTest.UnauthorizedRequest/1 (44 ms)
[ RUN      ] Endpoint/SlaveEndpointTest.UnauthorizedRequest/2
I0724 13:49:48.992405  5017 containerizer.cpp:230] Using isolation: posix/cpu,posix/mem,filesystem/posix,network/cni,environment_secret
W0724 13:49:48.993186  5017 backend.cpp:76] Failed to create 'overlay' backend: OverlayBackend
requires root privileges
W0724 13:49:48.993352  5017 backend.cpp:76] Failed to create 'bind' backend: BindBackend requires
root privileges
I0724 13:49:48.993397  5017 provisioner.cpp:255] Using default backend 'copy'
I0724 13:49:48.998338  5037 slave.cpp:250] Mesos agent started on (795)@172.17.0.2:38947
I0724 13:49:48.998378  5037 slave.cpp:251] Flags at startup: --acls="" --appc_simple_discovery_uri_prefix="http://"
--appc_store_dir="/tmp/Endpoint_SlaveEndpointTest_UnauthorizedRequest_2_lgbw6D/store/appc"
--authenticate_http_readonly="true" --authenticate_http_readwrite="true" --authenticatee="crammd5"
--authentication_backoff_factor="1secs" --authorizer="local" --cgroups_cpu_enable_pids_and_tids_count="false"
--cgroups_enable_cfs="false" --cgroups_hierarchy="/sys/fs/cgroup" --cgroups_limit_swap="false"
--cgroups_root="mesos" --container_disk_watch_interval="15secs" --containerizers="mesos" --credential="/tmp/Endpoint_SlaveEndpointTest_UnauthorizedRequest_2_lgbw6D/credential"
--default_role="*" --disk_watch_interval="1mins" --docker="docker" --docker_kill_orphans="true"
--docker_registry="https://registry-1.docker.io" --docker_remove_delay="6hrs" --docker_socket="/var/run/docker.sock"
--docker_stop_timeout="0ns" --docker_store_dir="/tmp/Endpoint_SlaveEndpointTest_UnauthorizedRequest_2_lgbw6D/store/docker"
--docker_volume_checkpoint_dir="/var/run/mesos/isolators/docker/volume" --enforce_container_disk_quota="false"
--executor_registration_timeout="1mins" --executor_reregistration_timeout="2secs" --executor_shutdown_grace_period="5secs"
--fetcher_cache_dir="/tmp/Endpoint_SlaveEndpointTest_UnauthorizedRequest_2_lgbw6D/fetch" --fetcher_cache_size="2GB"
--frameworks_home="" --gc_delay="1weeks" --gc_disk_headroom="0.1" --hadoop_home="" --help="false"
--hostname_lookup="true" --http_command_executor="false" --http_credentials="/tmp/Endpoint_SlaveEndpointTest_UnauthorizedRequest_2_lgbw6D/http_credentials"
--http_heartbeat_interval="30secs" --initialize_driver_logging="true" --isolation="posix/cpu,posix/mem"
--launcher="posix" --launcher_dir="/mesos/mesos-1.4.0/_build/src" --logbufsecs="0" --logging_level="INFO"
--max_completed_executors_per_framework="150" --oversubscribed_resources_interval="15secs"
--perf_duration="10secs" --perf_interval="1mins" --port="5051" --qos_correction_interval_min="0ns"
--quiet="false" --recover="reconnect" --recovery_timeout="15mins" --registration_backoff_factor="10ms"
--resources="cpus:2;gpus:0;mem:1024;disk:1024;ports:[31000-32000]" --revocable_cpu_low_priority="true"
--runtime_dir="/tmp/Endpoint_SlaveEndpointTest_UnauthorizedRequest_2_lgbw6D" --sandbox_directory="/mnt/mesos/sandbox"
--strict="true" --switch_user="true" --systemd_enable_support="true" --systemd_runtime_directory="/run/systemd/system"
--version="false" --work_dir="/tmp/Endpoint_SlaveEndpointTest_UnauthorizedRequest_2_gwwZrQ"
I0724 13:49:48.999104  5037 credentials.hpp:86] Loading credential for authentication from
'/tmp/Endpoint_SlaveEndpointTest_UnauthorizedRequest_2_lgbw6D/credential'
I0724 13:49:48.999377  5037 slave.cpp:283] Agent using credential for: test-principal
I0724 13:49:48.999408  5037 credentials.hpp:37] Loading credentials for authentication from
'/tmp/Endpoint_SlaveEndpointTest_UnauthorizedRequest_2_lgbw6D/http_credentials'
I0724 13:49:48.999800  5037 http.cpp:993] Creating default 'basic' HTTP authenticator for
realm 'mesos-agent-readonly'
I0724 13:49:49.000041  5037 http.cpp:993] Creating default 'basic' HTTP authenticator for
realm 'mesos-agent-readwrite'
I0724 13:49:49.002197  5037 slave.cpp:565] Agent resources: [{"name":"cpus","scalar":{"value":2.0},"type":"SCALAR"},{"name":"mem","scalar":{"value":1024.0},"type":"SCALAR"},{"name":"disk","scalar":{"value":1024.0},"type":"SCALAR"},{"name":"ports","ranges":{"range":[{"begin":31000,"end":32000}]},"type":"RANGES"}]
I0724 13:49:49.002624  5037 slave.cpp:573] Agent attributes: [  ]
I0724 13:49:49.002646  5037 slave.cpp:582] Agent hostname: d5b92e5cd630
I0724 13:49:49.002862  5043 status_update_manager.cpp:177] Pausing sending status updates
I0724 13:49:49.004863  5042 state.cpp:64] Recovering state from '/tmp/Endpoint_SlaveEndpointTest_UnauthorizedRequest_2_gwwZrQ/meta'
I0724 13:49:49.005288  5039 status_update_manager.cpp:203] Recovering status update manager
I0724 13:49:49.005655  5038 containerizer.cpp:582] Recovering containerizer
I0724 13:49:49.007791  5042 provisioner.cpp:416] Provisioner recovery complete
I0724 13:49:49.008302  5037 slave.cpp:6207] Finished recovery
I0724 13:49:49.008942  5037 slave.cpp:6389] Querying resource estimator for oversubscribable
resources
I0724 13:49:49.009402  5041 slave.cpp:6403] Received oversubscribable resources {} from the
resource estimator
I0724 13:49:49.013800  5038 process.cpp:3837] Handling HTTP event for process 'slave(795)'
with path: '/slave(795)/containers'
I0724 13:49:49.015837  5041 http.cpp:1133] HTTP GET for /slave(795)/containers from 172.17.0.2:35348
I0724 13:49:49.015969  5041 http.cpp:957] Authorizing principal 'test-principal' to GET the
'/containers' endpoint
I0724 13:49:49.019726  5041 slave.cpp:843] Agent terminating
[       OK ] Endpoint/SlaveEndpointTest.UnauthorizedRequest/2 (43 ms)
[ RUN      ] Endpoint/SlaveEndpointTest.NoAuthorizer/0
I0724 13:49:49.036013  5017 containerizer.cpp:230] Using isolation: posix/cpu,posix/mem,filesystem/posix,network/cni,environment_secret
W0724 13:49:49.036777  5017 backend.cpp:76] Failed to create 'overlay' backend: OverlayBackend
requires root privileges
W0724 13:49:49.036942  5017 backend.cpp:76] Failed to create 'bind' backend: BindBackend requires
root privileges
I0724 13:49:49.036986  5017 provisioner.cpp:255] Using default backend 'copy'
I0724 13:49:49.039383  5017 cluster.cpp:448] Creating default 'local' authorizer
I0724 13:49:49.042117  5041 slave.cpp:250] Mesos agent started on (796)@172.17.0.2:38947
I0724 13:49:49.042156  5041 slave.cpp:251] Flags at startup: --acls="" --appc_simple_discovery_uri_prefix="http://"
--appc_store_dir="/tmp/Endpoint_SlaveEndpointTest_NoAuthorizer_0_PnQr6Q/store/appc" --authenticate_http_readonly="true"
--authenticate_http_readwrite="true" --authenticatee="crammd5" --authentication_backoff_factor="1secs"
--authorizer="local" --cgroups_cpu_enable_pids_and_tids_count="false" --cgroups_enable_cfs="false"
--cgroups_hierarchy="/sys/fs/cgroup" --cgroups_limit_swap="false" --cgroups_root="mesos" --container_disk_watch_interval="15secs"
--containerizers="mesos" --credential="/tmp/Endpoint_SlaveEndpointTest_NoAuthorizer_0_PnQr6Q/credential"
--default_role="*" --disk_watch_interval="1mins" --docker="docker" --docker_kill_orphans="true"
--docker_registry="https://registry-1.docker.io" --docker_remove_delay="6hrs" --docker_socket="/var/run/docker.sock"
--docker_stop_timeout="0ns" --docker_store_dir="/tmp/Endpoint_SlaveEndpointTest_NoAuthorizer_0_PnQr6Q/store/docker"
--docker_volume_checkpoint_dir="/var/run/mesos/isolators/docker/volume" --enforce_container_disk_quota="false"
--executor_registration_timeout="1mins" --executor_reregistration_timeout="2secs" --executor_shutdown_grace_period="5secs"
--fetcher_cache_dir="/tmp/Endpoint_SlaveEndpointTest_NoAuthorizer_0_PnQr6Q/fetch" --fetcher_cache_size="2GB"
--frameworks_home="" --gc_delay="1weeks" --gc_disk_headroom="0.1" --hadoop_home="" --help="false"
--hostname_lookup="true" --http_command_executor="false" --http_credentials="/tmp/Endpoint_SlaveEndpointTest_NoAuthorizer_0_PnQr6Q/http_credentials"
--http_heartbeat_interval="30secs" --initialize_driver_logging="true" --isolation="posix/cpu,posix/mem"
--launcher="posix" --launcher_dir="/mesos/mesos-1.4.0/_build/src" --logbufsecs="0" --logging_level="INFO"
--max_completed_executors_per_framework="150" --oversubscribed_resources_interval="15secs"
--perf_duration="10secs" --perf_interval="1mins" --port="5051" --qos_correction_interval_min="0ns"
--quiet="false" --recover="reconnect" --recovery_timeout="15mins" --registration_backoff_factor="10ms"
--resources="cpus:2;gpus:0;mem:1024;disk:1024;ports:[31000-32000]" --revocable_cpu_low_priority="true"
--runtime_dir="/tmp/Endpoint_SlaveEndpointTest_NoAuthorizer_0_PnQr6Q" --sandbox_directory="/mnt/mesos/sandbox"
--strict="true" --switch_user="true" --systemd_enable_support="true" --systemd_runtime_directory="/run/systemd/system"
--version="false" --work_dir="/tmp/Endpoint_SlaveEndpointTest_NoAuthorizer_0_kq3Vk3"
I0724 13:49:49.042893  5041 credentials.hpp:86] Loading credential for authentication from
'/tmp/Endpoint_SlaveEndpointTest_NoAuthorizer_0_PnQr6Q/credential'
I0724 13:49:49.043148  5041 slave.cpp:283] Agent using credential for: test-principal
I0724 13:49:49.043169  5041 credentials.hpp:37] Loading credentials for authentication from
'/tmp/Endpoint_SlaveEndpointTest_NoAuthorizer_0_PnQr6Q/http_credentials'
I0724 13:49:49.043509  5041 http.cpp:993] Creating default 'basic' HTTP authenticator for
realm 'mesos-agent-readonly'
I0724 13:49:49.043735  5041 http.cpp:993] Creating default 'basic' HTTP authenticator for
realm 'mesos-agent-readwrite'
I0724 13:49:49.045938  5041 slave.cpp:565] Agent resources: [{"name":"cpus","scalar":{"value":2.0},"type":"SCALAR"},{"name":"mem","scalar":{"value":1024.0},"type":"SCALAR"},{"name":"disk","scalar":{"value":1024.0},"type":"SCALAR"},{"name":"ports","ranges":{"range":[{"begin":31000,"end":32000}]},"type":"RANGES"}]
I0724 13:49:49.046368  5041 slave.cpp:573] Agent attributes: [  ]
I0724 13:49:49.046391  5041 slave.cpp:582] Agent hostname: d5b92e5cd630
I0724 13:49:49.046635  5042 status_update_manager.cpp:177] Pausing sending status updates
I0724 13:49:49.048722  5043 state.cpp:64] Recovering state from '/tmp/Endpoint_SlaveEndpointTest_NoAuthorizer_0_kq3Vk3/meta'
I0724 13:49:49.049262  5038 status_update_manager.cpp:203] Recovering status update manager
I0724 13:49:49.049582  5039 containerizer.cpp:582] Recovering containerizer
I0724 13:49:49.051756  5040 provisioner.cpp:416] Provisioner recovery complete
I0724 13:49:49.052423  5043 slave.cpp:6207] Finished recovery
I0724 13:49:49.053058  5043 slave.cpp:6389] Querying resource estimator for oversubscribable
resources
I0724 13:49:49.053544  5042 slave.cpp:6403] Received oversubscribable resources {} from the
resource estimator
I0724 13:49:49.057938  5041 process.cpp:3837] Handling HTTP event for process 'slave(796)'
with path: '/slave(796)/monitor/statistics'
I0724 13:49:49.059722  5040 http.cpp:1133] HTTP GET for /slave(796)/monitor/statistics from
172.17.0.2:35350
I0724 13:49:49.059909  5040 http.cpp:957] Authorizing principal 'test-principal' to GET the
'/monitor/statistics' endpoint
I0724 13:49:49.065956  5017 slave.cpp:843] Agent terminating
[       OK ] Endpoint/SlaveEndpointTest.NoAuthorizer/0 (45 ms)
[ RUN      ] Endpoint/SlaveEndpointTest.NoAuthorizer/1
I0724 13:49:49.081570  5017 containerizer.cpp:230] Using isolation: posix/cpu,posix/mem,filesystem/posix,network/cni,environment_secret
W0724 13:49:49.082345  5017 backend.cpp:76] Failed to create 'overlay' backend: OverlayBackend
requires root privileges
W0724 13:49:49.082515  5017 backend.cpp:76] Failed to create 'bind' backend: BindBackend requires
root privileges
I0724 13:49:49.082559  5017 provisioner.cpp:255] Using default backend 'copy'
I0724 13:49:49.085036  5017 cluster.cpp:448] Creating default 'local' authorizer
I0724 13:49:49.087739  5041 slave.cpp:250] Mesos agent started on (797)@172.17.0.2:38947
I0724 13:49:49.087783  5041 slave.cpp:251] Flags at startup: --acls="" --appc_simple_discovery_uri_prefix="http://"
--appc_store_dir="/tmp/Endpoint_SlaveEndpointTest_NoAuthorizer_1_VcMGz4/store/appc" --authenticate_http_readonly="true"
--authenticate_http_readwrite="true" --authenticatee="crammd5" --authentication_backoff_factor="1secs"
--authorizer="local" --cgroups_cpu_enable_pids_and_tids_count="false" --cgroups_enable_cfs="false"
--cgroups_hierarchy="/sys/fs/cgroup" --cgroups_limit_swap="false" --cgroups_root="mesos" --container_disk_watch_interval="15secs"
--containerizers="mesos" --credential="/tmp/Endpoint_SlaveEndpointTest_NoAuthorizer_1_VcMGz4/credential"
--default_role="*" --disk_watch_interval="1mins" --docker="docker" --docker_kill_orphans="true"
--docker_registry="https://registry-1.docker.io" --docker_remove_delay="6hrs" --docker_socket="/var/run/docker.sock"
--docker_stop_timeout="0ns" --docker_store_dir="/tmp/Endpoint_SlaveEndpointTest_NoAuthorizer_1_VcMGz4/store/docker"
--docker_volume_checkpoint_dir="/var/run/mesos/isolators/docker/volume" --enforce_container_disk_quota="false"
--executor_registration_timeout="1mins" --executor_reregistration_timeout="2secs" --executor_shutdown_grace_period="5secs"
--fetcher_cache_dir="/tmp/Endpoint_SlaveEndpointTest_NoAuthorizer_1_VcMGz4/fetch" --fetcher_cache_size="2GB"
--frameworks_home="" --gc_delay="1weeks" --gc_disk_headroom="0.1" --hadoop_home="" --help="false"
--hostname_lookup="true" --http_command_executor="false" --http_credentials="/tmp/Endpoint_SlaveEndpointTest_NoAuthorizer_1_VcMGz4/http_credentials"
--http_heartbeat_interval="30secs" --initialize_driver_logging="true" --isolation="posix/cpu,posix/mem"
--launcher="posix" --launcher_dir="/mesos/mesos-1.4.0/_build/src" --logbufsecs="0" --logging_level="INFO"
--max_completed_executors_per_framework="150" --oversubscribed_resources_interval="15secs"
--perf_duration="10secs" --perf_interval="1mins" --port="5051" --qos_correction_interval_min="0ns"
--quiet="false" --recover="reconnect" --recovery_timeout="15mins" --registration_backoff_factor="10ms"
--resources="cpus:2;gpus:0;mem:1024;disk:1024;ports:[31000-32000]" --revocable_cpu_low_priority="true"
--runtime_dir="/tmp/Endpoint_SlaveEndpointTest_NoAuthorizer_1_VcMGz4" --sandbox_directory="/mnt/mesos/sandbox"
--strict="true" --switch_user="true" --systemd_enable_support="true" --systemd_runtime_directory="/run/systemd/system"
--version="false" --work_dir="/tmp/Endpoint_SlaveEndpointTest_NoAuthorizer_1_EwQMGg"
I0724 13:49:49.088495  5041 credentials.hpp:86] Loading credential for authentication from
'/tmp/Endpoint_SlaveEndpointTest_NoAuthorizer_1_VcMGz4/credential'
I0724 13:49:49.088743  5041 slave.cpp:283] Agent using credential for: test-principal
I0724 13:49:49.088766  5041 credentials.hpp:37] Loading credentials for authentication from
'/tmp/Endpoint_SlaveEndpointTest_NoAuthorizer_1_VcMGz4/http_credentials'
I0724 13:49:49.089104  5041 http.cpp:993] Creating default 'basic' HTTP authenticator for
realm 'mesos-agent-readonly'
I0724 13:49:49.089325  5041 http.cpp:993] Creating default 'basic' HTTP authenticator for
realm 'mesos-agent-readwrite'
I0724 13:49:49.091503  5041 slave.cpp:565] Agent resources: [{"name":"cpus","scalar":{"value":2.0},"type":"SCALAR"},{"name":"mem","scalar":{"value":1024.0},"type":"SCALAR"},{"name":"disk","scalar":{"value":1024.0},"type":"SCALAR"},{"name":"ports","ranges":{"range":[{"begin":31000,"end":32000}]},"type":"RANGES"}]
I0724 13:49:49.091930  5041 slave.cpp:573] Agent attributes: [  ]
I0724 13:49:49.091954  5041 slave.cpp:582] Agent hostname: d5b92e5cd630
I0724 13:49:49.092173  5042 status_update_manager.cpp:177] Pausing sending status updates
I0724 13:49:49.094184  5040 state.cpp:64] Recovering state from '/tmp/Endpoint_SlaveEndpointTest_NoAuthorizer_1_EwQMGg/meta'
I0724 13:49:49.094876  5037 status_update_manager.cpp:203] Recovering status update manager
I0724 13:49:49.095234  5041 containerizer.cpp:582] Recovering containerizer
I0724 13:49:49.097373  5038 provisioner.cpp:416] Provisioner recovery complete
I0724 13:49:49.097921  5042 slave.cpp:6207] Finished recovery
I0724 13:49:49.098484  5042 slave.cpp:6389] Querying resource estimator for oversubscribable
resources
I0724 13:49:49.098857  5043 slave.cpp:6403] Received oversubscribable resources {} from the
resource estimator
I0724 13:49:49.103205  5042 process.cpp:3837] Handling HTTP event for process 'slave(797)'
with path: '/slave(797)/monitor/statistics.json'
I0724 13:49:49.105283  5043 http.cpp:1133] HTTP GET for /slave(797)/monitor/statistics.json
from 172.17.0.2:35352
I0724 13:49:49.105484  5043 http.cpp:957] Authorizing principal 'test-principal' to GET the
'/monitor/statistics.json' endpoint
I0724 13:49:49.110625  5039 slave.cpp:843] Agent terminating
[       OK ] Endpoint/SlaveEndpointTest.NoAuthorizer/1 (44 ms)
[ RUN      ] Endpoint/SlaveEndpointTest.NoAuthorizer/2
I0724 13:49:49.126637  5017 containerizer.cpp:230] Using isolation: posix/cpu,posix/mem,filesystem/posix,network/cni,environment_secret
W0724 13:49:49.127411  5017 backend.cpp:76] Failed to create 'overlay' backend: OverlayBackend
requires root privileges
W0724 13:49:49.127580  5017 backend.cpp:76] Failed to create 'bind' backend: BindBackend requires
root privileges
I0724 13:49:49.127626  5017 provisioner.cpp:255] Using default backend 'copy'
I0724 13:49:49.130028  5017 cluster.cpp:448] Creating default 'local' authorizer
I0724 13:49:49.132761  5040 slave.cpp:250] Mesos agent started on (798)@172.17.0.2:38947
I0724 13:49:49.132802  5040 slave.cpp:251] Flags at startup: --acls="" --appc_simple_discovery_uri_prefix="http://"
--appc_store_dir="/tmp/Endpoint_SlaveEndpointTest_NoAuthorizer_2_xs11vi/store/appc" --authenticate_http_readonly="true"
--authenticate_http_readwrite="true" --authenticatee="crammd5" --authentication_backoff_factor="1secs"
--authorizer="local" --cgroups_cpu_enable_pids_and_tids_count="false" --cgroups_enable_cfs="false"
--cgroups_hierarchy="/sys/fs/cgroup" --cgroups_limit_swap="false" --cgroups_root="mesos" --container_disk_watch_interval="15secs"
--containerizers="mesos" --credential="/tmp/Endpoint_SlaveEndpointTest_NoAuthorizer_2_xs11vi/credential"
--default_role="*" --disk_watch_interval="1mins" --docker="docker" --docker_kill_orphans="true"
--docker_registry="https://registry-1.docker.io" --docker_remove_delay="6hrs" --docker_socket="/var/run/docker.sock"
--docker_stop_timeout="0ns" --docker_store_dir="/tmp/Endpoint_SlaveEndpointTest_NoAuthorizer_2_xs11vi/store/docker"
--docker_volume_checkpoint_dir="/var/run/mesos/isolators/docker/volume" --enforce_container_disk_quota="false"
--executor_registration_timeout="1mins" --executor_reregistration_timeout="2secs" --executor_shutdown_grace_period="5secs"
--fetcher_cache_dir="/tmp/Endpoint_SlaveEndpointTest_NoAuthorizer_2_xs11vi/fetch" --fetcher_cache_size="2GB"
--frameworks_home="" --gc_delay="1weeks" --gc_disk_headroom="0.1" --hadoop_home="" --help="false"
--hostname_lookup="true" --http_command_executor="false" --http_credentials="/tmp/Endpoint_SlaveEndpointTest_NoAuthorizer_2_xs11vi/http_credentials"
--http_heartbeat_interval="30secs" --initialize_driver_logging="true" --isolation="posix/cpu,posix/mem"
--launcher="posix" --launcher_dir="/mesos/mesos-1.4.0/_build/src" --logbufsecs="0" --logging_level="INFO"
--max_completed_executors_per_framework="150" --oversubscribed_resources_interval="15secs"
--perf_duration="10secs" --perf_interval="1mins" --port="5051" --qos_correction_interval_min="0ns"
--quiet="false" --recover="reconnect" --recovery_timeout="15mins" --registration_backoff_factor="10ms"
--resources="cpus:2;gpus:0;mem:1024;disk:1024;ports:[31000-32000]" --revocable_cpu_low_priority="true"
--runtime_dir="/tmp/Endpoint_SlaveEndpointTest_NoAuthorizer_2_xs11vi" --sandbox_directory="/mnt/mesos/sandbox"
--strict="true" --switch_user="true" --systemd_enable_support="true" --systemd_runtime_directory="/run/systemd/system"
--version="false" --work_dir="/tmp/Endpoint_SlaveEndpointTest_NoAuthorizer_2_Ym9Svu"
I0724 13:49:49.133677  5040 credentials.hpp:86] Loading credential for authentication from
'/tmp/Endpoint_SlaveEndpointTest_NoAuthorizer_2_xs11vi/credential'
I0724 13:49:49.134204  5040 slave.cpp:283] Agent using credential for: test-principal
I0724 13:49:49.134239  5040 credentials.hpp:37] Loading credentials for authentication from
'/tmp/Endpoint_SlaveEndpointTest_NoAuthorizer_2_xs11vi/http_credentials'
I0724 13:49:49.134721  5040 http.cpp:993] Creating default 'basic' HTTP authenticator for
realm 'mesos-agent-readonly'
I0724 13:49:49.135054  5040 http.cpp:993] Creating default 'basic' HTTP authenticator for
realm 'mesos-agent-readwrite'
I0724 13:49:49.137297  5040 slave.cpp:565] Agent resources: [{"name":"cpus","scalar":{"value":2.0},"type":"SCALAR"},{"name":"mem","scalar":{"value":1024.0},"type":"SCALAR"},{"name":"disk","scalar":{"value":1024.0},"type":"SCALAR"},{"name":"ports","ranges":{"range":[{"begin":31000,"end":32000}]},"type":"RANGES"}]
I0724 13:49:49.137722  5040 slave.cpp:573] Agent attributes: [  ]
I0724 13:49:49.137742  5040 slave.cpp:582] Agent hostname: d5b92e5cd630
I0724 13:49:49.138140  5041 status_update_manager.cpp:177] Pausing sending status updates
I0724 13:49:49.140146  5042 state.cpp:64] Recovering state from '/tmp/Endpoint_SlaveEndpointTest_NoAuthorizer_2_Ym9Svu/meta'
I0724 13:49:49.140586  5039 status_update_manager.cpp:203] Recovering status update manager
I0724 13:49:49.140879  5043 containerizer.cpp:582] Recovering containerizer
I0724 13:49:49.143091  5040 provisioner.cpp:416] Provisioner recovery complete
I0724 13:49:49.143795  5038 slave.cpp:6207] Finished recovery
I0724 13:49:49.144469  5038 slave.cpp:6389] Querying resource estimator for oversubscribable
resources
I0724 13:49:49.144804  5039 slave.cpp:6403] Received oversubscribable resources {} from the
resource estimator
I0724 13:49:49.149129  5039 process.cpp:3837] Handling HTTP event for process 'slave(798)'
with path: '/slave(798)/containers'
I0724 13:49:49.151144  5041 http.cpp:1133] HTTP GET for /slave(798)/containers from 172.17.0.2:35354
I0724 13:49:49.151268  5041 http.cpp:957] Authorizing principal 'test-principal' to GET the
'/containers' endpoint
I0724 13:49:49.157858  5017 slave.cpp:843] Agent terminating
[       OK ] Endpoint/SlaveEndpointTest.NoAuthorizer/2 (47 ms)
[----------] 9 tests from Endpoint/SlaveEndpointTest (404 ms total)

[----------] Global test environment tear-down
[==========] 1637 tests from 179 test cases ran. (717027 ms total)
[  PASSED  ] 1633 tests.
[  FAILED  ] 4 tests, listed below:
[  FAILED  ] DefaultExecutorCheckTest.CommandCheckDeliveredAndReconciled
[  FAILED  ] DefaultExecutorCheckTest.CommandCheckStatusChange
[  FAILED  ] DefaultExecutorCheckTest.CommandCheckSeesParentsEnv
[  FAILED  ] DefaultExecutorCheckTest.CommandCheckSharesWorkDirWithTask

 4 FAILED TESTS
  YOU HAVE 20 DISABLED TESTS

I0724 13:49:49.300571  5044 process.cpp:1006] Failed to accept socket: future discarded
make[4]: *** [check-local] Error 1
make[4]: Leaving directory `/mesos/mesos-1.4.0/_build/src'
make[3]: *** [check-am] Error 2
make[3]: Leaving directory `/mesos/mesos-1.4.0/_build/src'
make[2]: *** [check] Error 2
make[2]: Leaving directory `/mesos/mesos-1.4.0/_build/src'
make[1]: *** [check-recursive] Error 1
make[1]: Leaving directory `/mesos/mesos-1.4.0/_build'
make: *** [distcheck] Error 1
+ docker rmi mesos-1500898473-21738
Untagged: mesos-1500898473-21738:latest
Deleted: sha256:e4ee2b41dc2b65ecb8596aeb776c348ef29aac10478bc7f86e59c30775e9aa1b
Deleted: sha256:a74344923e689a2b99222fb9ae409fe96753b1558b86cc6dc9ee9d3903b49275
Deleted: sha256:3dd104c2a5304f08352b6ffd37558b600a4c267e235611936cc551486c71fb69
Deleted: sha256:f18e6a9be9588a0a57269852e95e5527068326102151bf58b801208b2e508e37
Deleted: sha256:a05d8c6e202d596d426f3bd0d87e944936fb430522784362556ce206f819deb0
Deleted: sha256:c0d2b96541a1fba8caf81e36e7049a181ee081d4d45bd397b41ed5c421885cb1
Deleted: sha256:02340eb7528f69b7ca8d2efb658f041b414314bf451a166cc2a5c22c160fe53e
Deleted: sha256:9e595987642ef7fbad66a5347fc208d6f8960f6ff688478f068e0049f9bac0a9
Deleted: sha256:abcfc0c2a574a7a80e44ae2ddb139df74d40f81ad95df0bd26fad4ee96cc2dcc
Deleted: sha256:9750be0cd7ed785010fb4cc4464b0ccde285bbb689e517d0b2926d5effc48cf0
Deleted: sha256:bfeb6cbc66bc23b9f349490706af3950192c3f6ba56049783f752318b45e554f
Deleted: sha256:e2fc6b4adb0b58ceef873a2bc5021d02012de59c70f04432b13cd4255e86e575
Deleted: sha256:8cf1bf1de0aeceff14dfe724197b200d535c2b2490e9fd66d6976a91d1e81214
Deleted: sha256:c19ef14aacfcaad1a032f08d1638da502e995c984772690b83f4a7439bf8a116
Deleted: sha256:a0238e3bf077a5f26bb38c3a32bbab303d11788857781bac53ff4b1ffb84ca6d
Deleted: sha256:a0e06a0ed3660a7f357fd74e8925ab657150a74e8b4e2f78c1a4ef82f4188e01
Deleted: sha256:2c8417a8c84c65b2ee2500780de145a0a4a8f96b8b0e5ac78daa1f523524eb63
Deleted: sha256:faee4ddae7e5fe9b3205e5775743884d31259fbb2314f93338671e934e54fd67
Deleted: sha256:730985f82dc2cfba45fae8e5df3239dd5b881ab14829180cdb101207e9776d4a
Deleted: sha256:3e83456ca3244e5da7dbcbd4a1a0ebddba3dd9d014c494dd5337f9ae39663cb4
Deleted: sha256:8581730b24c9de7f6c09d08883fad0a3f62fb8d472c33ef2eeb4804c7eff8049
Deleted: sha256:b2e56e2f94a843b4816fc587e69d7c344f278672b099be8a621222974f70577f
Deleted: sha256:76bdc83fa73d03f112a62de6d75bc4bfa366142e2553809bf0b0d8bda9711b5a
Deleted: sha256:a590aa6cd01982131cf815d5f188a684238dc69f2d976413535cd78b372b17a2
Build step 'Execute shell' marked build as failure

Mime
View raw message