mesos-builds mailing list archives

Site index · List index
Message view « Date » · « Thread »
Top « Date » · « Thread »
From Apache Jenkins Server <jenk...@builds.apache.org>
Subject Build failed in Jenkins: Mesos-Reviewbot #18600
Date Wed, 26 Jul 2017 09:31:52 GMT
See <https://builds.apache.org/job/Mesos-Reviewbot/18600/display/redirect>

------------------------------------------
[...truncated 30.25 MB...]
I0726 09:31:46.053558  5016 containerizer.cpp:230] Using isolation: posix/cpu,posix/mem,filesystem/posix,network/cni,environment_secret
W0726 09:31:46.054355  5016 backend.cpp:76] Failed to create 'overlay' backend: OverlayBackend
requires root privileges
W0726 09:31:46.054520  5016 backend.cpp:76] Failed to create 'bind' backend: BindBackend requires
root privileges
I0726 09:31:46.054561  5016 provisioner.cpp:255] Using default backend 'copy'
I0726 09:31:46.059413  5036 slave.cpp:250] Mesos agent started on (796)@172.17.0.2:33345
I0726 09:31:46.059455  5036 slave.cpp:251] Flags at startup: --acls="" --appc_simple_discovery_uri_prefix="http://"
--appc_store_dir="/tmp/Endpoint_SlaveEndpointTest_AuthorizedRequest_2_MYtEtz/store/appc" --authenticate_http_readonly="true"
--authenticate_http_readwrite="true" --authenticatee="crammd5" --authentication_backoff_factor="1secs"
--authorizer="local" --cgroups_cpu_enable_pids_and_tids_count="false" --cgroups_enable_cfs="false"
--cgroups_hierarchy="/sys/fs/cgroup" --cgroups_limit_swap="false" --cgroups_root="mesos" --container_disk_watch_interval="15secs"
--containerizers="mesos" --credential="/tmp/Endpoint_SlaveEndpointTest_AuthorizedRequest_2_MYtEtz/credential"
--default_role="*" --disk_watch_interval="1mins" --docker="docker" --docker_kill_orphans="true"
--docker_registry="https://registry-1.docker.io" --docker_remove_delay="6hrs" --docker_socket="/var/run/docker.sock"
--docker_stop_timeout="0ns" --docker_store_dir="/tmp/Endpoint_SlaveEndpointTest_AuthorizedRequest_2_MYtEtz/store/docker"
--docker_volume_checkpoint_dir="/var/run/mesos/isolators/docker/volume" --enforce_container_disk_quota="false"
--executor_registration_timeout="1mins" --executor_reregistration_timeout="2secs" --executor_shutdown_grace_period="5secs"
--fetcher_cache_dir="/tmp/Endpoint_SlaveEndpointTest_AuthorizedRequest_2_MYtEtz/fetch" --fetcher_cache_size="2GB"
--frameworks_home="" --gc_delay="1weeks" --gc_disk_headroom="0.1" --hadoop_home="" --help="false"
--hostname_lookup="true" --http_command_executor="false" --http_credentials="/tmp/Endpoint_SlaveEndpointTest_AuthorizedRequest_2_MYtEtz/http_credentials"
--http_heartbeat_interval="30secs" --initialize_driver_logging="true" --isolation="posix/cpu,posix/mem"
--launcher="posix" --launcher_dir="/mesos/mesos-1.4.0/_build/src" --logbufsecs="0" --logging_level="INFO"
--max_completed_executors_per_framework="150" --oversubscribed_resources_interval="15secs"
--perf_duration="10secs" --perf_interval="1mins" --port="5051" --qos_correction_interval_min="0ns"
--quiet="false" --recover="reconnect" --recovery_timeout="15mins" --registration_backoff_factor="10ms"
--resources="cpus:2;gpus:0;mem:1024;disk:1024;ports:[31000-32000]" --revocable_cpu_low_priority="true"
--runtime_dir="/tmp/Endpoint_SlaveEndpointTest_AuthorizedRequest_2_MYtEtz" --sandbox_directory="/mnt/mesos/sandbox"
--strict="true" --switch_user="true" --systemd_enable_support="true" --systemd_runtime_directory="/run/systemd/system"
--version="false" --work_dir="/tmp/Endpoint_SlaveEndpointTest_AuthorizedRequest_2_ksCwLl"
I0726 09:31:46.060281  5036 credentials.hpp:86] Loading credential for authentication from
'/tmp/Endpoint_SlaveEndpointTest_AuthorizedRequest_2_MYtEtz/credential'
I0726 09:31:46.060683  5036 slave.cpp:283] Agent using credential for: test-principal
I0726 09:31:46.060709  5036 credentials.hpp:37] Loading credentials for authentication from
'/tmp/Endpoint_SlaveEndpointTest_AuthorizedRequest_2_MYtEtz/http_credentials'
I0726 09:31:46.061152  5036 http.cpp:993] Creating default 'basic' HTTP authenticator for
realm 'mesos-agent-readonly'
I0726 09:31:46.061455  5036 http.cpp:993] Creating default 'basic' HTTP authenticator for
realm 'mesos-agent-readwrite'
I0726 09:31:46.063704  5036 slave.cpp:565] Agent resources: [{"name":"cpus","scalar":{"value":2.0},"type":"SCALAR"},{"name":"mem","scalar":{"value":1024.0},"type":"SCALAR"},{"name":"disk","scalar":{"value":1024.0},"type":"SCALAR"},{"name":"ports","ranges":{"range":[{"begin":31000,"end":32000}]},"type":"RANGES"}]
I0726 09:31:46.064167  5036 slave.cpp:573] Agent attributes: [  ]
I0726 09:31:46.064190  5036 slave.cpp:582] Agent hostname: b90d4cd34a70
I0726 09:31:46.064438  5039 status_update_manager.cpp:177] Pausing sending status updates
I0726 09:31:46.066404  5035 state.cpp:64] Recovering state from '/tmp/Endpoint_SlaveEndpointTest_AuthorizedRequest_2_ksCwLl/meta'
I0726 09:31:46.066862  5042 status_update_manager.cpp:203] Recovering status update manager
I0726 09:31:46.067106  5040 containerizer.cpp:582] Recovering containerizer
I0726 09:31:46.069314  5038 provisioner.cpp:416] Provisioner recovery complete
I0726 09:31:46.069967  5042 slave.cpp:6207] Finished recovery
I0726 09:31:46.070554  5042 slave.cpp:6389] Querying resource estimator for oversubscribable
resources
I0726 09:31:46.071039  5035 slave.cpp:6403] Received oversubscribable resources {} from the
resource estimator
I0726 09:31:46.075567  5036 process.cpp:3837] Handling HTTP event for process 'slave(796)'
with path: '/slave(796)/containers'
I0726 09:31:46.077702  5035 http.cpp:1133] HTTP GET for /slave(796)/containers from 172.17.0.2:59208
I0726 09:31:46.077889  5035 http.cpp:957] Authorizing principal 'test-principal' to GET the
'/containers' endpoint
I0726 09:31:46.084218  5036 slave.cpp:843] Agent terminating
[       OK ] Endpoint/SlaveEndpointTest.AuthorizedRequest/2 (47 ms)
[ RUN      ] Endpoint/SlaveEndpointTest.UnauthorizedRequest/0
I0726 09:31:46.100989  5016 containerizer.cpp:230] Using isolation: posix/cpu,posix/mem,filesystem/posix,network/cni,environment_secret
W0726 09:31:46.101753  5016 backend.cpp:76] Failed to create 'overlay' backend: OverlayBackend
requires root privileges
W0726 09:31:46.101920  5016 backend.cpp:76] Failed to create 'bind' backend: BindBackend requires
root privileges
I0726 09:31:46.101961  5016 provisioner.cpp:255] Using default backend 'copy'
I0726 09:31:46.106930  5035 slave.cpp:250] Mesos agent started on (797)@172.17.0.2:33345
I0726 09:31:46.106971  5035 slave.cpp:251] Flags at startup: --acls="" --appc_simple_discovery_uri_prefix="http://"
--appc_store_dir="/tmp/Endpoint_SlaveEndpointTest_UnauthorizedRequest_0_EOS9Js/store/appc"
--authenticate_http_readonly="true" --authenticate_http_readwrite="true" --authenticatee="crammd5"
--authentication_backoff_factor="1secs" --authorizer="local" --cgroups_cpu_enable_pids_and_tids_count="false"
--cgroups_enable_cfs="false" --cgroups_hierarchy="/sys/fs/cgroup" --cgroups_limit_swap="false"
--cgroups_root="mesos" --container_disk_watch_interval="15secs" --containerizers="mesos" --credential="/tmp/Endpoint_SlaveEndpointTest_UnauthorizedRequest_0_EOS9Js/credential"
--default_role="*" --disk_watch_interval="1mins" --docker="docker" --docker_kill_orphans="true"
--docker_registry="https://registry-1.docker.io" --docker_remove_delay="6hrs" --docker_socket="/var/run/docker.sock"
--docker_stop_timeout="0ns" --docker_store_dir="/tmp/Endpoint_SlaveEndpointTest_UnauthorizedRequest_0_EOS9Js/store/docker"
--docker_volume_checkpoint_dir="/var/run/mesos/isolators/docker/volume" --enforce_container_disk_quota="false"
--executor_registration_timeout="1mins" --executor_reregistration_timeout="2secs" --executor_shutdown_grace_period="5secs"
--fetcher_cache_dir="/tmp/Endpoint_SlaveEndpointTest_UnauthorizedRequest_0_EOS9Js/fetch" --fetcher_cache_size="2GB"
--frameworks_home="" --gc_delay="1weeks" --gc_disk_headroom="0.1" --hadoop_home="" --help="false"
--hostname_lookup="true" --http_command_executor="false" --http_credentials="/tmp/Endpoint_SlaveEndpointTest_UnauthorizedRequest_0_EOS9Js/http_credentials"
--http_heartbeat_interval="30secs" --initialize_driver_logging="true" --isolation="posix/cpu,posix/mem"
--launcher="posix" --launcher_dir="/mesos/mesos-1.4.0/_build/src" --logbufsecs="0" --logging_level="INFO"
--max_completed_executors_per_framework="150" --oversubscribed_resources_interval="15secs"
--perf_duration="10secs" --perf_interval="1mins" --port="5051" --qos_correction_interval_min="0ns"
--quiet="false" --recover="reconnect" --recovery_timeout="15mins" --registration_backoff_factor="10ms"
--resources="cpus:2;gpus:0;mem:1024;disk:1024;ports:[31000-32000]" --revocable_cpu_low_priority="true"
--runtime_dir="/tmp/Endpoint_SlaveEndpointTest_UnauthorizedRequest_0_EOS9Js" --sandbox_directory="/mnt/mesos/sandbox"
--strict="true" --switch_user="true" --systemd_enable_support="true" --systemd_runtime_directory="/run/systemd/system"
--version="false" --work_dir="/tmp/Endpoint_SlaveEndpointTest_UnauthorizedRequest_0_IQ0kUe"
I0726 09:31:46.107836  5035 credentials.hpp:86] Loading credential for authentication from
'/tmp/Endpoint_SlaveEndpointTest_UnauthorizedRequest_0_EOS9Js/credential'
I0726 09:31:46.108371  5035 slave.cpp:283] Agent using credential for: test-principal
I0726 09:31:46.108448  5035 credentials.hpp:37] Loading credentials for authentication from
'/tmp/Endpoint_SlaveEndpointTest_UnauthorizedRequest_0_EOS9Js/http_credentials'
I0726 09:31:46.109037  5035 http.cpp:993] Creating default 'basic' HTTP authenticator for
realm 'mesos-agent-readonly'
I0726 09:31:46.109418  5035 http.cpp:993] Creating default 'basic' HTTP authenticator for
realm 'mesos-agent-readwrite'
I0726 09:31:46.111737  5035 slave.cpp:565] Agent resources: [{"name":"cpus","scalar":{"value":2.0},"type":"SCALAR"},{"name":"mem","scalar":{"value":1024.0},"type":"SCALAR"},{"name":"disk","scalar":{"value":1024.0},"type":"SCALAR"},{"name":"ports","ranges":{"range":[{"begin":31000,"end":32000}]},"type":"RANGES"}]
I0726 09:31:46.112262  5035 slave.cpp:573] Agent attributes: [  ]
I0726 09:31:46.112284  5035 slave.cpp:582] Agent hostname: b90d4cd34a70
I0726 09:31:46.112695  5041 status_update_manager.cpp:177] Pausing sending status updates
I0726 09:31:46.114857  5036 state.cpp:64] Recovering state from '/tmp/Endpoint_SlaveEndpointTest_UnauthorizedRequest_0_IQ0kUe/meta'
I0726 09:31:46.115370  5039 status_update_manager.cpp:203] Recovering status update manager
I0726 09:31:46.115742  5037 containerizer.cpp:582] Recovering containerizer
I0726 09:31:46.117847  5037 provisioner.cpp:416] Provisioner recovery complete
I0726 09:31:46.118463  5041 slave.cpp:6207] Finished recovery
I0726 09:31:46.119215  5041 slave.cpp:6389] Querying resource estimator for oversubscribable
resources
I0726 09:31:46.119668  5035 slave.cpp:6403] Received oversubscribable resources {} from the
resource estimator
I0726 09:31:46.124159  5036 process.cpp:3837] Handling HTTP event for process 'slave(797)'
with path: '/slave(797)/monitor/statistics'
I0726 09:31:46.126029  5041 http.cpp:1133] HTTP GET for /slave(797)/monitor/statistics from
172.17.0.2:59210
I0726 09:31:46.126160  5041 http.cpp:957] Authorizing principal 'test-principal' to GET the
'/monitor/statistics' endpoint
I0726 09:31:46.130054  5016 slave.cpp:843] Agent terminating
[       OK ] Endpoint/SlaveEndpointTest.UnauthorizedRequest/0 (46 ms)
[ RUN      ] Endpoint/SlaveEndpointTest.UnauthorizedRequest/1
I0726 09:31:46.148757  5016 containerizer.cpp:230] Using isolation: posix/cpu,posix/mem,filesystem/posix,network/cni,environment_secret
W0726 09:31:46.149528  5016 backend.cpp:76] Failed to create 'overlay' backend: OverlayBackend
requires root privileges
W0726 09:31:46.149695  5016 backend.cpp:76] Failed to create 'bind' backend: BindBackend requires
root privileges
I0726 09:31:46.149737  5016 provisioner.cpp:255] Using default backend 'copy'
I0726 09:31:46.154693  5041 slave.cpp:250] Mesos agent started on (798)@172.17.0.2:33345
I0726 09:31:46.154736  5041 slave.cpp:251] Flags at startup: --acls="" --appc_simple_discovery_uri_prefix="http://"
--appc_store_dir="/tmp/Endpoint_SlaveEndpointTest_UnauthorizedRequest_1_4nCyvm/store/appc"
--authenticate_http_readonly="true" --authenticate_http_readwrite="true" --authenticatee="crammd5"
--authentication_backoff_factor="1secs" --authorizer="local" --cgroups_cpu_enable_pids_and_tids_count="false"
--cgroups_enable_cfs="false" --cgroups_hierarchy="/sys/fs/cgroup" --cgroups_limit_swap="false"
--cgroups_root="mesos" --container_disk_watch_interval="15secs" --containerizers="mesos" --credential="/tmp/Endpoint_SlaveEndpointTest_UnauthorizedRequest_1_4nCyvm/credential"
--default_role="*" --disk_watch_interval="1mins" --docker="docker" --docker_kill_orphans="true"
--docker_registry="https://registry-1.docker.io" --docker_remove_delay="6hrs" --docker_socket="/var/run/docker.sock"
--docker_stop_timeout="0ns" --docker_store_dir="/tmp/Endpoint_SlaveEndpointTest_UnauthorizedRequest_1_4nCyvm/store/docker"
--docker_volume_checkpoint_dir="/var/run/mesos/isolators/docker/volume" --enforce_container_disk_quota="false"
--executor_registration_timeout="1mins" --executor_reregistration_timeout="2secs" --executor_shutdown_grace_period="5secs"
--fetcher_cache_dir="/tmp/Endpoint_SlaveEndpointTest_UnauthorizedRequest_1_4nCyvm/fetch" --fetcher_cache_size="2GB"
--frameworks_home="" --gc_delay="1weeks" --gc_disk_headroom="0.1" --hadoop_home="" --help="false"
--hostname_lookup="true" --http_command_executor="false" --http_credentials="/tmp/Endpoint_SlaveEndpointTest_UnauthorizedRequest_1_4nCyvm/http_credentials"
--http_heartbeat_interval="30secs" --initialize_driver_logging="true" --isolation="posix/cpu,posix/mem"
--launcher="posix" --launcher_dir="/mesos/mesos-1.4.0/_build/src" --logbufsecs="0" --logging_level="INFO"
--max_completed_executors_per_framework="150" --oversubscribed_resources_interval="15secs"
--perf_duration="10secs" --perf_interval="1mins" --port="5051" --qos_correction_interval_min="0ns"
--quiet="false" --recover="reconnect" --recovery_timeout="15mins" --registration_backoff_factor="10ms"
--resources="cpus:2;gpus:0;mem:1024;disk:1024;ports:[31000-32000]" --revocable_cpu_low_priority="true"
--runtime_dir="/tmp/Endpoint_SlaveEndpointTest_UnauthorizedRequest_1_4nCyvm" --sandbox_directory="/mnt/mesos/sandbox"
--strict="true" --switch_user="true" --systemd_enable_support="true" --systemd_runtime_directory="/run/systemd/system"
--version="false" --work_dir="/tmp/Endpoint_SlaveEndpointTest_UnauthorizedRequest_1_0fb1x8"
I0726 09:31:46.155529  5041 credentials.hpp:86] Loading credential for authentication from
'/tmp/Endpoint_SlaveEndpointTest_UnauthorizedRequest_1_4nCyvm/credential'
I0726 09:31:46.155872  5041 slave.cpp:283] Agent using credential for: test-principal
I0726 09:31:46.155903  5041 credentials.hpp:37] Loading credentials for authentication from
'/tmp/Endpoint_SlaveEndpointTest_UnauthorizedRequest_1_4nCyvm/http_credentials'
I0726 09:31:46.156365  5041 http.cpp:993] Creating default 'basic' HTTP authenticator for
realm 'mesos-agent-readonly'
I0726 09:31:46.156671  5041 http.cpp:993] Creating default 'basic' HTTP authenticator for
realm 'mesos-agent-readwrite'
I0726 09:31:46.158917  5041 slave.cpp:565] Agent resources: [{"name":"cpus","scalar":{"value":2.0},"type":"SCALAR"},{"name":"mem","scalar":{"value":1024.0},"type":"SCALAR"},{"name":"disk","scalar":{"value":1024.0},"type":"SCALAR"},{"name":"ports","ranges":{"range":[{"begin":31000,"end":32000}]},"type":"RANGES"}]
I0726 09:31:46.159345  5041 slave.cpp:573] Agent attributes: [  ]
I0726 09:31:46.159368  5041 slave.cpp:582] Agent hostname: b90d4cd34a70
I0726 09:31:46.159647  5042 status_update_manager.cpp:177] Pausing sending status updates
I0726 09:31:46.161734  5035 state.cpp:64] Recovering state from '/tmp/Endpoint_SlaveEndpointTest_UnauthorizedRequest_1_0fb1x8/meta'
I0726 09:31:46.162154  5042 status_update_manager.cpp:203] Recovering status update manager
I0726 09:31:46.162521  5037 containerizer.cpp:582] Recovering containerizer
I0726 09:31:46.164819  5037 provisioner.cpp:416] Provisioner recovery complete
I0726 09:31:46.165443  5039 slave.cpp:6207] Finished recovery
I0726 09:31:46.166141  5039 slave.cpp:6389] Querying resource estimator for oversubscribable
resources
I0726 09:31:46.166465  5037 slave.cpp:6403] Received oversubscribable resources {} from the
resource estimator
I0726 09:31:46.170794  5037 process.cpp:3837] Handling HTTP event for process 'slave(798)'
with path: '/slave(798)/monitor/statistics.json'
I0726 09:31:46.172662  5042 http.cpp:1133] HTTP GET for /slave(798)/monitor/statistics.json
from 172.17.0.2:59212
I0726 09:31:46.172792  5042 http.cpp:957] Authorizing principal 'test-principal' to GET the
'/monitor/statistics.json' endpoint
I0726 09:31:46.176504  5036 slave.cpp:843] Agent terminating
[       OK ] Endpoint/SlaveEndpointTest.UnauthorizedRequest/1 (45 ms)
[ RUN      ] Endpoint/SlaveEndpointTest.UnauthorizedRequest/2
I0726 09:31:46.194095  5016 containerizer.cpp:230] Using isolation: posix/cpu,posix/mem,filesystem/posix,network/cni,environment_secret
W0726 09:31:46.194877  5016 backend.cpp:76] Failed to create 'overlay' backend: OverlayBackend
requires root privileges
W0726 09:31:46.195045  5016 backend.cpp:76] Failed to create 'bind' backend: BindBackend requires
root privileges
I0726 09:31:46.195088  5016 provisioner.cpp:255] Using default backend 'copy'
I0726 09:31:46.199990  5041 slave.cpp:250] Mesos agent started on (799)@172.17.0.2:33345
I0726 09:31:46.200031  5041 slave.cpp:251] Flags at startup: --acls="" --appc_simple_discovery_uri_prefix="http://"
--appc_store_dir="/tmp/Endpoint_SlaveEndpointTest_UnauthorizedRequest_2_SHNGKg/store/appc"
--authenticate_http_readonly="true" --authenticate_http_readwrite="true" --authenticatee="crammd5"
--authentication_backoff_factor="1secs" --authorizer="local" --cgroups_cpu_enable_pids_and_tids_count="false"
--cgroups_enable_cfs="false" --cgroups_hierarchy="/sys/fs/cgroup" --cgroups_limit_swap="false"
--cgroups_root="mesos" --container_disk_watch_interval="15secs" --containerizers="mesos" --credential="/tmp/Endpoint_SlaveEndpointTest_UnauthorizedRequest_2_SHNGKg/credential"
--default_role="*" --disk_watch_interval="1mins" --docker="docker" --docker_kill_orphans="true"
--docker_registry="https://registry-1.docker.io" --docker_remove_delay="6hrs" --docker_socket="/var/run/docker.sock"
--docker_stop_timeout="0ns" --docker_store_dir="/tmp/Endpoint_SlaveEndpointTest_UnauthorizedRequest_2_SHNGKg/store/docker"
--docker_volume_checkpoint_dir="/var/run/mesos/isolators/docker/volume" --enforce_container_disk_quota="false"
--executor_registration_timeout="1mins" --executor_reregistration_timeout="2secs" --executor_shutdown_grace_period="5secs"
--fetcher_cache_dir="/tmp/Endpoint_SlaveEndpointTest_UnauthorizedRequest_2_SHNGKg/fetch" --fetcher_cache_size="2GB"
--frameworks_home="" --gc_delay="1weeks" --gc_disk_headroom="0.1" --hadoop_home="" --help="false"
--hostname_lookup="true" --http_command_executor="false" --http_credentials="/tmp/Endpoint_SlaveEndpointTest_UnauthorizedRequest_2_SHNGKg/http_credentials"
--http_heartbeat_interval="30secs" --initialize_driver_logging="true" --isolation="posix/cpu,posix/mem"
--launcher="posix" --launcher_dir="/mesos/mesos-1.4.0/_build/src" --logbufsecs="0" --logging_level="INFO"
--max_completed_executors_per_framework="150" --oversubscribed_resources_interval="15secs"
--perf_duration="10secs" --perf_interval="1mins" --port="5051" --qos_correction_interval_min="0ns"
--quiet="false" --recover="reconnect" --recovery_timeout="15mins" --registration_backoff_factor="10ms"
--resources="cpus:2;gpus:0;mem:1024;disk:1024;ports:[31000-32000]" --revocable_cpu_low_priority="true"
--runtime_dir="/tmp/Endpoint_SlaveEndpointTest_UnauthorizedRequest_2_SHNGKg" --sandbox_directory="/mnt/mesos/sandbox"
--strict="true" --switch_user="true" --systemd_enable_support="true" --systemd_runtime_directory="/run/systemd/system"
--version="false" --work_dir="/tmp/Endpoint_SlaveEndpointTest_UnauthorizedRequest_2_Y6yNF2"
I0726 09:31:46.201021  5041 credentials.hpp:86] Loading credential for authentication from
'/tmp/Endpoint_SlaveEndpointTest_UnauthorizedRequest_2_SHNGKg/credential'
I0726 09:31:46.201359  5041 slave.cpp:283] Agent using credential for: test-principal
I0726 09:31:46.201386  5041 credentials.hpp:37] Loading credentials for authentication from
'/tmp/Endpoint_SlaveEndpointTest_UnauthorizedRequest_2_SHNGKg/http_credentials'
I0726 09:31:46.201833  5041 http.cpp:993] Creating default 'basic' HTTP authenticator for
realm 'mesos-agent-readonly'
I0726 09:31:46.202126  5041 http.cpp:993] Creating default 'basic' HTTP authenticator for
realm 'mesos-agent-readwrite'
I0726 09:31:46.204390  5041 slave.cpp:565] Agent resources: [{"name":"cpus","scalar":{"value":2.0},"type":"SCALAR"},{"name":"mem","scalar":{"value":1024.0},"type":"SCALAR"},{"name":"disk","scalar":{"value":1024.0},"type":"SCALAR"},{"name":"ports","ranges":{"range":[{"begin":31000,"end":32000}]},"type":"RANGES"}]
I0726 09:31:46.204821  5041 slave.cpp:573] Agent attributes: [  ]
I0726 09:31:46.204845  5041 slave.cpp:582] Agent hostname: b90d4cd34a70
I0726 09:31:46.205144  5037 status_update_manager.cpp:177] Pausing sending status updates
I0726 09:31:46.207141  5035 state.cpp:64] Recovering state from '/tmp/Endpoint_SlaveEndpointTest_UnauthorizedRequest_2_Y6yNF2/meta'
I0726 09:31:46.207711  5039 status_update_manager.cpp:203] Recovering status update manager
I0726 09:31:46.207994  5040 containerizer.cpp:582] Recovering containerizer
I0726 09:31:46.210134  5039 provisioner.cpp:416] Provisioner recovery complete
I0726 09:31:46.210723  5037 slave.cpp:6207] Finished recovery
I0726 09:31:46.211362  5037 slave.cpp:6389] Querying resource estimator for oversubscribable
resources
I0726 09:31:46.211748  5036 slave.cpp:6403] Received oversubscribable resources {} from the
resource estimator
I0726 09:31:46.216311  5036 process.cpp:3837] Handling HTTP event for process 'slave(799)'
with path: '/slave(799)/containers'
I0726 09:31:46.218411  5040 http.cpp:1133] HTTP GET for /slave(799)/containers from 172.17.0.2:59214
I0726 09:31:46.218677  5040 http.cpp:957] Authorizing principal 'test-principal' to GET the
'/containers' endpoint
I0726 09:31:46.223018  5036 slave.cpp:843] Agent terminating
[       OK ] Endpoint/SlaveEndpointTest.UnauthorizedRequest/2 (46 ms)
[ RUN      ] Endpoint/SlaveEndpointTest.NoAuthorizer/0
I0726 09:31:46.240279  5016 containerizer.cpp:230] Using isolation: posix/cpu,posix/mem,filesystem/posix,network/cni,environment_secret
W0726 09:31:46.241050  5016 backend.cpp:76] Failed to create 'overlay' backend: OverlayBackend
requires root privileges
W0726 09:31:46.241214  5016 backend.cpp:76] Failed to create 'bind' backend: BindBackend requires
root privileges
I0726 09:31:46.241256  5016 provisioner.cpp:255] Using default backend 'copy'
I0726 09:31:46.243597  5016 cluster.cpp:448] Creating default 'local' authorizer
I0726 09:31:46.246282  5035 slave.cpp:250] Mesos agent started on (800)@172.17.0.2:33345
I0726 09:31:46.246322  5035 slave.cpp:251] Flags at startup: --acls="" --appc_simple_discovery_uri_prefix="http://"
--appc_store_dir="/tmp/Endpoint_SlaveEndpointTest_NoAuthorizer_0_WfCttb/store/appc" --authenticate_http_readonly="true"
--authenticate_http_readwrite="true" --authenticatee="crammd5" --authentication_backoff_factor="1secs"
--authorizer="local" --cgroups_cpu_enable_pids_and_tids_count="false" --cgroups_enable_cfs="false"
--cgroups_hierarchy="/sys/fs/cgroup" --cgroups_limit_swap="false" --cgroups_root="mesos" --container_disk_watch_interval="15secs"
--containerizers="mesos" --credential="/tmp/Endpoint_SlaveEndpointTest_NoAuthorizer_0_WfCttb/credential"
--default_role="*" --disk_watch_interval="1mins" --docker="docker" --docker_kill_orphans="true"
--docker_registry="https://registry-1.docker.io" --docker_remove_delay="6hrs" --docker_socket="/var/run/docker.sock"
--docker_stop_timeout="0ns" --docker_store_dir="/tmp/Endpoint_SlaveEndpointTest_NoAuthorizer_0_WfCttb/store/docker"
--docker_volume_checkpoint_dir="/var/run/mesos/isolators/docker/volume" --enforce_container_disk_quota="false"
--executor_registration_timeout="1mins" --executor_reregistration_timeout="2secs" --executor_shutdown_grace_period="5secs"
--fetcher_cache_dir="/tmp/Endpoint_SlaveEndpointTest_NoAuthorizer_0_WfCttb/fetch" --fetcher_cache_size="2GB"
--frameworks_home="" --gc_delay="1weeks" --gc_disk_headroom="0.1" --hadoop_home="" --help="false"
--hostname_lookup="true" --http_command_executor="false" --http_credentials="/tmp/Endpoint_SlaveEndpointTest_NoAuthorizer_0_WfCttb/http_credentials"
--http_heartbeat_interval="30secs" --initialize_driver_logging="true" --isolation="posix/cpu,posix/mem"
--launcher="posix" --launcher_dir="/mesos/mesos-1.4.0/_build/src" --logbufsecs="0" --logging_level="INFO"
--max_completed_executors_per_framework="150" --oversubscribed_resources_interval="15secs"
--perf_duration="10secs" --perf_interval="1mins" --port="5051" --qos_correction_interval_min="0ns"
--quiet="false" --recover="reconnect" --recovery_timeout="15mins" --registration_backoff_factor="10ms"
--resources="cpus:2;gpus:0;mem:1024;disk:1024;ports:[31000-32000]" --revocable_cpu_low_priority="true"
--runtime_dir="/tmp/Endpoint_SlaveEndpointTest_NoAuthorizer_0_WfCttb" --sandbox_directory="/mnt/mesos/sandbox"
--strict="true" --switch_user="true" --systemd_enable_support="true" --systemd_runtime_directory="/run/systemd/system"
--version="false" --work_dir="/tmp/Endpoint_SlaveEndpointTest_NoAuthorizer_0_mHnahX"
I0726 09:31:46.247133  5035 credentials.hpp:86] Loading credential for authentication from
'/tmp/Endpoint_SlaveEndpointTest_NoAuthorizer_0_WfCttb/credential'
I0726 09:31:46.247517  5035 slave.cpp:283] Agent using credential for: test-principal
I0726 09:31:46.247550  5035 credentials.hpp:37] Loading credentials for authentication from
'/tmp/Endpoint_SlaveEndpointTest_NoAuthorizer_0_WfCttb/http_credentials'
I0726 09:31:46.248011  5035 http.cpp:993] Creating default 'basic' HTTP authenticator for
realm 'mesos-agent-readonly'
I0726 09:31:46.248332  5035 http.cpp:993] Creating default 'basic' HTTP authenticator for
realm 'mesos-agent-readwrite'
I0726 09:31:46.250615  5035 slave.cpp:565] Agent resources: [{"name":"cpus","scalar":{"value":2.0},"type":"SCALAR"},{"name":"mem","scalar":{"value":1024.0},"type":"SCALAR"},{"name":"disk","scalar":{"value":1024.0},"type":"SCALAR"},{"name":"ports","ranges":{"range":[{"begin":31000,"end":32000}]},"type":"RANGES"}]
I0726 09:31:46.251044  5035 slave.cpp:573] Agent attributes: [  ]
I0726 09:31:46.251066  5035 slave.cpp:582] Agent hostname: b90d4cd34a70
I0726 09:31:46.251310  5041 status_update_manager.cpp:177] Pausing sending status updates
I0726 09:31:46.253423  5038 state.cpp:64] Recovering state from '/tmp/Endpoint_SlaveEndpointTest_NoAuthorizer_0_mHnahX/meta'
I0726 09:31:46.253831  5042 status_update_manager.cpp:203] Recovering status update manager
I0726 09:31:46.254130  5039 containerizer.cpp:582] Recovering containerizer
I0726 09:31:46.256283  5039 provisioner.cpp:416] Provisioner recovery complete
I0726 09:31:46.256858  5035 slave.cpp:6207] Finished recovery
I0726 09:31:46.257645  5035 slave.cpp:6389] Querying resource estimator for oversubscribable
resources
I0726 09:31:46.258090  5038 slave.cpp:6403] Received oversubscribable resources {} from the
resource estimator
I0726 09:31:46.262326  5036 process.cpp:3837] Handling HTTP event for process 'slave(800)'
with path: '/slave(800)/monitor/statistics'
I0726 09:31:46.264531  5039 http.cpp:1133] HTTP GET for /slave(800)/monitor/statistics from
172.17.0.2:59216
I0726 09:31:46.264663  5039 http.cpp:957] Authorizing principal 'test-principal' to GET the
'/monitor/statistics' endpoint
I0726 09:31:46.269551  5016 slave.cpp:843] Agent terminating
[       OK ] Endpoint/SlaveEndpointTest.NoAuthorizer/0 (45 ms)
[ RUN      ] Endpoint/SlaveEndpointTest.NoAuthorizer/1
I0726 09:31:46.286633  5016 containerizer.cpp:230] Using isolation: posix/cpu,posix/mem,filesystem/posix,network/cni,environment_secret
W0726 09:31:46.287672  5016 backend.cpp:76] Failed to create 'overlay' backend: OverlayBackend
requires root privileges
W0726 09:31:46.287830  5016 backend.cpp:76] Failed to create 'bind' backend: BindBackend requires
root privileges
I0726 09:31:46.287873  5016 provisioner.cpp:255] Using default backend 'copy'
I0726 09:31:46.290226  5016 cluster.cpp:448] Creating default 'local' authorizer
I0726 09:31:46.292934  5036 slave.cpp:250] Mesos agent started on (801)@172.17.0.2:33345
I0726 09:31:46.292974  5036 slave.cpp:251] Flags at startup: --acls="" --appc_simple_discovery_uri_prefix="http://"
--appc_store_dir="/tmp/Endpoint_SlaveEndpointTest_NoAuthorizer_1_UOqeG6/store/appc" --authenticate_http_readonly="true"
--authenticate_http_readwrite="true" --authenticatee="crammd5" --authentication_backoff_factor="1secs"
--authorizer="local" --cgroups_cpu_enable_pids_and_tids_count="false" --cgroups_enable_cfs="false"
--cgroups_hierarchy="/sys/fs/cgroup" --cgroups_limit_swap="false" --cgroups_root="mesos" --container_disk_watch_interval="15secs"
--containerizers="mesos" --credential="/tmp/Endpoint_SlaveEndpointTest_NoAuthorizer_1_UOqeG6/credential"
--default_role="*" --disk_watch_interval="1mins" --docker="docker" --docker_kill_orphans="true"
--docker_registry="https://registry-1.docker.io" --docker_remove_delay="6hrs" --docker_socket="/var/run/docker.sock"
--docker_stop_timeout="0ns" --docker_store_dir="/tmp/Endpoint_SlaveEndpointTest_NoAuthorizer_1_UOqeG6/store/docker"
--docker_volume_checkpoint_dir="/var/run/mesos/isolators/docker/volume" --enforce_container_disk_quota="false"
--executor_registration_timeout="1mins" --executor_reregistration_timeout="2secs" --executor_shutdown_grace_period="5secs"
--fetcher_cache_dir="/tmp/Endpoint_SlaveEndpointTest_NoAuthorizer_1_UOqeG6/fetch" --fetcher_cache_size="2GB"
--frameworks_home="" --gc_delay="1weeks" --gc_disk_headroom="0.1" --hadoop_home="" --help="false"
--hostname_lookup="true" --http_command_executor="false" --http_credentials="/tmp/Endpoint_SlaveEndpointTest_NoAuthorizer_1_UOqeG6/http_credentials"
--http_heartbeat_interval="30secs" --initialize_driver_logging="true" --isolation="posix/cpu,posix/mem"
--launcher="posix" --launcher_dir="/mesos/mesos-1.4.0/_build/src" --logbufsecs="0" --logging_level="INFO"
--max_completed_executors_per_framework="150" --oversubscribed_resources_interval="15secs"
--perf_duration="10secs" --perf_interval="1mins" --port="5051" --qos_correction_interval_min="0ns"
--quiet="false" --recover="reconnect" --recovery_timeout="15mins" --registration_backoff_factor="10ms"
--resources="cpus:2;gpus:0;mem:1024;disk:1024;ports:[31000-32000]" --revocable_cpu_low_priority="true"
--runtime_dir="/tmp/Endpoint_SlaveEndpointTest_NoAuthorizer_1_UOqeG6" --sandbox_directory="/mnt/mesos/sandbox"
--strict="true" --switch_user="true" --systemd_enable_support="true" --systemd_runtime_directory="/run/systemd/system"
--version="false" --work_dir="/tmp/Endpoint_SlaveEndpointTest_NoAuthorizer_1_Is8qmS"
I0726 09:31:46.293771  5036 credentials.hpp:86] Loading credential for authentication from
'/tmp/Endpoint_SlaveEndpointTest_NoAuthorizer_1_UOqeG6/credential'
I0726 09:31:46.294220  5036 slave.cpp:283] Agent using credential for: test-principal
I0726 09:31:46.294260  5036 credentials.hpp:37] Loading credentials for authentication from
'/tmp/Endpoint_SlaveEndpointTest_NoAuthorizer_1_UOqeG6/http_credentials'
I0726 09:31:46.294734  5036 http.cpp:993] Creating default 'basic' HTTP authenticator for
realm 'mesos-agent-readonly'
I0726 09:31:46.295053  5036 http.cpp:993] Creating default 'basic' HTTP authenticator for
realm 'mesos-agent-readwrite'
I0726 09:31:46.297277  5036 slave.cpp:565] Agent resources: [{"name":"cpus","scalar":{"value":2.0},"type":"SCALAR"},{"name":"mem","scalar":{"value":1024.0},"type":"SCALAR"},{"name":"disk","scalar":{"value":1024.0},"type":"SCALAR"},{"name":"ports","ranges":{"range":[{"begin":31000,"end":32000}]},"type":"RANGES"}]
I0726 09:31:46.297705  5036 slave.cpp:573] Agent attributes: [  ]
I0726 09:31:46.297725  5036 slave.cpp:582] Agent hostname: b90d4cd34a70
I0726 09:31:46.297966  5038 status_update_manager.cpp:177] Pausing sending status updates
I0726 09:31:46.299984  5040 state.cpp:64] Recovering state from '/tmp/Endpoint_SlaveEndpointTest_NoAuthorizer_1_Is8qmS/meta'
I0726 09:31:46.300597  5038 status_update_manager.cpp:203] Recovering status update manager
I0726 09:31:46.300956  5039 containerizer.cpp:582] Recovering containerizer
I0726 09:31:46.303053  5036 provisioner.cpp:416] Provisioner recovery complete
I0726 09:31:46.303730  5040 slave.cpp:6207] Finished recovery
I0726 09:31:46.304653  5040 slave.cpp:6389] Querying resource estimator for oversubscribable
resources
I0726 09:31:46.305166  5035 slave.cpp:6403] Received oversubscribable resources {} from the
resource estimator
I0726 09:31:46.309552  5038 process.cpp:3837] Handling HTTP event for process 'slave(801)'
with path: '/slave(801)/monitor/statistics.json'
I0726 09:31:46.311462  5041 http.cpp:1133] HTTP GET for /slave(801)/monitor/statistics.json
from 172.17.0.2:59218
I0726 09:31:46.311592  5041 http.cpp:957] Authorizing principal 'test-principal' to GET the
'/monitor/statistics.json' endpoint
I0726 09:31:46.317206  5042 slave.cpp:843] Agent terminating
[       OK ] Endpoint/SlaveEndpointTest.NoAuthorizer/1 (47 ms)
[ RUN      ] Endpoint/SlaveEndpointTest.NoAuthorizer/2
I0726 09:31:46.334297  5016 containerizer.cpp:230] Using isolation: posix/cpu,posix/mem,filesystem/posix,network/cni,environment_secret
W0726 09:31:46.335081  5016 backend.cpp:76] Failed to create 'overlay' backend: OverlayBackend
requires root privileges
W0726 09:31:46.335252  5016 backend.cpp:76] Failed to create 'bind' backend: BindBackend requires
root privileges
I0726 09:31:46.335294  5016 provisioner.cpp:255] Using default backend 'copy'
I0726 09:31:46.338161  5016 cluster.cpp:448] Creating default 'local' authorizer
I0726 09:31:46.340873  5041 slave.cpp:250] Mesos agent started on (802)@172.17.0.2:33345
I0726 09:31:46.340914  5041 slave.cpp:251] Flags at startup: --acls="" --appc_simple_discovery_uri_prefix="http://"
--appc_store_dir="/tmp/Endpoint_SlaveEndpointTest_NoAuthorizer_2_Kv7On2/store/appc" --authenticate_http_readonly="true"
--authenticate_http_readwrite="true" --authenticatee="crammd5" --authentication_backoff_factor="1secs"
--authorizer="local" --cgroups_cpu_enable_pids_and_tids_count="false" --cgroups_enable_cfs="false"
--cgroups_hierarchy="/sys/fs/cgroup" --cgroups_limit_swap="false" --cgroups_root="mesos" --container_disk_watch_interval="15secs"
--containerizers="mesos" --credential="/tmp/Endpoint_SlaveEndpointTest_NoAuthorizer_2_Kv7On2/credential"
--default_role="*" --disk_watch_interval="1mins" --docker="docker" --docker_kill_orphans="true"
--docker_registry="https://registry-1.docker.io" --docker_remove_delay="6hrs" --docker_socket="/var/run/docker.sock"
--docker_stop_timeout="0ns" --docker_store_dir="/tmp/Endpoint_SlaveEndpointTest_NoAuthorizer_2_Kv7On2/store/docker"
--docker_volume_checkpoint_dir="/var/run/mesos/isolators/docker/volume" --enforce_container_disk_quota="false"
--executor_registration_timeout="1mins" --executor_reregistration_timeout="2secs" --executor_shutdown_grace_period="5secs"
--fetcher_cache_dir="/tmp/Endpoint_SlaveEndpointTest_NoAuthorizer_2_Kv7On2/fetch" --fetcher_cache_size="2GB"
--frameworks_home="" --gc_delay="1weeks" --gc_disk_headroom="0.1" --hadoop_home="" --help="false"
--hostname_lookup="true" --http_command_executor="false" --http_credentials="/tmp/Endpoint_SlaveEndpointTest_NoAuthorizer_2_Kv7On2/http_credentials"
--http_heartbeat_interval="30secs" --initialize_driver_logging="true" --isolation="posix/cpu,posix/mem"
--launcher="posix" --launcher_dir="/mesos/mesos-1.4.0/_build/src" --logbufsecs="0" --logging_level="INFO"
--max_completed_executors_per_framework="150" --oversubscribed_resources_interval="15secs"
--perf_duration="10secs" --perf_interval="1mins" --port="5051" --qos_correction_interval_min="0ns"
--quiet="false" --recover="reconnect" --recovery_timeout="15mins" --registration_backoff_factor="10ms"
--resources="cpus:2;gpus:0;mem:1024;disk:1024;ports:[31000-32000]" --revocable_cpu_low_priority="true"
--runtime_dir="/tmp/Endpoint_SlaveEndpointTest_NoAuthorizer_2_Kv7On2" --sandbox_directory="/mnt/mesos/sandbox"
--strict="true" --switch_user="true" --systemd_enable_support="true" --systemd_runtime_directory="/run/systemd/system"
--version="false" --work_dir="/tmp/Endpoint_SlaveEndpointTest_NoAuthorizer_2_QY6hWN"
I0726 09:31:46.341658  5041 credentials.hpp:86] Loading credential for authentication from
'/tmp/Endpoint_SlaveEndpointTest_NoAuthorizer_2_Kv7On2/credential'
I0726 09:31:46.341958  5041 slave.cpp:283] Agent using credential for: test-principal
I0726 09:31:46.341984  5041 credentials.hpp:37] Loading credentials for authentication from
'/tmp/Endpoint_SlaveEndpointTest_NoAuthorizer_2_Kv7On2/http_credentials'
I0726 09:31:46.342375  5041 http.cpp:993] Creating default 'basic' HTTP authenticator for
realm 'mesos-agent-readonly'
I0726 09:31:46.342630  5041 http.cpp:993] Creating default 'basic' HTTP authenticator for
realm 'mesos-agent-readwrite'
I0726 09:31:46.344823  5041 slave.cpp:565] Agent resources: [{"name":"cpus","scalar":{"value":2.0},"type":"SCALAR"},{"name":"mem","scalar":{"value":1024.0},"type":"SCALAR"},{"name":"disk","scalar":{"value":1024.0},"type":"SCALAR"},{"name":"ports","ranges":{"range":[{"begin":31000,"end":32000}]},"type":"RANGES"}]
I0726 09:31:46.345250  5041 slave.cpp:573] Agent attributes: [  ]
I0726 09:31:46.345269  5041 slave.cpp:582] Agent hostname: b90d4cd34a70
I0726 09:31:46.345548  5038 status_update_manager.cpp:177] Pausing sending status updates
I0726 09:31:46.347365  5035 state.cpp:64] Recovering state from '/tmp/Endpoint_SlaveEndpointTest_NoAuthorizer_2_QY6hWN/meta'
I0726 09:31:46.347945  5038 status_update_manager.cpp:203] Recovering status update manager
I0726 09:31:46.348320  5036 containerizer.cpp:582] Recovering containerizer
I0726 09:31:46.350538  5038 provisioner.cpp:416] Provisioner recovery complete
I0726 09:31:46.351152  5040 slave.cpp:6207] Finished recovery
I0726 09:31:46.352098  5040 slave.cpp:6389] Querying resource estimator for oversubscribable
resources
I0726 09:31:46.352886  5038 slave.cpp:6403] Received oversubscribable resources {} from the
resource estimator
I0726 09:31:46.357342  5038 process.cpp:3837] Handling HTTP event for process 'slave(802)'
with path: '/slave(802)/containers'
I0726 09:31:46.359309  5036 http.cpp:1133] HTTP GET for /slave(802)/containers from 172.17.0.2:59220
I0726 09:31:46.359442  5036 http.cpp:957] Authorizing principal 'test-principal' to GET the
'/containers' endpoint
I0726 09:31:46.365362  5016 slave.cpp:843] Agent terminating
[       OK ] Endpoint/SlaveEndpointTest.NoAuthorizer/2 (47 ms)
[----------] 9 tests from Endpoint/SlaveEndpointTest (452 ms total)

[----------] Global test environment tear-down
[==========] 1639 tests from 179 test cases ran. (723608 ms total)
[  PASSED  ] 1635 tests.
[  FAILED  ] 4 tests, listed below:
[  FAILED  ] DefaultExecutorCheckTest.CommandCheckDeliveredAndReconciled
[  FAILED  ] DefaultExecutorCheckTest.CommandCheckStatusChange
[  FAILED  ] DefaultExecutorCheckTest.CommandCheckSeesParentsEnv
[  FAILED  ] DefaultExecutorCheckTest.CommandCheckSharesWorkDirWithTask

 4 FAILED TESTS
  YOU HAVE 20 DISABLED TESTS

I0726 09:31:46.509097  5043 process.cpp:1006] Failed to accept socket: future discarded
make[4]: *** [check-local] Error 1
make[4]: Leaving directory `/mesos/mesos-1.4.0/_build/src'
make[3]: *** [check-am] Error 2
make[3]: Leaving directory `/mesos/mesos-1.4.0/_build/src'
make[2]: *** [check] Error 2
make[2]: Leaving directory `/mesos/mesos-1.4.0/_build/src'
make[1]: *** [check-recursive] Error 1
make[1]: Leaving directory `/mesos/mesos-1.4.0/_build'
make: *** [distcheck] Error 1
+ docker rmi mesos-1501055680-10638
Untagged: mesos-1501055680-10638:latest
Deleted: sha256:110f02a12fc47cc0afc474c32367eb8b8d6f8480d4517efd59e6369ba87dff36
Deleted: sha256:9442f5a1f9a99cda6a04b3fa745a4bdb3c4dfbb6530760dfdb06455aa8d68a19
Deleted: sha256:83fe72352d16373eece1490280653aa92b7eb4dcddb4116684031ba1094cc7c5
Deleted: sha256:b290d7b4a393194f0bf2fdf0ac1b69854767a717429de1d522f96fc72d2106b4
Deleted: sha256:32e7584b348a3b7b4ad62a9ac0398b1977f8e090e4c5c6c1902eb80a4d8bf8fb
Deleted: sha256:c6093c81a2880afa712bf9133c7e6b6a40e9b80ab2da4f2d4af1bf18fc89bf1a
Deleted: sha256:6cb6c8745ad47cff94b8401fc32ddf9cc335d73376f9033baed40431c93fb7e4
Deleted: sha256:2d4137a1eaabc86153a23a2c0abafe0b478cd88dc7e3131743c9523533a566ff
Deleted: sha256:93ddec44125f397e91fde017e91c2afa8b0225d7b4043855e3e00561831ce330
Deleted: sha256:c0f2b3709e228e114334f6ac896e277d45a0238865553dc8bbd920577b1c0c0d
Deleted: sha256:2ef31e88fccc1e3abea622241183fa52f153782a28bdd9528745148ea68c4731
Deleted: sha256:d13818c92c5738e233b60dbc4977e140fbfadb36ed0c469e02b8c20c58e19646
Deleted: sha256:997350784f7f59a4209970496a40931a768015b7b1750f49224b236ded5c254c
Deleted: sha256:1e2317b891360e7f6a2d61a0535dc653804dc667080d4610ec3c5a1b54c4c181
Deleted: sha256:f41e4e14c3bf5543b71e480ffd5b1f60ae524fbd0a602bba49391d90110f69a4
Deleted: sha256:1591b001ffbf7c768e9cd327096a4999359a90710095813fd0d724206ab9590f
Deleted: sha256:788edf10af1f26d5d504e12415f07b07c36f9424feb76a61490a480d34a0bbca
Deleted: sha256:a46daf198a5b146744aa35abeac7871f70abf510a7aee1077410bff38d1dd22b
Deleted: sha256:a87f8530d4547cdc802d7e2a756da5bb1a2bfc86c81352a4a58088be163e4e36
Deleted: sha256:30e66845dbd569abed738270e1f89851b985dee96eaa598c88b96d641d834c22
Deleted: sha256:0cf059efa2773ab02ef6f61f91ac4bf627493f02069498626e04ad66199ec22c
Deleted: sha256:7f3b80ae92e6c93c37ecb1c9c1b279b9cf04bd3b461d3ffa9d91d6e92d0af039
Deleted: sha256:707a0f4156efdb1b2e347986546d6e1409cd99535ae0acf5830e7dde793f4fc4
Deleted: sha256:5e39d8f7dda900f9edc37278b999ecfea42b9f69bcf21965ba20ae4468f99cdd
Build step 'Execute shell' marked build as failure

Mime
View raw message