mesos-builds mailing list archives

Site index · List index
Message view « Date » · « Thread »
Top « Date » · « Thread »
From Apache Jenkins Server <jenk...@builds.apache.org>
Subject Build failed in Jenkins: Mesos-Buildbot » autotools,gcc,--verbose,GLOG_v=1 MESOS_VERBOSE=1,centos:7,(ubuntu)&&(!ubuntu-us1)&&(!ubuntu-eu2) #3983
Date Sat, 29 Jul 2017 08:01:58 GMT
See <https://builds.apache.org/job/Mesos-Buildbot/BUILDTOOL=autotools,COMPILER=gcc,CONFIGURATION=--verbose,ENVIRONMENT=GLOG_v=1%20MESOS_VERBOSE=1,OS=centos%3A7,label_exp=(ubuntu)&&(!ubuntu-us1)&&(!ubuntu-eu2)/3983/display/redirect?page=changes>

Changes:

[songzihao1990] Added MESOS-7830 to 1.2.2 CHANGELOG.

[songzihao1990] Added MESOS-7830 to 1.1.3 CHANGELOG.

[songzihao1990] Added MESOS-7252 to 1.2.2 CHANGELOG.

[songzihao1990] Added MESOS-5187 to 1.2.2 CHANGELOG.

[songzihao1990] Added MESOS-5187 to 1.1.3 CHANGELOG.

------------------------------------------
[...truncated 30.32 MB...]
I0729 08:01:48.524775  6409 provisioner.cpp:255] Using default backend 'copy'
I0729 08:01:48.529126  6449 slave.cpp:250] Mesos agent started on (792)@172.17.0.7:41091
I0729 08:01:48.529161  6449 slave.cpp:251] Flags at startup: --acls="" --appc_simple_discovery_uri_prefix="http://"
--appc_store_dir="/tmp/Endpoint_SlaveEndpointTest_AuthorizedRequest_2_gKA75Y/store/appc" --authenticate_http_readonly="true"
--authenticate_http_readwrite="true" --authenticatee="crammd5" --authentication_backoff_factor="1secs"
--authorizer="local" --cgroups_cpu_enable_pids_and_tids_count="false" --cgroups_enable_cfs="false"
--cgroups_hierarchy="/sys/fs/cgroup" --cgroups_limit_swap="false" --cgroups_root="mesos" --container_disk_watch_interval="15secs"
--containerizers="mesos" --credential="/tmp/Endpoint_SlaveEndpointTest_AuthorizedRequest_2_gKA75Y/credential"
--default_role="*" --disk_watch_interval="1mins" --docker="docker" --docker_kill_orphans="true"
--docker_registry="https://registry-1.docker.io" --docker_remove_delay="6hrs" --docker_socket="/var/run/docker.sock"
--docker_stop_timeout="0ns" --docker_store_dir="/tmp/Endpoint_SlaveEndpointTest_AuthorizedRequest_2_gKA75Y/store/docker"
--docker_volume_checkpoint_dir="/var/run/mesos/isolators/docker/volume" --enforce_container_disk_quota="false"
--executor_registration_timeout="1mins" --executor_reregistration_timeout="2secs" --executor_shutdown_grace_period="5secs"
--fetcher_cache_dir="/tmp/Endpoint_SlaveEndpointTest_AuthorizedRequest_2_gKA75Y/fetch" --fetcher_cache_size="2GB"
--frameworks_home="" --gc_delay="1weeks" --gc_disk_headroom="0.1" --hadoop_home="" --help="false"
--hostname_lookup="true" --http_command_executor="false" --http_credentials="/tmp/Endpoint_SlaveEndpointTest_AuthorizedRequest_2_gKA75Y/http_credentials"
--http_heartbeat_interval="30secs" --initialize_driver_logging="true" --isolation="posix/cpu,posix/mem"
--launcher="posix" --launcher_dir="/mesos/mesos-1.4.0/_build/src" --logbufsecs="0" --logging_level="INFO"
--max_completed_executors_per_framework="150" --oversubscribed_resources_interval="15secs"
--perf_duration="10secs" --perf_interval="1mins" --port="5051" --qos_correction_interval_min="0ns"
--quiet="false" --recover="reconnect" --recovery_timeout="15mins" --registration_backoff_factor="10ms"
--resources="cpus:2;gpus:0;mem:1024;disk:1024;ports:[31000-32000]" --revocable_cpu_low_priority="true"
--runtime_dir="/tmp/Endpoint_SlaveEndpointTest_AuthorizedRequest_2_gKA75Y" --sandbox_directory="/mnt/mesos/sandbox"
--strict="true" --switch_user="true" --systemd_enable_support="true" --systemd_runtime_directory="/run/systemd/system"
--version="false" --work_dir="/tmp/Endpoint_SlaveEndpointTest_AuthorizedRequest_2_EQ1zms"
I0729 08:01:48.529642  6449 credentials.hpp:86] Loading credential for authentication from
'/tmp/Endpoint_SlaveEndpointTest_AuthorizedRequest_2_gKA75Y/credential'
I0729 08:01:48.529857  6449 slave.cpp:283] Agent using credential for: test-principal
I0729 08:01:48.529881  6449 credentials.hpp:37] Loading credentials for authentication from
'/tmp/Endpoint_SlaveEndpointTest_AuthorizedRequest_2_gKA75Y/http_credentials'
I0729 08:01:48.530138  6449 http.cpp:993] Creating default 'basic' HTTP authenticator for
realm 'mesos-agent-readonly'
I0729 08:01:48.530352  6449 http.cpp:993] Creating default 'basic' HTTP authenticator for
realm 'mesos-agent-readwrite'
I0729 08:01:48.531780  6449 slave.cpp:565] Agent resources: [{"name":"cpus","scalar":{"value":2.0},"type":"SCALAR"},{"name":"mem","scalar":{"value":1024.0},"type":"SCALAR"},{"name":"disk","scalar":{"value":1024.0},"type":"SCALAR"},{"name":"ports","ranges":{"range":[{"begin":31000,"end":32000}]},"type":"RANGES"}]
I0729 08:01:48.532063  6449 slave.cpp:573] Agent attributes: [  ]
I0729 08:01:48.532088  6449 slave.cpp:582] Agent hostname: 8a64e3cd0806
I0729 08:01:48.532238  6437 status_update_manager.cpp:177] Pausing sending status updates
I0729 08:01:48.533795  6440 state.cpp:64] Recovering state from '/tmp/Endpoint_SlaveEndpointTest_AuthorizedRequest_2_EQ1zms/meta'
I0729 08:01:48.534198  6436 status_update_manager.cpp:203] Recovering status update manager
I0729 08:01:48.534415  6429 containerizer.cpp:582] Recovering containerizer
I0729 08:01:48.535830  6446 provisioner.cpp:416] Provisioner recovery complete
I0729 08:01:48.536209  6428 slave.cpp:6207] Finished recovery
I0729 08:01:48.536769  6428 slave.cpp:6389] Querying resource estimator for oversubscribable
resources
I0729 08:01:48.537045  6432 slave.cpp:6403] Received oversubscribable resources {} from the
resource estimator
I0729 08:01:48.540304  6438 process.cpp:3836] Handling HTTP event for process 'slave(792)'
with path: '/slave(792)/containers'
I0729 08:01:48.541780  6441 http.cpp:1133] HTTP GET for /slave(792)/containers from 172.17.0.7:35064
I0729 08:01:48.541913  6441 http.cpp:957] Authorizing principal 'test-principal' to GET the
'/containers' endpoint
I0729 08:01:48.545769  6438 slave.cpp:843] Agent terminating
[       OK ] Endpoint/SlaveEndpointTest.AuthorizedRequest/2 (33 ms)
[ RUN      ] Endpoint/SlaveEndpointTest.UnauthorizedRequest/0
I0729 08:01:48.556408  6409 containerizer.cpp:230] Using isolation: posix/cpu,posix/mem,filesystem/posix,network/cni,environment_secret
W0729 08:01:48.556944  6409 backend.cpp:76] Failed to create 'aufs' backend: AufsBackend requires
root privileges
W0729 08:01:48.557067  6409 backend.cpp:76] Failed to create 'bind' backend: BindBackend requires
root privileges
I0729 08:01:48.557107  6409 provisioner.cpp:255] Using default backend 'copy'
I0729 08:01:48.560067  6449 slave.cpp:250] Mesos agent started on (793)@172.17.0.7:41091
I0729 08:01:48.560098  6449 slave.cpp:251] Flags at startup: --acls="" --appc_simple_discovery_uri_prefix="http://"
--appc_store_dir="/tmp/Endpoint_SlaveEndpointTest_UnauthorizedRequest_0_cen3i6/store/appc"
--authenticate_http_readonly="true" --authenticate_http_readwrite="true" --authenticatee="crammd5"
--authentication_backoff_factor="1secs" --authorizer="local" --cgroups_cpu_enable_pids_and_tids_count="false"
--cgroups_enable_cfs="false" --cgroups_hierarchy="/sys/fs/cgroup" --cgroups_limit_swap="false"
--cgroups_root="mesos" --container_disk_watch_interval="15secs" --containerizers="mesos" --credential="/tmp/Endpoint_SlaveEndpointTest_UnauthorizedRequest_0_cen3i6/credential"
--default_role="*" --disk_watch_interval="1mins" --docker="docker" --docker_kill_orphans="true"
--docker_registry="https://registry-1.docker.io" --docker_remove_delay="6hrs" --docker_socket="/var/run/docker.sock"
--docker_stop_timeout="0ns" --docker_store_dir="/tmp/Endpoint_SlaveEndpointTest_UnauthorizedRequest_0_cen3i6/store/docker"
--docker_volume_checkpoint_dir="/var/run/mesos/isolators/docker/volume" --enforce_container_disk_quota="false"
--executor_registration_timeout="1mins" --executor_reregistration_timeout="2secs" --executor_shutdown_grace_period="5secs"
--fetcher_cache_dir="/tmp/Endpoint_SlaveEndpointTest_UnauthorizedRequest_0_cen3i6/fetch" --fetcher_cache_size="2GB"
--frameworks_home="" --gc_delay="1weeks" --gc_disk_headroom="0.1" --hadoop_home="" --help="false"
--hostname_lookup="true" --http_command_executor="false" --http_credentials="/tmp/Endpoint_SlaveEndpointTest_UnauthorizedRequest_0_cen3i6/http_credentials"
--http_heartbeat_interval="30secs" --initialize_driver_logging="true" --isolation="posix/cpu,posix/mem"
--launcher="posix" --launcher_dir="/mesos/mesos-1.4.0/_build/src" --logbufsecs="0" --logging_level="INFO"
--max_completed_executors_per_framework="150" --oversubscribed_resources_interval="15secs"
--perf_duration="10secs" --perf_interval="1mins" --port="5051" --qos_correction_interval_min="0ns"
--quiet="false" --recover="reconnect" --recovery_timeout="15mins" --registration_backoff_factor="10ms"
--resources="cpus:2;gpus:0;mem:1024;disk:1024;ports:[31000-32000]" --revocable_cpu_low_priority="true"
--runtime_dir="/tmp/Endpoint_SlaveEndpointTest_UnauthorizedRequest_0_cen3i6" --sandbox_directory="/mnt/mesos/sandbox"
--strict="true" --switch_user="true" --systemd_enable_support="true" --systemd_runtime_directory="/run/systemd/system"
--version="false" --work_dir="/tmp/Endpoint_SlaveEndpointTest_UnauthorizedRequest_0_NR2Auz"
I0729 08:01:48.560557  6449 credentials.hpp:86] Loading credential for authentication from
'/tmp/Endpoint_SlaveEndpointTest_UnauthorizedRequest_0_cen3i6/credential'
I0729 08:01:48.560760  6449 slave.cpp:283] Agent using credential for: test-principal
I0729 08:01:48.560783  6449 credentials.hpp:37] Loading credentials for authentication from
'/tmp/Endpoint_SlaveEndpointTest_UnauthorizedRequest_0_cen3i6/http_credentials'
I0729 08:01:48.561028  6449 http.cpp:993] Creating default 'basic' HTTP authenticator for
realm 'mesos-agent-readonly'
I0729 08:01:48.561187  6449 http.cpp:993] Creating default 'basic' HTTP authenticator for
realm 'mesos-agent-readwrite'
I0729 08:01:48.562551  6449 slave.cpp:565] Agent resources: [{"name":"cpus","scalar":{"value":2.0},"type":"SCALAR"},{"name":"mem","scalar":{"value":1024.0},"type":"SCALAR"},{"name":"disk","scalar":{"value":1024.0},"type":"SCALAR"},{"name":"ports","ranges":{"range":[{"begin":31000,"end":32000}]},"type":"RANGES"}]
I0729 08:01:48.562799  6449 slave.cpp:573] Agent attributes: [  ]
I0729 08:01:48.562815  6449 slave.cpp:582] Agent hostname: 8a64e3cd0806
I0729 08:01:48.562958  6428 status_update_manager.cpp:177] Pausing sending status updates
I0729 08:01:48.564481  6440 state.cpp:64] Recovering state from '/tmp/Endpoint_SlaveEndpointTest_UnauthorizedRequest_0_NR2Auz/meta'
I0729 08:01:48.564869  6430 status_update_manager.cpp:203] Recovering status update manager
I0729 08:01:48.565057  6439 containerizer.cpp:582] Recovering containerizer
I0729 08:01:48.566520  6429 provisioner.cpp:416] Provisioner recovery complete
I0729 08:01:48.566895  6437 slave.cpp:6207] Finished recovery
I0729 08:01:48.567512  6437 slave.cpp:6389] Querying resource estimator for oversubscribable
resources
I0729 08:01:48.567786  6431 slave.cpp:6403] Received oversubscribable resources {} from the
resource estimator
I0729 08:01:48.570848  6450 process.cpp:3836] Handling HTTP event for process 'slave(793)'
with path: '/slave(793)/monitor/statistics'
I0729 08:01:48.572248  6436 http.cpp:1133] HTTP GET for /slave(793)/monitor/statistics from
172.17.0.7:35066
I0729 08:01:48.572329  6436 http.cpp:957] Authorizing principal 'test-principal' to GET the
'/monitor/statistics' endpoint
I0729 08:01:48.574640  6409 slave.cpp:843] Agent terminating
[       OK ] Endpoint/SlaveEndpointTest.UnauthorizedRequest/0 (29 ms)
[ RUN      ] Endpoint/SlaveEndpointTest.UnauthorizedRequest/1
I0729 08:01:48.586293  6409 containerizer.cpp:230] Using isolation: posix/cpu,posix/mem,filesystem/posix,network/cni,environment_secret
W0729 08:01:48.586848  6409 backend.cpp:76] Failed to create 'aufs' backend: AufsBackend requires
root privileges
W0729 08:01:48.586984  6409 backend.cpp:76] Failed to create 'bind' backend: BindBackend requires
root privileges
I0729 08:01:48.587023  6409 provisioner.cpp:255] Using default backend 'copy'
I0729 08:01:48.590530  6432 slave.cpp:250] Mesos agent started on (794)@172.17.0.7:41091
I0729 08:01:48.590556  6432 slave.cpp:251] Flags at startup: --acls="" --appc_simple_discovery_uri_prefix="http://"
--appc_store_dir="/tmp/Endpoint_SlaveEndpointTest_UnauthorizedRequest_1_7b1BNd/store/appc"
--authenticate_http_readonly="true" --authenticate_http_readwrite="true" --authenticatee="crammd5"
--authentication_backoff_factor="1secs" --authorizer="local" --cgroups_cpu_enable_pids_and_tids_count="false"
--cgroups_enable_cfs="false" --cgroups_hierarchy="/sys/fs/cgroup" --cgroups_limit_swap="false"
--cgroups_root="mesos" --container_disk_watch_interval="15secs" --containerizers="mesos" --credential="/tmp/Endpoint_SlaveEndpointTest_UnauthorizedRequest_1_7b1BNd/credential"
--default_role="*" --disk_watch_interval="1mins" --docker="docker" --docker_kill_orphans="true"
--docker_registry="https://registry-1.docker.io" --docker_remove_delay="6hrs" --docker_socket="/var/run/docker.sock"
--docker_stop_timeout="0ns" --docker_store_dir="/tmp/Endpoint_SlaveEndpointTest_UnauthorizedRequest_1_7b1BNd/store/docker"
--docker_volume_checkpoint_dir="/var/run/mesos/isolators/docker/volume" --enforce_container_disk_quota="false"
--executor_registration_timeout="1mins" --executor_reregistration_timeout="2secs" --executor_shutdown_grace_period="5secs"
--fetcher_cache_dir="/tmp/Endpoint_SlaveEndpointTest_UnauthorizedRequest_1_7b1BNd/fetch" --fetcher_cache_size="2GB"
--frameworks_home="" --gc_delay="1weeks" --gc_disk_headroom="0.1" --hadoop_home="" --help="false"
--hostname_lookup="true" --http_command_executor="false" --http_credentials="/tmp/Endpoint_SlaveEndpointTest_UnauthorizedRequest_1_7b1BNd/http_credentials"
--http_heartbeat_interval="30secs" --initialize_driver_logging="true" --isolation="posix/cpu,posix/mem"
--launcher="posix" --launcher_dir="/mesos/mesos-1.4.0/_build/src" --logbufsecs="0" --logging_level="INFO"
--max_completed_executors_per_framework="150" --oversubscribed_resources_interval="15secs"
--perf_duration="10secs" --perf_interval="1mins" --port="5051" --qos_correction_interval_min="0ns"
--quiet="false" --recover="reconnect" --recovery_timeout="15mins" --registration_backoff_factor="10ms"
--resources="cpus:2;gpus:0;mem:1024;disk:1024;ports:[31000-32000]" --revocable_cpu_low_priority="true"
--runtime_dir="/tmp/Endpoint_SlaveEndpointTest_UnauthorizedRequest_1_7b1BNd" --sandbox_directory="/mnt/mesos/sandbox"
--strict="true" --switch_user="true" --systemd_enable_support="true" --systemd_runtime_directory="/run/systemd/system"
--version="false" --work_dir="/tmp/Endpoint_SlaveEndpointTest_UnauthorizedRequest_1_oP0MUG"
I0729 08:01:48.590996  6432 credentials.hpp:86] Loading credential for authentication from
'/tmp/Endpoint_SlaveEndpointTest_UnauthorizedRequest_1_7b1BNd/credential'
I0729 08:01:48.591176  6432 slave.cpp:283] Agent using credential for: test-principal
I0729 08:01:48.591197  6432 credentials.hpp:37] Loading credentials for authentication from
'/tmp/Endpoint_SlaveEndpointTest_UnauthorizedRequest_1_7b1BNd/http_credentials'
I0729 08:01:48.591419  6432 http.cpp:993] Creating default 'basic' HTTP authenticator for
realm 'mesos-agent-readonly'
I0729 08:01:48.591558  6432 http.cpp:993] Creating default 'basic' HTTP authenticator for
realm 'mesos-agent-readwrite'
I0729 08:01:48.592754  6432 slave.cpp:565] Agent resources: [{"name":"cpus","scalar":{"value":2.0},"type":"SCALAR"},{"name":"mem","scalar":{"value":1024.0},"type":"SCALAR"},{"name":"disk","scalar":{"value":1024.0},"type":"SCALAR"},{"name":"ports","ranges":{"range":[{"begin":31000,"end":32000}]},"type":"RANGES"}]
I0729 08:01:48.592979  6432 slave.cpp:573] Agent attributes: [  ]
I0729 08:01:48.592994  6432 slave.cpp:582] Agent hostname: 8a64e3cd0806
I0729 08:01:48.593122  6434 status_update_manager.cpp:177] Pausing sending status updates
I0729 08:01:48.594578  6430 state.cpp:64] Recovering state from '/tmp/Endpoint_SlaveEndpointTest_UnauthorizedRequest_1_oP0MUG/meta'
I0729 08:01:48.594905  6442 status_update_manager.cpp:203] Recovering status update manager
I0729 08:01:48.595084  6439 containerizer.cpp:582] Recovering containerizer
I0729 08:01:48.596555  6437 provisioner.cpp:416] Provisioner recovery complete
I0729 08:01:48.596920  6432 slave.cpp:6207] Finished recovery
I0729 08:01:48.597417  6432 slave.cpp:6389] Querying resource estimator for oversubscribable
resources
I0729 08:01:48.597673  6448 slave.cpp:6403] Received oversubscribable resources {} from the
resource estimator
I0729 08:01:48.600564  6438 process.cpp:3836] Handling HTTP event for process 'slave(794)'
with path: '/slave(794)/monitor/statistics.json'
I0729 08:01:48.601932  6435 http.cpp:1133] HTTP GET for /slave(794)/monitor/statistics.json
from 172.17.0.7:35068
I0729 08:01:48.602013  6435 http.cpp:957] Authorizing principal 'test-principal' to GET the
'/monitor/statistics.json' endpoint
I0729 08:01:48.604182  6442 slave.cpp:843] Agent terminating
[       OK ] Endpoint/SlaveEndpointTest.UnauthorizedRequest/1 (30 ms)
[ RUN      ] Endpoint/SlaveEndpointTest.UnauthorizedRequest/2
I0729 08:01:48.615595  6409 containerizer.cpp:230] Using isolation: posix/cpu,posix/mem,filesystem/posix,network/cni,environment_secret
W0729 08:01:48.616154  6409 backend.cpp:76] Failed to create 'aufs' backend: AufsBackend requires
root privileges
W0729 08:01:48.616266  6409 backend.cpp:76] Failed to create 'bind' backend: BindBackend requires
root privileges
I0729 08:01:48.616312  6409 provisioner.cpp:255] Using default backend 'copy'
I0729 08:01:48.619683  6440 slave.cpp:250] Mesos agent started on (795)@172.17.0.7:41091
I0729 08:01:48.619709  6440 slave.cpp:251] Flags at startup: --acls="" --appc_simple_discovery_uri_prefix="http://"
--appc_store_dir="/tmp/Endpoint_SlaveEndpointTest_UnauthorizedRequest_2_wOYVzl/store/appc"
--authenticate_http_readonly="true" --authenticate_http_readwrite="true" --authenticatee="crammd5"
--authentication_backoff_factor="1secs" --authorizer="local" --cgroups_cpu_enable_pids_and_tids_count="false"
--cgroups_enable_cfs="false" --cgroups_hierarchy="/sys/fs/cgroup" --cgroups_limit_swap="false"
--cgroups_root="mesos" --container_disk_watch_interval="15secs" --containerizers="mesos" --credential="/tmp/Endpoint_SlaveEndpointTest_UnauthorizedRequest_2_wOYVzl/credential"
--default_role="*" --disk_watch_interval="1mins" --docker="docker" --docker_kill_orphans="true"
--docker_registry="https://registry-1.docker.io" --docker_remove_delay="6hrs" --docker_socket="/var/run/docker.sock"
--docker_stop_timeout="0ns" --docker_store_dir="/tmp/Endpoint_SlaveEndpointTest_UnauthorizedRequest_2_wOYVzl/store/docker"
--docker_volume_checkpoint_dir="/var/run/mesos/isolators/docker/volume" --enforce_container_disk_quota="false"
--executor_registration_timeout="1mins" --executor_reregistration_timeout="2secs" --executor_shutdown_grace_period="5secs"
--fetcher_cache_dir="/tmp/Endpoint_SlaveEndpointTest_UnauthorizedRequest_2_wOYVzl/fetch" --fetcher_cache_size="2GB"
--frameworks_home="" --gc_delay="1weeks" --gc_disk_headroom="0.1" --hadoop_home="" --help="false"
--hostname_lookup="true" --http_command_executor="false" --http_credentials="/tmp/Endpoint_SlaveEndpointTest_UnauthorizedRequest_2_wOYVzl/http_credentials"
--http_heartbeat_interval="30secs" --initialize_driver_logging="true" --isolation="posix/cpu,posix/mem"
--launcher="posix" --launcher_dir="/mesos/mesos-1.4.0/_build/src" --logbufsecs="0" --logging_level="INFO"
--max_completed_executors_per_framework="150" --oversubscribed_resources_interval="15secs"
--perf_duration="10secs" --perf_interval="1mins" --port="5051" --qos_correction_interval_min="0ns"
--quiet="false" --recover="reconnect" --recovery_timeout="15mins" --registration_backoff_factor="10ms"
--resources="cpus:2;gpus:0;mem:1024;disk:1024;ports:[31000-32000]" --revocable_cpu_low_priority="true"
--runtime_dir="/tmp/Endpoint_SlaveEndpointTest_UnauthorizedRequest_2_wOYVzl" --sandbox_directory="/mnt/mesos/sandbox"
--strict="true" --switch_user="true" --systemd_enable_support="true" --systemd_runtime_directory="/run/systemd/system"
--version="false" --work_dir="/tmp/Endpoint_SlaveEndpointTest_UnauthorizedRequest_2_OSXGCO"
I0729 08:01:48.620182  6440 credentials.hpp:86] Loading credential for authentication from
'/tmp/Endpoint_SlaveEndpointTest_UnauthorizedRequest_2_wOYVzl/credential'
I0729 08:01:48.620379  6440 slave.cpp:283] Agent using credential for: test-principal
I0729 08:01:48.620409  6440 credentials.hpp:37] Loading credentials for authentication from
'/tmp/Endpoint_SlaveEndpointTest_UnauthorizedRequest_2_wOYVzl/http_credentials'
I0729 08:01:48.620678  6440 http.cpp:993] Creating default 'basic' HTTP authenticator for
realm 'mesos-agent-readonly'
I0729 08:01:48.620832  6440 http.cpp:993] Creating default 'basic' HTTP authenticator for
realm 'mesos-agent-readwrite'
I0729 08:01:48.622234  6440 slave.cpp:565] Agent resources: [{"name":"cpus","scalar":{"value":2.0},"type":"SCALAR"},{"name":"mem","scalar":{"value":1024.0},"type":"SCALAR"},{"name":"disk","scalar":{"value":1024.0},"type":"SCALAR"},{"name":"ports","ranges":{"range":[{"begin":31000,"end":32000}]},"type":"RANGES"}]
I0729 08:01:48.622483  6440 slave.cpp:573] Agent attributes: [  ]
I0729 08:01:48.622499  6440 slave.cpp:582] Agent hostname: 8a64e3cd0806
I0729 08:01:48.622640  6430 status_update_manager.cpp:177] Pausing sending status updates
I0729 08:01:48.624140  6445 state.cpp:64] Recovering state from '/tmp/Endpoint_SlaveEndpointTest_UnauthorizedRequest_2_OSXGCO/meta'
I0729 08:01:48.624472  6432 status_update_manager.cpp:203] Recovering status update manager
I0729 08:01:48.624691  6451 containerizer.cpp:582] Recovering containerizer
I0729 08:01:48.626083  6438 provisioner.cpp:416] Provisioner recovery complete
I0729 08:01:48.626435  6448 slave.cpp:6207] Finished recovery
I0729 08:01:48.626957  6448 slave.cpp:6389] Querying resource estimator for oversubscribable
resources
I0729 08:01:48.627249  6446 slave.cpp:6403] Received oversubscribable resources {} from the
resource estimator
I0729 08:01:48.629981  6447 process.cpp:3836] Handling HTTP event for process 'slave(795)'
with path: '/slave(795)/containers'
I0729 08:01:48.631258  6433 http.cpp:1133] HTTP GET for /slave(795)/containers from 172.17.0.7:35070
I0729 08:01:48.631343  6433 http.cpp:957] Authorizing principal 'test-principal' to GET the
'/containers' endpoint
I0729 08:01:48.633325  6445 slave.cpp:843] Agent terminating
[       OK ] Endpoint/SlaveEndpointTest.UnauthorizedRequest/2 (29 ms)
[ RUN      ] Endpoint/SlaveEndpointTest.NoAuthorizer/0
I0729 08:01:48.646474  6409 containerizer.cpp:230] Using isolation: posix/cpu,posix/mem,filesystem/posix,network/cni,environment_secret
W0729 08:01:48.647088  6409 backend.cpp:76] Failed to create 'aufs' backend: AufsBackend requires
root privileges
W0729 08:01:48.647219  6409 backend.cpp:76] Failed to create 'bind' backend: BindBackend requires
root privileges
I0729 08:01:48.647264  6409 provisioner.cpp:255] Using default backend 'copy'
I0729 08:01:48.649175  6409 cluster.cpp:448] Creating default 'local' authorizer
I0729 08:01:48.651021  6443 slave.cpp:250] Mesos agent started on (796)@172.17.0.7:41091
I0729 08:01:48.651062  6443 slave.cpp:251] Flags at startup: --acls="" --appc_simple_discovery_uri_prefix="http://"
--appc_store_dir="/tmp/Endpoint_SlaveEndpointTest_NoAuthorizer_0_SeNLDt/store/appc" --authenticate_http_readonly="true"
--authenticate_http_readwrite="true" --authenticatee="crammd5" --authentication_backoff_factor="1secs"
--authorizer="local" --cgroups_cpu_enable_pids_and_tids_count="false" --cgroups_enable_cfs="false"
--cgroups_hierarchy="/sys/fs/cgroup" --cgroups_limit_swap="false" --cgroups_root="mesos" --container_disk_watch_interval="15secs"
--containerizers="mesos" --credential="/tmp/Endpoint_SlaveEndpointTest_NoAuthorizer_0_SeNLDt/credential"
--default_role="*" --disk_watch_interval="1mins" --docker="docker" --docker_kill_orphans="true"
--docker_registry="https://registry-1.docker.io" --docker_remove_delay="6hrs" --docker_socket="/var/run/docker.sock"
--docker_stop_timeout="0ns" --docker_store_dir="/tmp/Endpoint_SlaveEndpointTest_NoAuthorizer_0_SeNLDt/store/docker"
--docker_volume_checkpoint_dir="/var/run/mesos/isolators/docker/volume" --enforce_container_disk_quota="false"
--executor_registration_timeout="1mins" --executor_reregistration_timeout="2secs" --executor_shutdown_grace_period="5secs"
--fetcher_cache_dir="/tmp/Endpoint_SlaveEndpointTest_NoAuthorizer_0_SeNLDt/fetch" --fetcher_cache_size="2GB"
--frameworks_home="" --gc_delay="1weeks" --gc_disk_headroom="0.1" --hadoop_home="" --help="false"
--hostname_lookup="true" --http_command_executor="false" --http_credentials="/tmp/Endpoint_SlaveEndpointTest_NoAuthorizer_0_SeNLDt/http_credentials"
--http_heartbeat_interval="30secs" --initialize_driver_logging="true" --isolation="posix/cpu,posix/mem"
--launcher="posix" --launcher_dir="/mesos/mesos-1.4.0/_build/src" --logbufsecs="0" --logging_level="INFO"
--max_completed_executors_per_framework="150" --oversubscribed_resources_interval="15secs"
--perf_duration="10secs" --perf_interval="1mins" --port="5051" --qos_correction_interval_min="0ns"
--quiet="false" --recover="reconnect" --recovery_timeout="15mins" --registration_backoff_factor="10ms"
--resources="cpus:2;gpus:0;mem:1024;disk:1024;ports:[31000-32000]" --revocable_cpu_low_priority="true"
--runtime_dir="/tmp/Endpoint_SlaveEndpointTest_NoAuthorizer_0_SeNLDt" --sandbox_directory="/mnt/mesos/sandbox"
--strict="true" --switch_user="true" --systemd_enable_support="true" --systemd_runtime_directory="/run/systemd/system"
--version="false" --work_dir="/tmp/Endpoint_SlaveEndpointTest_NoAuthorizer_0_d8l8BW"
I0729 08:01:48.651533  6443 credentials.hpp:86] Loading credential for authentication from
'/tmp/Endpoint_SlaveEndpointTest_NoAuthorizer_0_SeNLDt/credential'
I0729 08:01:48.651726  6443 slave.cpp:283] Agent using credential for: test-principal
I0729 08:01:48.651748  6443 credentials.hpp:37] Loading credentials for authentication from
'/tmp/Endpoint_SlaveEndpointTest_NoAuthorizer_0_SeNLDt/http_credentials'
I0729 08:01:48.651980  6443 http.cpp:993] Creating default 'basic' HTTP authenticator for
realm 'mesos-agent-readonly'
I0729 08:01:48.652150  6443 http.cpp:993] Creating default 'basic' HTTP authenticator for
realm 'mesos-agent-readwrite'
I0729 08:01:48.653558  6443 slave.cpp:565] Agent resources: [{"name":"cpus","scalar":{"value":2.0},"type":"SCALAR"},{"name":"mem","scalar":{"value":1024.0},"type":"SCALAR"},{"name":"disk","scalar":{"value":1024.0},"type":"SCALAR"},{"name":"ports","ranges":{"range":[{"begin":31000,"end":32000}]},"type":"RANGES"}]
I0729 08:01:48.653802  6443 slave.cpp:573] Agent attributes: [  ]
I0729 08:01:48.653818  6443 slave.cpp:582] Agent hostname: 8a64e3cd0806
I0729 08:01:48.653961  6434 status_update_manager.cpp:177] Pausing sending status updates
I0729 08:01:48.655609  6448 state.cpp:64] Recovering state from '/tmp/Endpoint_SlaveEndpointTest_NoAuthorizer_0_d8l8BW/meta'
I0729 08:01:48.655977  6436 status_update_manager.cpp:203] Recovering status update manager
I0729 08:01:48.656180  6447 containerizer.cpp:582] Recovering containerizer
I0729 08:01:48.657852  6435 provisioner.cpp:416] Provisioner recovery complete
I0729 08:01:48.658231  6443 slave.cpp:6207] Finished recovery
I0729 08:01:48.658783  6443 slave.cpp:6389] Querying resource estimator for oversubscribable
resources
I0729 08:01:48.659092  6431 slave.cpp:6403] Received oversubscribable resources {} from the
resource estimator
I0729 08:01:48.662160  6438 process.cpp:3836] Handling HTTP event for process 'slave(796)'
with path: '/slave(796)/monitor/statistics'
I0729 08:01:48.663533  6436 http.cpp:1133] HTTP GET for /slave(796)/monitor/statistics from
172.17.0.7:35072
I0729 08:01:48.663614  6436 http.cpp:957] Authorizing principal 'test-principal' to GET the
'/monitor/statistics' endpoint
I0729 08:01:48.666760  6409 slave.cpp:843] Agent terminating
[       OK ] Endpoint/SlaveEndpointTest.NoAuthorizer/0 (33 ms)
[ RUN      ] Endpoint/SlaveEndpointTest.NoAuthorizer/1
I0729 08:01:48.677937  6409 containerizer.cpp:230] Using isolation: posix/cpu,posix/mem,filesystem/posix,network/cni,environment_secret
W0729 08:01:48.678485  6409 backend.cpp:76] Failed to create 'aufs' backend: AufsBackend requires
root privileges
W0729 08:01:48.678594  6409 backend.cpp:76] Failed to create 'bind' backend: BindBackend requires
root privileges
I0729 08:01:48.678637  6409 provisioner.cpp:255] Using default backend 'copy'
I0729 08:01:48.680243  6409 cluster.cpp:448] Creating default 'local' authorizer
I0729 08:01:48.681979  6438 slave.cpp:250] Mesos agent started on (797)@172.17.0.7:41091
I0729 08:01:48.682000  6438 slave.cpp:251] Flags at startup: --acls="" --appc_simple_discovery_uri_prefix="http://"
--appc_store_dir="/tmp/Endpoint_SlaveEndpointTest_NoAuthorizer_1_N2fU0B/store/appc" --authenticate_http_readonly="true"
--authenticate_http_readwrite="true" --authenticatee="crammd5" --authentication_backoff_factor="1secs"
--authorizer="local" --cgroups_cpu_enable_pids_and_tids_count="false" --cgroups_enable_cfs="false"
--cgroups_hierarchy="/sys/fs/cgroup" --cgroups_limit_swap="false" --cgroups_root="mesos" --container_disk_watch_interval="15secs"
--containerizers="mesos" --credential="/tmp/Endpoint_SlaveEndpointTest_NoAuthorizer_1_N2fU0B/credential"
--default_role="*" --disk_watch_interval="1mins" --docker="docker" --docker_kill_orphans="true"
--docker_registry="https://registry-1.docker.io" --docker_remove_delay="6hrs" --docker_socket="/var/run/docker.sock"
--docker_stop_timeout="0ns" --docker_store_dir="/tmp/Endpoint_SlaveEndpointTest_NoAuthorizer_1_N2fU0B/store/docker"
--docker_volume_checkpoint_dir="/var/run/mesos/isolators/docker/volume" --enforce_container_disk_quota="false"
--executor_registration_timeout="1mins" --executor_reregistration_timeout="2secs" --executor_shutdown_grace_period="5secs"
--fetcher_cache_dir="/tmp/Endpoint_SlaveEndpointTest_NoAuthorizer_1_N2fU0B/fetch" --fetcher_cache_size="2GB"
--frameworks_home="" --gc_delay="1weeks" --gc_disk_headroom="0.1" --hadoop_home="" --help="false"
--hostname_lookup="true" --http_command_executor="false" --http_credentials="/tmp/Endpoint_SlaveEndpointTest_NoAuthorizer_1_N2fU0B/http_credentials"
--http_heartbeat_interval="30secs" --initialize_driver_logging="true" --isolation="posix/cpu,posix/mem"
--launcher="posix" --launcher_dir="/mesos/mesos-1.4.0/_build/src" --logbufsecs="0" --logging_level="INFO"
--max_completed_executors_per_framework="150" --oversubscribed_resources_interval="15secs"
--perf_duration="10secs" --perf_interval="1mins" --port="5051" --qos_correction_interval_min="0ns"
--quiet="false" --recover="reconnect" --recovery_timeout="15mins" --registration_backoff_factor="10ms"
--resources="cpus:2;gpus:0;mem:1024;disk:1024;ports:[31000-32000]" --revocable_cpu_low_priority="true"
--runtime_dir="/tmp/Endpoint_SlaveEndpointTest_NoAuthorizer_1_N2fU0B" --sandbox_directory="/mnt/mesos/sandbox"
--strict="true" --switch_user="true" --systemd_enable_support="true" --systemd_runtime_directory="/run/systemd/system"
--version="false" --work_dir="/tmp/Endpoint_SlaveEndpointTest_NoAuthorizer_1_CfFqU4"
I0729 08:01:48.682420  6438 credentials.hpp:86] Loading credential for authentication from
'/tmp/Endpoint_SlaveEndpointTest_NoAuthorizer_1_N2fU0B/credential'
I0729 08:01:48.682590  6438 slave.cpp:283] Agent using credential for: test-principal
I0729 08:01:48.682612  6438 credentials.hpp:37] Loading credentials for authentication from
'/tmp/Endpoint_SlaveEndpointTest_NoAuthorizer_1_N2fU0B/http_credentials'
I0729 08:01:48.682854  6438 http.cpp:993] Creating default 'basic' HTTP authenticator for
realm 'mesos-agent-readonly'
I0729 08:01:48.683003  6438 http.cpp:993] Creating default 'basic' HTTP authenticator for
realm 'mesos-agent-readwrite'
I0729 08:01:48.684320  6438 slave.cpp:565] Agent resources: [{"name":"cpus","scalar":{"value":2.0},"type":"SCALAR"},{"name":"mem","scalar":{"value":1024.0},"type":"SCALAR"},{"name":"disk","scalar":{"value":1024.0},"type":"SCALAR"},{"name":"ports","ranges":{"range":[{"begin":31000,"end":32000}]},"type":"RANGES"}]
I0729 08:01:48.684563  6438 slave.cpp:573] Agent attributes: [  ]
I0729 08:01:48.684581  6438 slave.cpp:582] Agent hostname: 8a64e3cd0806
I0729 08:01:48.684713  6431 status_update_manager.cpp:177] Pausing sending status updates
I0729 08:01:48.686175  6447 state.cpp:64] Recovering state from '/tmp/Endpoint_SlaveEndpointTest_NoAuthorizer_1_CfFqU4/meta'
I0729 08:01:48.686498  6449 status_update_manager.cpp:203] Recovering status update manager
I0729 08:01:48.686694  6444 containerizer.cpp:582] Recovering containerizer
I0729 08:01:48.688128  6451 provisioner.cpp:416] Provisioner recovery complete
I0729 08:01:48.688500  6438 slave.cpp:6207] Finished recovery
I0729 08:01:48.689101  6438 slave.cpp:6389] Querying resource estimator for oversubscribable
resources
I0729 08:01:48.689324  6440 slave.cpp:6403] Received oversubscribable resources {} from the
resource estimator
I0729 08:01:48.691915  6435 process.cpp:3836] Handling HTTP event for process 'slave(797)'
with path: '/slave(797)/monitor/statistics.json'
I0729 08:01:48.693150  6442 http.cpp:1133] HTTP GET for /slave(797)/monitor/statistics.json
from 172.17.0.7:35074
I0729 08:01:48.693243  6442 http.cpp:957] Authorizing principal 'test-principal' to GET the
'/monitor/statistics.json' endpoint
I0729 08:01:48.696673  6428 slave.cpp:843] Agent terminating
[       OK ] Endpoint/SlaveEndpointTest.NoAuthorizer/1 (30 ms)
[ RUN      ] Endpoint/SlaveEndpointTest.NoAuthorizer/2
I0729 08:01:48.708192  6409 containerizer.cpp:230] Using isolation: posix/cpu,posix/mem,filesystem/posix,network/cni,environment_secret
W0729 08:01:48.708719  6409 backend.cpp:76] Failed to create 'aufs' backend: AufsBackend requires
root privileges
W0729 08:01:48.708822  6409 backend.cpp:76] Failed to create 'bind' backend: BindBackend requires
root privileges
I0729 08:01:48.708855  6409 provisioner.cpp:255] Using default backend 'copy'
I0729 08:01:48.710353  6409 cluster.cpp:448] Creating default 'local' authorizer
I0729 08:01:48.711949  6449 slave.cpp:250] Mesos agent started on (798)@172.17.0.7:41091
I0729 08:01:48.711969  6449 slave.cpp:251] Flags at startup: --acls="" --appc_simple_discovery_uri_prefix="http://"
--appc_store_dir="/tmp/Endpoint_SlaveEndpointTest_NoAuthorizer_2_2l69FK/store/appc" --authenticate_http_readonly="true"
--authenticate_http_readwrite="true" --authenticatee="crammd5" --authentication_backoff_factor="1secs"
--authorizer="local" --cgroups_cpu_enable_pids_and_tids_count="false" --cgroups_enable_cfs="false"
--cgroups_hierarchy="/sys/fs/cgroup" --cgroups_limit_swap="false" --cgroups_root="mesos" --container_disk_watch_interval="15secs"
--containerizers="mesos" --credential="/tmp/Endpoint_SlaveEndpointTest_NoAuthorizer_2_2l69FK/credential"
--default_role="*" --disk_watch_interval="1mins" --docker="docker" --docker_kill_orphans="true"
--docker_registry="https://registry-1.docker.io" --docker_remove_delay="6hrs" --docker_socket="/var/run/docker.sock"
--docker_stop_timeout="0ns" --docker_store_dir="/tmp/Endpoint_SlaveEndpointTest_NoAuthorizer_2_2l69FK/store/docker"
--docker_volume_checkpoint_dir="/var/run/mesos/isolators/docker/volume" --enforce_container_disk_quota="false"
--executor_registration_timeout="1mins" --executor_reregistration_timeout="2secs" --executor_shutdown_grace_period="5secs"
--fetcher_cache_dir="/tmp/Endpoint_SlaveEndpointTest_NoAuthorizer_2_2l69FK/fetch" --fetcher_cache_size="2GB"
--frameworks_home="" --gc_delay="1weeks" --gc_disk_headroom="0.1" --hadoop_home="" --help="false"
--hostname_lookup="true" --http_command_executor="false" --http_credentials="/tmp/Endpoint_SlaveEndpointTest_NoAuthorizer_2_2l69FK/http_credentials"
--http_heartbeat_interval="30secs" --initialize_driver_logging="true" --isolation="posix/cpu,posix/mem"
--launcher="posix" --launcher_dir="/mesos/mesos-1.4.0/_build/src" --logbufsecs="0" --logging_level="INFO"
--max_completed_executors_per_framework="150" --oversubscribed_resources_interval="15secs"
--perf_duration="10secs" --perf_interval="1mins" --port="5051" --qos_correction_interval_min="0ns"
--quiet="false" --recover="reconnect" --recovery_timeout="15mins" --registration_backoff_factor="10ms"
--resources="cpus:2;gpus:0;mem:1024;disk:1024;ports:[31000-32000]" --revocable_cpu_low_priority="true"
--runtime_dir="/tmp/Endpoint_SlaveEndpointTest_NoAuthorizer_2_2l69FK" --sandbox_directory="/mnt/mesos/sandbox"
--strict="true" --switch_user="true" --systemd_enable_support="true" --systemd_runtime_directory="/run/systemd/system"
--version="false" --work_dir="/tmp/Endpoint_SlaveEndpointTest_NoAuthorizer_2_NKu9ud"
I0729 08:01:48.712340  6449 credentials.hpp:86] Loading credential for authentication from
'/tmp/Endpoint_SlaveEndpointTest_NoAuthorizer_2_2l69FK/credential'
I0729 08:01:48.712494  6449 slave.cpp:283] Agent using credential for: test-principal
I0729 08:01:48.712517  6449 credentials.hpp:37] Loading credentials for authentication from
'/tmp/Endpoint_SlaveEndpointTest_NoAuthorizer_2_2l69FK/http_credentials'
I0729 08:01:48.712733  6449 http.cpp:993] Creating default 'basic' HTTP authenticator for
realm 'mesos-agent-readonly'
I0729 08:01:48.712877  6449 http.cpp:993] Creating default 'basic' HTTP authenticator for
realm 'mesos-agent-readwrite'
I0729 08:01:48.714076  6449 slave.cpp:565] Agent resources: [{"name":"cpus","scalar":{"value":2.0},"type":"SCALAR"},{"name":"mem","scalar":{"value":1024.0},"type":"SCALAR"},{"name":"disk","scalar":{"value":1024.0},"type":"SCALAR"},{"name":"ports","ranges":{"range":[{"begin":31000,"end":32000}]},"type":"RANGES"}]
I0729 08:01:48.714314  6449 slave.cpp:573] Agent attributes: [  ]
I0729 08:01:48.714329  6449 slave.cpp:582] Agent hostname: 8a64e3cd0806
I0729 08:01:48.714437  6441 status_update_manager.cpp:177] Pausing sending status updates
I0729 08:01:48.715742  6443 state.cpp:64] Recovering state from '/tmp/Endpoint_SlaveEndpointTest_NoAuthorizer_2_NKu9ud/meta'
I0729 08:01:48.716050  6444 status_update_manager.cpp:203] Recovering status update manager
I0729 08:01:48.716261  6439 containerizer.cpp:582] Recovering containerizer
I0729 08:01:48.717600  6446 provisioner.cpp:416] Provisioner recovery complete
I0729 08:01:48.717955  6434 slave.cpp:6207] Finished recovery
I0729 08:01:48.718569  6434 slave.cpp:6389] Querying resource estimator for oversubscribable
resources
I0729 08:01:48.718819  6430 slave.cpp:6403] Received oversubscribable resources {} from the
resource estimator
I0729 08:01:48.721209  6450 process.cpp:3836] Handling HTTP event for process 'slave(798)'
with path: '/slave(798)/containers'
I0729 08:01:48.722407  6443 http.cpp:1133] HTTP GET for /slave(798)/containers from 172.17.0.7:35076
I0729 08:01:48.722488  6443 http.cpp:957] Authorizing principal 'test-principal' to GET the
'/containers' endpoint
I0729 08:01:48.726001  6439 slave.cpp:843] Agent terminating
[       OK ] Endpoint/SlaveEndpointTest.NoAuthorizer/2 (28 ms)
[----------] 9 tests from Endpoint/SlaveEndpointTest (279 ms total)

[----------] Global test environment tear-down
[==========] 1646 tests from 181 test cases ran. (625305 ms total)
[  PASSED  ] 1641 tests.
[  FAILED  ] 5 tests, listed below:
[  FAILED  ] CommandExecutorCheckTest.CommandCheckDeliveredAndReconciled
[  FAILED  ] DefaultExecutorCheckTest.CommandCheckDeliveredAndReconciled
[  FAILED  ] DefaultExecutorCheckTest.CommandCheckStatusChange
[  FAILED  ] DefaultExecutorCheckTest.CommandCheckSeesParentsEnv
[  FAILED  ] DefaultExecutorCheckTest.CommandCheckSharesWorkDirWithTask

 5 FAILED TESTS
  YOU HAVE 20 DISABLED TESTS

I0729 08:01:48.799770  6452 process.cpp:1006] Failed to accept socket: future discarded
make[4]: *** [check-local] Error 1
make[4]: Leaving directory `/mesos/mesos-1.4.0/_build/src'
make[3]: *** [check-am] Error 2
make[3]: Leaving directory `/mesos/mesos-1.4.0/_build/src'
make[2]: *** [check] Error 2
make[2]: Leaving directory `/mesos/mesos-1.4.0/_build/src'
make[1]: *** [check-recursive] Error 1
make[1]: Leaving directory `/mesos/mesos-1.4.0/_build'
make: *** [distcheck] Error 1
+ docker rmi mesos-1501312519-15894
Untagged: mesos-1501312519-15894:latest
Deleted: sha256:e7afa1936fab17f565ff1c80fa645419d1b0f285ee3dce070d415a4b13b6f0f5
Deleted: sha256:5b044e0486ff4b6b67538d66feb2c0fa0eed1e2b83a0d64ea9a153f948d549ae
Deleted: sha256:daf8cc92cbb3f2ba456cd6051511c9d24806fd1453deca15a7ade61e3a88521f
Deleted: sha256:ea72c0f2daf0e7980be0b7ccad18c7ffa268c29ada54e801de4064f8eaa24c17
Deleted: sha256:f8e4f78439f6a8ee8d8779fe7f2b3bbbc8f947bf6faec48858ff67c289cdd49d
Deleted: sha256:002505afc4b4cba2af78032ac76293485593f34ef8afad699302450afc4b659b
Deleted: sha256:bac319d59720cd91b3312f2ca67f3a177ec4cead37d35a4e400d01d5effd8d87
Deleted: sha256:fab82b2aa8760f9f1d5dfff96ff7dd5b1e5015e994d7a782170970cf70f89d26
Deleted: sha256:8b072e889edace7004aac8a74c00cc6706a76f3aeb9dd7572ba9aea63f61b18f
Deleted: sha256:d5fad04c7c55cfc53dc77e5c3ae6044ad0c63e7a7677c614a69fc00996310e6f
Deleted: sha256:77e4fb1377787b8008cc5a2e40cd40d816d16ae610b46282d3db04cbff917455
Deleted: sha256:b18129c853886853d81f3fc240dc2c22292026ef7d1c226a51d18d07c4f8ff1e
Deleted: sha256:4c4520c0eecd08cefd74cca9240bdb692d3e8de4ed508cbc2f07d19aa2a3e6e3
Deleted: sha256:e99af61293feb94431d7c848560eac8bc36618aadd43825d0a8e046053c78d8e
Deleted: sha256:440708e292724a257d80d7382ec4d1ff2ee8f066be7e14e9ff88029e1602135d
Deleted: sha256:c057cfb92d365f8adefa26422cc329509b515a809f9c52e70ec846292c602b21
Deleted: sha256:119036c64b29588f0ff0b0b6b6369c7f8e5e83cc6c954c7d7dfa6c63d53bd95b
Deleted: sha256:6f8a056f046e3a0bd5496d59822b3d3d395098b105355c8fd9c12527610cae7d
Deleted: sha256:824441b5745025460b986432ced80f416fea036b4fd15319dc12c3b5a9aa4e55
Deleted: sha256:d481b59387069eafb5f41361e69b7687e2bb4dda04dd49944d8b180c1f139982
Deleted: sha256:7bee6c646d3477f2669ef3b8c1d97949db1a254828195f17bf6b120940bc78b5
Deleted: sha256:809246e8bf627ee9f19db2fcb8139e95f65b9e00fc846a2b8576b22ffe18111e
Deleted: sha256:f74a2ac8dd43fa4cc9b168d68dd1518861ef381c805a156de7493fa6f88a8ed5
Deleted: sha256:821377544116a3f15518af4739f2cdda29d045cc13bfb6a2dc1543ffd0bdf0e6
Deleted: sha256:d7f1d75fb56fd0ef19f968fc8f4346387e0afb9cf12b8b10e1c82cc938c87fc0
Build step 'Execute shell' marked build as failure
Not sending mail to unregistered user songzihao1990@gmail.com

Mime
View raw message