mesos-builds mailing list archives

Site index · List index
Message view « Date » · « Thread »
Top « Date » · « Thread »
From Apache Jenkins Server <jenk...@builds.apache.org>
Subject Build failed in Jenkins: Mesos-Reviewbot #18598
Date Wed, 26 Jul 2017 06:08:55 GMT
See <https://builds.apache.org/job/Mesos-Reviewbot/18598/display/redirect>

------------------------------------------
[...truncated 30.24 MB...]
I0726 06:08:47.886112  5018 containerizer.cpp:230] Using isolation: posix/cpu,posix/mem,filesystem/posix,network/cni,environment_secret
W0726 06:08:47.886890  5018 backend.cpp:76] Failed to create 'overlay' backend: OverlayBackend
requires root privileges
W0726 06:08:47.887060  5018 backend.cpp:76] Failed to create 'bind' backend: BindBackend requires
root privileges
I0726 06:08:47.887105  5018 provisioner.cpp:255] Using default backend 'copy'
I0726 06:08:47.892065  5038 slave.cpp:250] Mesos agent started on (796)@172.17.0.2:41079
I0726 06:08:47.892104  5038 slave.cpp:251] Flags at startup: --acls="" --appc_simple_discovery_uri_prefix="http://"
--appc_store_dir="/tmp/Endpoint_SlaveEndpointTest_AuthorizedRequest_2_woTS13/store/appc" --authenticate_http_readonly="true"
--authenticate_http_readwrite="true" --authenticatee="crammd5" --authentication_backoff_factor="1secs"
--authorizer="local" --cgroups_cpu_enable_pids_and_tids_count="false" --cgroups_enable_cfs="false"
--cgroups_hierarchy="/sys/fs/cgroup" --cgroups_limit_swap="false" --cgroups_root="mesos" --container_disk_watch_interval="15secs"
--containerizers="mesos" --credential="/tmp/Endpoint_SlaveEndpointTest_AuthorizedRequest_2_woTS13/credential"
--default_role="*" --disk_watch_interval="1mins" --docker="docker" --docker_kill_orphans="true"
--docker_registry="https://registry-1.docker.io" --docker_remove_delay="6hrs" --docker_socket="/var/run/docker.sock"
--docker_stop_timeout="0ns" --docker_store_dir="/tmp/Endpoint_SlaveEndpointTest_AuthorizedRequest_2_woTS13/store/docker"
--docker_volume_checkpoint_dir="/var/run/mesos/isolators/docker/volume" --enforce_container_disk_quota="false"
--executor_registration_timeout="1mins" --executor_reregistration_timeout="2secs" --executor_shutdown_grace_period="5secs"
--fetcher_cache_dir="/tmp/Endpoint_SlaveEndpointTest_AuthorizedRequest_2_woTS13/fetch" --fetcher_cache_size="2GB"
--frameworks_home="" --gc_delay="1weeks" --gc_disk_headroom="0.1" --hadoop_home="" --help="false"
--hostname_lookup="true" --http_command_executor="false" --http_credentials="/tmp/Endpoint_SlaveEndpointTest_AuthorizedRequest_2_woTS13/http_credentials"
--http_heartbeat_interval="30secs" --initialize_driver_logging="true" --isolation="posix/cpu,posix/mem"
--launcher="posix" --launcher_dir="/mesos/mesos-1.4.0/_build/src" --logbufsecs="0" --logging_level="INFO"
--max_completed_executors_per_framework="150" --oversubscribed_resources_interval="15secs"
--perf_duration="10secs" --perf_interval="1mins" --port="5051" --qos_correction_interval_min="0ns"
--quiet="false" --recover="reconnect" --recovery_timeout="15mins" --registration_backoff_factor="10ms"
--resources="cpus:2;gpus:0;mem:1024;disk:1024;ports:[31000-32000]" --revocable_cpu_low_priority="true"
--runtime_dir="/tmp/Endpoint_SlaveEndpointTest_AuthorizedRequest_2_woTS13" --sandbox_directory="/mnt/mesos/sandbox"
--strict="true" --switch_user="true" --systemd_enable_support="true" --systemd_runtime_directory="/run/systemd/system"
--version="false" --work_dir="/tmp/Endpoint_SlaveEndpointTest_AuthorizedRequest_2_KmCA86"
I0726 06:08:47.892833  5038 credentials.hpp:86] Loading credential for authentication from
'/tmp/Endpoint_SlaveEndpointTest_AuthorizedRequest_2_woTS13/credential'
I0726 06:08:47.893095  5038 slave.cpp:283] Agent using credential for: test-principal
I0726 06:08:47.893123  5038 credentials.hpp:37] Loading credentials for authentication from
'/tmp/Endpoint_SlaveEndpointTest_AuthorizedRequest_2_woTS13/http_credentials'
I0726 06:08:47.893502  5038 http.cpp:993] Creating default 'basic' HTTP authenticator for
realm 'mesos-agent-readonly'
I0726 06:08:47.893724  5038 http.cpp:993] Creating default 'basic' HTTP authenticator for
realm 'mesos-agent-readwrite'
I0726 06:08:47.895854  5038 slave.cpp:565] Agent resources: [{"name":"cpus","scalar":{"value":2.0},"type":"SCALAR"},{"name":"mem","scalar":{"value":1024.0},"type":"SCALAR"},{"name":"disk","scalar":{"value":1024.0},"type":"SCALAR"},{"name":"ports","ranges":{"range":[{"begin":31000,"end":32000}]},"type":"RANGES"}]
I0726 06:08:47.896284  5038 slave.cpp:573] Agent attributes: [  ]
I0726 06:08:47.896306  5038 slave.cpp:582] Agent hostname: 59839cae445a
I0726 06:08:47.896543  5040 status_update_manager.cpp:177] Pausing sending status updates
I0726 06:08:47.898360  5043 state.cpp:64] Recovering state from '/tmp/Endpoint_SlaveEndpointTest_AuthorizedRequest_2_KmCA86/meta'
I0726 06:08:47.898864  5037 status_update_manager.cpp:203] Recovering status update manager
I0726 06:08:47.899236  5044 containerizer.cpp:582] Recovering containerizer
I0726 06:08:47.901444  5041 provisioner.cpp:416] Provisioner recovery complete
I0726 06:08:47.902143  5043 slave.cpp:6207] Finished recovery
I0726 06:08:47.902772  5043 slave.cpp:6389] Querying resource estimator for oversubscribable
resources
I0726 06:08:47.903120  5043 slave.cpp:6403] Received oversubscribable resources {} from the
resource estimator
I0726 06:08:47.907255  5043 process.cpp:3837] Handling HTTP event for process 'slave(796)'
with path: '/slave(796)/containers'
I0726 06:08:47.909278  5038 http.cpp:1133] HTTP GET for /slave(796)/containers from 172.17.0.2:57170
I0726 06:08:47.909404  5038 http.cpp:957] Authorizing principal 'test-principal' to GET the
'/containers' endpoint
I0726 06:08:47.914996  5041 slave.cpp:843] Agent terminating
[       OK ] Endpoint/SlaveEndpointTest.AuthorizedRequest/2 (45 ms)
[ RUN      ] Endpoint/SlaveEndpointTest.UnauthorizedRequest/0
I0726 06:08:47.931573  5018 containerizer.cpp:230] Using isolation: posix/cpu,posix/mem,filesystem/posix,network/cni,environment_secret
W0726 06:08:47.932348  5018 backend.cpp:76] Failed to create 'overlay' backend: OverlayBackend
requires root privileges
W0726 06:08:47.932514  5018 backend.cpp:76] Failed to create 'bind' backend: BindBackend requires
root privileges
I0726 06:08:47.932559  5018 provisioner.cpp:255] Using default backend 'copy'
I0726 06:08:47.937584  5044 slave.cpp:250] Mesos agent started on (797)@172.17.0.2:41079
I0726 06:08:47.937628  5044 slave.cpp:251] Flags at startup: --acls="" --appc_simple_discovery_uri_prefix="http://"
--appc_store_dir="/tmp/Endpoint_SlaveEndpointTest_UnauthorizedRequest_0_a3v0ZR/store/appc"
--authenticate_http_readonly="true" --authenticate_http_readwrite="true" --authenticatee="crammd5"
--authentication_backoff_factor="1secs" --authorizer="local" --cgroups_cpu_enable_pids_and_tids_count="false"
--cgroups_enable_cfs="false" --cgroups_hierarchy="/sys/fs/cgroup" --cgroups_limit_swap="false"
--cgroups_root="mesos" --container_disk_watch_interval="15secs" --containerizers="mesos" --credential="/tmp/Endpoint_SlaveEndpointTest_UnauthorizedRequest_0_a3v0ZR/credential"
--default_role="*" --disk_watch_interval="1mins" --docker="docker" --docker_kill_orphans="true"
--docker_registry="https://registry-1.docker.io" --docker_remove_delay="6hrs" --docker_socket="/var/run/docker.sock"
--docker_stop_timeout="0ns" --docker_store_dir="/tmp/Endpoint_SlaveEndpointTest_UnauthorizedRequest_0_a3v0ZR/store/docker"
--docker_volume_checkpoint_dir="/var/run/mesos/isolators/docker/volume" --enforce_container_disk_quota="false"
--executor_registration_timeout="1mins" --executor_reregistration_timeout="2secs" --executor_shutdown_grace_period="5secs"
--fetcher_cache_dir="/tmp/Endpoint_SlaveEndpointTest_UnauthorizedRequest_0_a3v0ZR/fetch" --fetcher_cache_size="2GB"
--frameworks_home="" --gc_delay="1weeks" --gc_disk_headroom="0.1" --hadoop_home="" --help="false"
--hostname_lookup="true" --http_command_executor="false" --http_credentials="/tmp/Endpoint_SlaveEndpointTest_UnauthorizedRequest_0_a3v0ZR/http_credentials"
--http_heartbeat_interval="30secs" --initialize_driver_logging="true" --isolation="posix/cpu,posix/mem"
--launcher="posix" --launcher_dir="/mesos/mesos-1.4.0/_build/src" --logbufsecs="0" --logging_level="INFO"
--max_completed_executors_per_framework="150" --oversubscribed_resources_interval="15secs"
--perf_duration="10secs" --perf_interval="1mins" --port="5051" --qos_correction_interval_min="0ns"
--quiet="false" --recover="reconnect" --recovery_timeout="15mins" --registration_backoff_factor="10ms"
--resources="cpus:2;gpus:0;mem:1024;disk:1024;ports:[31000-32000]" --revocable_cpu_low_priority="true"
--runtime_dir="/tmp/Endpoint_SlaveEndpointTest_UnauthorizedRequest_0_a3v0ZR" --sandbox_directory="/mnt/mesos/sandbox"
--strict="true" --switch_user="true" --systemd_enable_support="true" --systemd_runtime_directory="/run/systemd/system"
--version="false" --work_dir="/tmp/Endpoint_SlaveEndpointTest_UnauthorizedRequest_0_At0lZU"
I0726 06:08:47.938349  5044 credentials.hpp:86] Loading credential for authentication from
'/tmp/Endpoint_SlaveEndpointTest_UnauthorizedRequest_0_a3v0ZR/credential'
I0726 06:08:47.938601  5044 slave.cpp:283] Agent using credential for: test-principal
I0726 06:08:47.938623  5044 credentials.hpp:37] Loading credentials for authentication from
'/tmp/Endpoint_SlaveEndpointTest_UnauthorizedRequest_0_a3v0ZR/http_credentials'
I0726 06:08:47.938967  5044 http.cpp:993] Creating default 'basic' HTTP authenticator for
realm 'mesos-agent-readonly'
I0726 06:08:47.939184  5044 http.cpp:993] Creating default 'basic' HTTP authenticator for
realm 'mesos-agent-readwrite'
I0726 06:08:47.941303  5044 slave.cpp:565] Agent resources: [{"name":"cpus","scalar":{"value":2.0},"type":"SCALAR"},{"name":"mem","scalar":{"value":1024.0},"type":"SCALAR"},{"name":"disk","scalar":{"value":1024.0},"type":"SCALAR"},{"name":"ports","ranges":{"range":[{"begin":31000,"end":32000}]},"type":"RANGES"}]
I0726 06:08:47.941730  5044 slave.cpp:573] Agent attributes: [  ]
I0726 06:08:47.941764  5044 slave.cpp:582] Agent hostname: 59839cae445a
I0726 06:08:47.941982  5039 status_update_manager.cpp:177] Pausing sending status updates
I0726 06:08:47.943899  5043 state.cpp:64] Recovering state from '/tmp/Endpoint_SlaveEndpointTest_UnauthorizedRequest_0_At0lZU/meta'
I0726 06:08:47.944422  5043 status_update_manager.cpp:203] Recovering status update manager
I0726 06:08:47.944671  5043 containerizer.cpp:582] Recovering containerizer
I0726 06:08:47.946782  5038 provisioner.cpp:416] Provisioner recovery complete
I0726 06:08:47.947532  5039 slave.cpp:6207] Finished recovery
I0726 06:08:47.948160  5039 slave.cpp:6389] Querying resource estimator for oversubscribable
resources
I0726 06:08:47.948501  5042 slave.cpp:6403] Received oversubscribable resources {} from the
resource estimator
I0726 06:08:47.952435  5041 process.cpp:3837] Handling HTTP event for process 'slave(797)'
with path: '/slave(797)/monitor/statistics'
I0726 06:08:47.954656  5044 http.cpp:1133] HTTP GET for /slave(797)/monitor/statistics from
172.17.0.2:57172
I0726 06:08:47.954782  5044 http.cpp:957] Authorizing principal 'test-principal' to GET the
'/monitor/statistics' endpoint
I0726 06:08:47.958422  5042 slave.cpp:843] Agent terminating
[       OK ] Endpoint/SlaveEndpointTest.UnauthorizedRequest/0 (43 ms)
[ RUN      ] Endpoint/SlaveEndpointTest.UnauthorizedRequest/1
I0726 06:08:47.975281  5018 containerizer.cpp:230] Using isolation: posix/cpu,posix/mem,filesystem/posix,network/cni,environment_secret
W0726 06:08:47.976073  5018 backend.cpp:76] Failed to create 'overlay' backend: OverlayBackend
requires root privileges
W0726 06:08:47.976251  5018 backend.cpp:76] Failed to create 'bind' backend: BindBackend requires
root privileges
I0726 06:08:47.976299  5018 provisioner.cpp:255] Using default backend 'copy'
I0726 06:08:47.981232  5043 slave.cpp:250] Mesos agent started on (798)@172.17.0.2:41079
I0726 06:08:47.981274  5043 slave.cpp:251] Flags at startup: --acls="" --appc_simple_discovery_uri_prefix="http://"
--appc_store_dir="/tmp/Endpoint_SlaveEndpointTest_UnauthorizedRequest_1_cYYIqG/store/appc"
--authenticate_http_readonly="true" --authenticate_http_readwrite="true" --authenticatee="crammd5"
--authentication_backoff_factor="1secs" --authorizer="local" --cgroups_cpu_enable_pids_and_tids_count="false"
--cgroups_enable_cfs="false" --cgroups_hierarchy="/sys/fs/cgroup" --cgroups_limit_swap="false"
--cgroups_root="mesos" --container_disk_watch_interval="15secs" --containerizers="mesos" --credential="/tmp/Endpoint_SlaveEndpointTest_UnauthorizedRequest_1_cYYIqG/credential"
--default_role="*" --disk_watch_interval="1mins" --docker="docker" --docker_kill_orphans="true"
--docker_registry="https://registry-1.docker.io" --docker_remove_delay="6hrs" --docker_socket="/var/run/docker.sock"
--docker_stop_timeout="0ns" --docker_store_dir="/tmp/Endpoint_SlaveEndpointTest_UnauthorizedRequest_1_cYYIqG/store/docker"
--docker_volume_checkpoint_dir="/var/run/mesos/isolators/docker/volume" --enforce_container_disk_quota="false"
--executor_registration_timeout="1mins" --executor_reregistration_timeout="2secs" --executor_shutdown_grace_period="5secs"
--fetcher_cache_dir="/tmp/Endpoint_SlaveEndpointTest_UnauthorizedRequest_1_cYYIqG/fetch" --fetcher_cache_size="2GB"
--frameworks_home="" --gc_delay="1weeks" --gc_disk_headroom="0.1" --hadoop_home="" --help="false"
--hostname_lookup="true" --http_command_executor="false" --http_credentials="/tmp/Endpoint_SlaveEndpointTest_UnauthorizedRequest_1_cYYIqG/http_credentials"
--http_heartbeat_interval="30secs" --initialize_driver_logging="true" --isolation="posix/cpu,posix/mem"
--launcher="posix" --launcher_dir="/mesos/mesos-1.4.0/_build/src" --logbufsecs="0" --logging_level="INFO"
--max_completed_executors_per_framework="150" --oversubscribed_resources_interval="15secs"
--perf_duration="10secs" --perf_interval="1mins" --port="5051" --qos_correction_interval_min="0ns"
--quiet="false" --recover="reconnect" --recovery_timeout="15mins" --registration_backoff_factor="10ms"
--resources="cpus:2;gpus:0;mem:1024;disk:1024;ports:[31000-32000]" --revocable_cpu_low_priority="true"
--runtime_dir="/tmp/Endpoint_SlaveEndpointTest_UnauthorizedRequest_1_cYYIqG" --sandbox_directory="/mnt/mesos/sandbox"
--strict="true" --switch_user="true" --systemd_enable_support="true" --systemd_runtime_directory="/run/systemd/system"
--version="false" --work_dir="/tmp/Endpoint_SlaveEndpointTest_UnauthorizedRequest_1_qkyZiJ"
I0726 06:08:47.981989  5043 credentials.hpp:86] Loading credential for authentication from
'/tmp/Endpoint_SlaveEndpointTest_UnauthorizedRequest_1_cYYIqG/credential'
I0726 06:08:47.982237  5043 slave.cpp:283] Agent using credential for: test-principal
I0726 06:08:47.982260  5043 credentials.hpp:37] Loading credentials for authentication from
'/tmp/Endpoint_SlaveEndpointTest_UnauthorizedRequest_1_cYYIqG/http_credentials'
I0726 06:08:47.982604  5043 http.cpp:993] Creating default 'basic' HTTP authenticator for
realm 'mesos-agent-readonly'
I0726 06:08:47.982822  5043 http.cpp:993] Creating default 'basic' HTTP authenticator for
realm 'mesos-agent-readwrite'
I0726 06:08:47.984958  5043 slave.cpp:565] Agent resources: [{"name":"cpus","scalar":{"value":2.0},"type":"SCALAR"},{"name":"mem","scalar":{"value":1024.0},"type":"SCALAR"},{"name":"disk","scalar":{"value":1024.0},"type":"SCALAR"},{"name":"ports","ranges":{"range":[{"begin":31000,"end":32000}]},"type":"RANGES"}]
I0726 06:08:47.985386  5043 slave.cpp:573] Agent attributes: [  ]
I0726 06:08:47.985411  5043 slave.cpp:582] Agent hostname: 59839cae445a
I0726 06:08:47.985663  5040 status_update_manager.cpp:177] Pausing sending status updates
I0726 06:08:47.987484  5038 state.cpp:64] Recovering state from '/tmp/Endpoint_SlaveEndpointTest_UnauthorizedRequest_1_qkyZiJ/meta'
I0726 06:08:47.987988  5039 status_update_manager.cpp:203] Recovering status update manager
I0726 06:08:47.988291  5037 containerizer.cpp:582] Recovering containerizer
I0726 06:08:47.990687  5041 provisioner.cpp:416] Provisioner recovery complete
I0726 06:08:47.991353  5044 slave.cpp:6207] Finished recovery
I0726 06:08:47.991991  5044 slave.cpp:6389] Querying resource estimator for oversubscribable
resources
I0726 06:08:47.992308  5042 slave.cpp:6403] Received oversubscribable resources {} from the
resource estimator
I0726 06:08:47.996237  5042 process.cpp:3837] Handling HTTP event for process 'slave(798)'
with path: '/slave(798)/monitor/statistics.json'
I0726 06:08:47.998113  5037 http.cpp:1133] HTTP GET for /slave(798)/monitor/statistics.json
from 172.17.0.2:57174
I0726 06:08:47.998280  5037 http.cpp:957] Authorizing principal 'test-principal' to GET the
'/monitor/statistics.json' endpoint
I0726 06:08:48.002571  5041 slave.cpp:843] Agent terminating
[       OK ] Endpoint/SlaveEndpointTest.UnauthorizedRequest/1 (43 ms)
[ RUN      ] Endpoint/SlaveEndpointTest.UnauthorizedRequest/2
I0726 06:08:48.019274  5018 containerizer.cpp:230] Using isolation: posix/cpu,posix/mem,filesystem/posix,network/cni,environment_secret
W0726 06:08:48.020071  5018 backend.cpp:76] Failed to create 'overlay' backend: OverlayBackend
requires root privileges
W0726 06:08:48.020246  5018 backend.cpp:76] Failed to create 'bind' backend: BindBackend requires
root privileges
I0726 06:08:48.020292  5018 provisioner.cpp:255] Using default backend 'copy'
I0726 06:08:48.025291  5038 slave.cpp:250] Mesos agent started on (799)@172.17.0.2:41079
I0726 06:08:48.025373  5038 slave.cpp:251] Flags at startup: --acls="" --appc_simple_discovery_uri_prefix="http://"
--appc_store_dir="/tmp/Endpoint_SlaveEndpointTest_UnauthorizedRequest_2_6yRYjv/store/appc"
--authenticate_http_readonly="true" --authenticate_http_readwrite="true" --authenticatee="crammd5"
--authentication_backoff_factor="1secs" --authorizer="local" --cgroups_cpu_enable_pids_and_tids_count="false"
--cgroups_enable_cfs="false" --cgroups_hierarchy="/sys/fs/cgroup" --cgroups_limit_swap="false"
--cgroups_root="mesos" --container_disk_watch_interval="15secs" --containerizers="mesos" --credential="/tmp/Endpoint_SlaveEndpointTest_UnauthorizedRequest_2_6yRYjv/credential"
--default_role="*" --disk_watch_interval="1mins" --docker="docker" --docker_kill_orphans="true"
--docker_registry="https://registry-1.docker.io" --docker_remove_delay="6hrs" --docker_socket="/var/run/docker.sock"
--docker_stop_timeout="0ns" --docker_store_dir="/tmp/Endpoint_SlaveEndpointTest_UnauthorizedRequest_2_6yRYjv/store/docker"
--docker_volume_checkpoint_dir="/var/run/mesos/isolators/docker/volume" --enforce_container_disk_quota="false"
--executor_registration_timeout="1mins" --executor_reregistration_timeout="2secs" --executor_shutdown_grace_period="5secs"
--fetcher_cache_dir="/tmp/Endpoint_SlaveEndpointTest_UnauthorizedRequest_2_6yRYjv/fetch" --fetcher_cache_size="2GB"
--frameworks_home="" --gc_delay="1weeks" --gc_disk_headroom="0.1" --hadoop_home="" --help="false"
--hostname_lookup="true" --http_command_executor="false" --http_credentials="/tmp/Endpoint_SlaveEndpointTest_UnauthorizedRequest_2_6yRYjv/http_credentials"
--http_heartbeat_interval="30secs" --initialize_driver_logging="true" --isolation="posix/cpu,posix/mem"
--launcher="posix" --launcher_dir="/mesos/mesos-1.4.0/_build/src" --logbufsecs="0" --logging_level="INFO"
--max_completed_executors_per_framework="150" --oversubscribed_resources_interval="15secs"
--perf_duration="10secs" --perf_interval="1mins" --port="5051" --qos_correction_interval_min="0ns"
--quiet="false" --recover="reconnect" --recovery_timeout="15mins" --registration_backoff_factor="10ms"
--resources="cpus:2;gpus:0;mem:1024;disk:1024;ports:[31000-32000]" --revocable_cpu_low_priority="true"
--runtime_dir="/tmp/Endpoint_SlaveEndpointTest_UnauthorizedRequest_2_6yRYjv" --sandbox_directory="/mnt/mesos/sandbox"
--strict="true" --switch_user="true" --systemd_enable_support="true" --systemd_runtime_directory="/run/systemd/system"
--version="false" --work_dir="/tmp/Endpoint_SlaveEndpointTest_UnauthorizedRequest_2_CGa64x"
I0726 06:08:48.026145  5038 credentials.hpp:86] Loading credential for authentication from
'/tmp/Endpoint_SlaveEndpointTest_UnauthorizedRequest_2_6yRYjv/credential'
I0726 06:08:48.026451  5038 slave.cpp:283] Agent using credential for: test-principal
I0726 06:08:48.026516  5038 credentials.hpp:37] Loading credentials for authentication from
'/tmp/Endpoint_SlaveEndpointTest_UnauthorizedRequest_2_6yRYjv/http_credentials'
I0726 06:08:48.026937  5038 http.cpp:993] Creating default 'basic' HTTP authenticator for
realm 'mesos-agent-readonly'
I0726 06:08:48.027207  5038 http.cpp:993] Creating default 'basic' HTTP authenticator for
realm 'mesos-agent-readwrite'
I0726 06:08:48.029420  5038 slave.cpp:565] Agent resources: [{"name":"cpus","scalar":{"value":2.0},"type":"SCALAR"},{"name":"mem","scalar":{"value":1024.0},"type":"SCALAR"},{"name":"disk","scalar":{"value":1024.0},"type":"SCALAR"},{"name":"ports","ranges":{"range":[{"begin":31000,"end":32000}]},"type":"RANGES"}]
I0726 06:08:48.029896  5038 slave.cpp:573] Agent attributes: [  ]
I0726 06:08:48.029943  5038 slave.cpp:582] Agent hostname: 59839cae445a
I0726 06:08:48.030259  5042 status_update_manager.cpp:177] Pausing sending status updates
I0726 06:08:48.032232  5037 state.cpp:64] Recovering state from '/tmp/Endpoint_SlaveEndpointTest_UnauthorizedRequest_2_CGa64x/meta'
I0726 06:08:48.032958  5044 status_update_manager.cpp:203] Recovering status update manager
I0726 06:08:48.033203  5039 containerizer.cpp:582] Recovering containerizer
I0726 06:08:48.035315  5043 provisioner.cpp:416] Provisioner recovery complete
I0726 06:08:48.035861  5039 slave.cpp:6207] Finished recovery
I0726 06:08:48.036509  5039 slave.cpp:6389] Querying resource estimator for oversubscribable
resources
I0726 06:08:48.036828  5037 slave.cpp:6403] Received oversubscribable resources {} from the
resource estimator
I0726 06:08:48.040851  5040 process.cpp:3837] Handling HTTP event for process 'slave(799)'
with path: '/slave(799)/containers'
I0726 06:08:48.042950  5038 http.cpp:1133] HTTP GET for /slave(799)/containers from 172.17.0.2:57176
I0726 06:08:48.043114  5038 http.cpp:957] Authorizing principal 'test-principal' to GET the
'/containers' endpoint
I0726 06:08:48.046399  5044 slave.cpp:843] Agent terminating
[       OK ] Endpoint/SlaveEndpointTest.UnauthorizedRequest/2 (44 ms)
[ RUN      ] Endpoint/SlaveEndpointTest.NoAuthorizer/0
I0726 06:08:48.063891  5018 containerizer.cpp:230] Using isolation: posix/cpu,posix/mem,filesystem/posix,network/cni,environment_secret
W0726 06:08:48.064702  5018 backend.cpp:76] Failed to create 'overlay' backend: OverlayBackend
requires root privileges
W0726 06:08:48.064879  5018 backend.cpp:76] Failed to create 'bind' backend: BindBackend requires
root privileges
I0726 06:08:48.064924  5018 provisioner.cpp:255] Using default backend 'copy'
I0726 06:08:48.067320  5018 cluster.cpp:448] Creating default 'local' authorizer
I0726 06:08:48.070098  5043 slave.cpp:250] Mesos agent started on (800)@172.17.0.2:41079
I0726 06:08:48.070138  5043 slave.cpp:251] Flags at startup: --acls="" --appc_simple_discovery_uri_prefix="http://"
--appc_store_dir="/tmp/Endpoint_SlaveEndpointTest_NoAuthorizer_0_8VkSFk/store/appc" --authenticate_http_readonly="true"
--authenticate_http_readwrite="true" --authenticatee="crammd5" --authentication_backoff_factor="1secs"
--authorizer="local" --cgroups_cpu_enable_pids_and_tids_count="false" --cgroups_enable_cfs="false"
--cgroups_hierarchy="/sys/fs/cgroup" --cgroups_limit_swap="false" --cgroups_root="mesos" --container_disk_watch_interval="15secs"
--containerizers="mesos" --credential="/tmp/Endpoint_SlaveEndpointTest_NoAuthorizer_0_8VkSFk/credential"
--default_role="*" --disk_watch_interval="1mins" --docker="docker" --docker_kill_orphans="true"
--docker_registry="https://registry-1.docker.io" --docker_remove_delay="6hrs" --docker_socket="/var/run/docker.sock"
--docker_stop_timeout="0ns" --docker_store_dir="/tmp/Endpoint_SlaveEndpointTest_NoAuthorizer_0_8VkSFk/store/docker"
--docker_volume_checkpoint_dir="/var/run/mesos/isolators/docker/volume" --enforce_container_disk_quota="false"
--executor_registration_timeout="1mins" --executor_reregistration_timeout="2secs" --executor_shutdown_grace_period="5secs"
--fetcher_cache_dir="/tmp/Endpoint_SlaveEndpointTest_NoAuthorizer_0_8VkSFk/fetch" --fetcher_cache_size="2GB"
--frameworks_home="" --gc_delay="1weeks" --gc_disk_headroom="0.1" --hadoop_home="" --help="false"
--hostname_lookup="true" --http_command_executor="false" --http_credentials="/tmp/Endpoint_SlaveEndpointTest_NoAuthorizer_0_8VkSFk/http_credentials"
--http_heartbeat_interval="30secs" --initialize_driver_logging="true" --isolation="posix/cpu,posix/mem"
--launcher="posix" --launcher_dir="/mesos/mesos-1.4.0/_build/src" --logbufsecs="0" --logging_level="INFO"
--max_completed_executors_per_framework="150" --oversubscribed_resources_interval="15secs"
--perf_duration="10secs" --perf_interval="1mins" --port="5051" --qos_correction_interval_min="0ns"
--quiet="false" --recover="reconnect" --recovery_timeout="15mins" --registration_backoff_factor="10ms"
--resources="cpus:2;gpus:0;mem:1024;disk:1024;ports:[31000-32000]" --revocable_cpu_low_priority="true"
--runtime_dir="/tmp/Endpoint_SlaveEndpointTest_NoAuthorizer_0_8VkSFk" --sandbox_directory="/mnt/mesos/sandbox"
--strict="true" --switch_user="true" --systemd_enable_support="true" --systemd_runtime_directory="/run/systemd/system"
--version="false" --work_dir="/tmp/Endpoint_SlaveEndpointTest_NoAuthorizer_0_a24Qjn"
I0726 06:08:48.070946  5043 credentials.hpp:86] Loading credential for authentication from
'/tmp/Endpoint_SlaveEndpointTest_NoAuthorizer_0_8VkSFk/credential'
I0726 06:08:48.071274  5043 slave.cpp:283] Agent using credential for: test-principal
I0726 06:08:48.071311  5043 credentials.hpp:37] Loading credentials for authentication from
'/tmp/Endpoint_SlaveEndpointTest_NoAuthorizer_0_8VkSFk/http_credentials'
I0726 06:08:48.071774  5043 http.cpp:993] Creating default 'basic' HTTP authenticator for
realm 'mesos-agent-readonly'
I0726 06:08:48.072067  5043 http.cpp:993] Creating default 'basic' HTTP authenticator for
realm 'mesos-agent-readwrite'
I0726 06:08:48.074352  5043 slave.cpp:565] Agent resources: [{"name":"cpus","scalar":{"value":2.0},"type":"SCALAR"},{"name":"mem","scalar":{"value":1024.0},"type":"SCALAR"},{"name":"disk","scalar":{"value":1024.0},"type":"SCALAR"},{"name":"ports","ranges":{"range":[{"begin":31000,"end":32000}]},"type":"RANGES"}]
I0726 06:08:48.074785  5043 slave.cpp:573] Agent attributes: [  ]
I0726 06:08:48.074807  5043 slave.cpp:582] Agent hostname: 59839cae445a
I0726 06:08:48.075099  5044 status_update_manager.cpp:177] Pausing sending status updates
I0726 06:08:48.076980  5037 state.cpp:64] Recovering state from '/tmp/Endpoint_SlaveEndpointTest_NoAuthorizer_0_a24Qjn/meta'
I0726 06:08:48.077461  5040 status_update_manager.cpp:203] Recovering status update manager
I0726 06:08:48.077806  5042 containerizer.cpp:582] Recovering containerizer
I0726 06:08:48.079845  5038 provisioner.cpp:416] Provisioner recovery complete
I0726 06:08:48.080552  5043 slave.cpp:6207] Finished recovery
I0726 06:08:48.081173  5043 slave.cpp:6389] Querying resource estimator for oversubscribable
resources
I0726 06:08:48.081603  5042 slave.cpp:6403] Received oversubscribable resources {} from the
resource estimator
I0726 06:08:48.086001  5042 process.cpp:3837] Handling HTTP event for process 'slave(800)'
with path: '/slave(800)/monitor/statistics'
I0726 06:08:48.087947  5041 http.cpp:1133] HTTP GET for /slave(800)/monitor/statistics from
172.17.0.2:57178
I0726 06:08:48.088073  5041 http.cpp:957] Authorizing principal 'test-principal' to GET the
'/monitor/statistics' endpoint
I0726 06:08:48.093287  5040 slave.cpp:843] Agent terminating
[       OK ] Endpoint/SlaveEndpointTest.NoAuthorizer/0 (46 ms)
[ RUN      ] Endpoint/SlaveEndpointTest.NoAuthorizer/1
I0726 06:08:48.110461  5018 containerizer.cpp:230] Using isolation: posix/cpu,posix/mem,filesystem/posix,network/cni,environment_secret
W0726 06:08:48.111368  5018 backend.cpp:76] Failed to create 'overlay' backend: OverlayBackend
requires root privileges
W0726 06:08:48.111546  5018 backend.cpp:76] Failed to create 'bind' backend: BindBackend requires
root privileges
I0726 06:08:48.111675  5018 provisioner.cpp:255] Using default backend 'copy'
I0726 06:08:48.114292  5018 cluster.cpp:448] Creating default 'local' authorizer
I0726 06:08:48.117152  5038 slave.cpp:250] Mesos agent started on (801)@172.17.0.2:41079
I0726 06:08:48.117246  5038 slave.cpp:251] Flags at startup: --acls="" --appc_simple_discovery_uri_prefix="http://"
--appc_store_dir="/tmp/Endpoint_SlaveEndpointTest_NoAuthorizer_1_md6Dva/store/appc" --authenticate_http_readonly="true"
--authenticate_http_readwrite="true" --authenticatee="crammd5" --authentication_backoff_factor="1secs"
--authorizer="local" --cgroups_cpu_enable_pids_and_tids_count="false" --cgroups_enable_cfs="false"
--cgroups_hierarchy="/sys/fs/cgroup" --cgroups_limit_swap="false" --cgroups_root="mesos" --container_disk_watch_interval="15secs"
--containerizers="mesos" --credential="/tmp/Endpoint_SlaveEndpointTest_NoAuthorizer_1_md6Dva/credential"
--default_role="*" --disk_watch_interval="1mins" --docker="docker" --docker_kill_orphans="true"
--docker_registry="https://registry-1.docker.io" --docker_remove_delay="6hrs" --docker_socket="/var/run/docker.sock"
--docker_stop_timeout="0ns" --docker_store_dir="/tmp/Endpoint_SlaveEndpointTest_NoAuthorizer_1_md6Dva/store/docker"
--docker_volume_checkpoint_dir="/var/run/mesos/isolators/docker/volume" --enforce_container_disk_quota="false"
--executor_registration_timeout="1mins" --executor_reregistration_timeout="2secs" --executor_shutdown_grace_period="5secs"
--fetcher_cache_dir="/tmp/Endpoint_SlaveEndpointTest_NoAuthorizer_1_md6Dva/fetch" --fetcher_cache_size="2GB"
--frameworks_home="" --gc_delay="1weeks" --gc_disk_headroom="0.1" --hadoop_home="" --help="false"
--hostname_lookup="true" --http_command_executor="false" --http_credentials="/tmp/Endpoint_SlaveEndpointTest_NoAuthorizer_1_md6Dva/http_credentials"
--http_heartbeat_interval="30secs" --initialize_driver_logging="true" --isolation="posix/cpu,posix/mem"
--launcher="posix" --launcher_dir="/mesos/mesos-1.4.0/_build/src" --logbufsecs="0" --logging_level="INFO"
--max_completed_executors_per_framework="150" --oversubscribed_resources_interval="15secs"
--perf_duration="10secs" --perf_interval="1mins" --port="5051" --qos_correction_interval_min="0ns"
--quiet="false" --recover="reconnect" --recovery_timeout="15mins" --registration_backoff_factor="10ms"
--resources="cpus:2;gpus:0;mem:1024;disk:1024;ports:[31000-32000]" --revocable_cpu_low_priority="true"
--runtime_dir="/tmp/Endpoint_SlaveEndpointTest_NoAuthorizer_1_md6Dva" --sandbox_directory="/mnt/mesos/sandbox"
--strict="true" --switch_user="true" --systemd_enable_support="true" --systemd_runtime_directory="/run/systemd/system"
--version="false" --work_dir="/tmp/Endpoint_SlaveEndpointTest_NoAuthorizer_1_sFA41c"
I0726 06:08:48.118157  5038 credentials.hpp:86] Loading credential for authentication from
'/tmp/Endpoint_SlaveEndpointTest_NoAuthorizer_1_md6Dva/credential'
I0726 06:08:48.118455  5038 slave.cpp:283] Agent using credential for: test-principal
I0726 06:08:48.118487  5038 credentials.hpp:37] Loading credentials for authentication from
'/tmp/Endpoint_SlaveEndpointTest_NoAuthorizer_1_md6Dva/http_credentials'
I0726 06:08:48.118916  5038 http.cpp:993] Creating default 'basic' HTTP authenticator for
realm 'mesos-agent-readonly'
I0726 06:08:48.119182  5038 http.cpp:993] Creating default 'basic' HTTP authenticator for
realm 'mesos-agent-readwrite'
I0726 06:08:48.121393  5038 slave.cpp:565] Agent resources: [{"name":"cpus","scalar":{"value":2.0},"type":"SCALAR"},{"name":"mem","scalar":{"value":1024.0},"type":"SCALAR"},{"name":"disk","scalar":{"value":1024.0},"type":"SCALAR"},{"name":"ports","ranges":{"range":[{"begin":31000,"end":32000}]},"type":"RANGES"}]
I0726 06:08:48.121824  5038 slave.cpp:573] Agent attributes: [  ]
I0726 06:08:48.121913  5038 slave.cpp:582] Agent hostname: 59839cae445a
I0726 06:08:48.122202  5039 status_update_manager.cpp:177] Pausing sending status updates
I0726 06:08:48.124136  5042 state.cpp:64] Recovering state from '/tmp/Endpoint_SlaveEndpointTest_NoAuthorizer_1_sFA41c/meta'
I0726 06:08:48.124768  5040 status_update_manager.cpp:203] Recovering status update manager
I0726 06:08:48.125162  5037 containerizer.cpp:582] Recovering containerizer
I0726 06:08:48.127308  5040 provisioner.cpp:416] Provisioner recovery complete
I0726 06:08:48.127948  5038 slave.cpp:6207] Finished recovery
I0726 06:08:48.128628  5038 slave.cpp:6389] Querying resource estimator for oversubscribable
resources
I0726 06:08:48.129034  5044 slave.cpp:6403] Received oversubscribable resources {} from the
resource estimator
I0726 06:08:48.132925  5039 process.cpp:3837] Handling HTTP event for process 'slave(801)'
with path: '/slave(801)/monitor/statistics.json'
I0726 06:08:48.134894  5041 http.cpp:1133] HTTP GET for /slave(801)/monitor/statistics.json
from 172.17.0.2:57180
I0726 06:08:48.135018  5041 http.cpp:957] Authorizing principal 'test-principal' to GET the
'/monitor/statistics.json' endpoint
I0726 06:08:48.140800  5018 slave.cpp:843] Agent terminating
[       OK ] Endpoint/SlaveEndpointTest.NoAuthorizer/1 (47 ms)
[ RUN      ] Endpoint/SlaveEndpointTest.NoAuthorizer/2
I0726 06:08:48.157995  5018 containerizer.cpp:230] Using isolation: posix/cpu,posix/mem,filesystem/posix,network/cni,environment_secret
W0726 06:08:48.158896  5018 backend.cpp:76] Failed to create 'overlay' backend: OverlayBackend
requires root privileges
W0726 06:08:48.159073  5018 backend.cpp:76] Failed to create 'bind' backend: BindBackend requires
root privileges
I0726 06:08:48.159193  5018 provisioner.cpp:255] Using default backend 'copy'
I0726 06:08:48.161667  5018 cluster.cpp:448] Creating default 'local' authorizer
I0726 06:08:48.164522  5038 slave.cpp:250] Mesos agent started on (802)@172.17.0.2:41079
I0726 06:08:48.164563  5038 slave.cpp:251] Flags at startup: --acls="" --appc_simple_discovery_uri_prefix="http://"
--appc_store_dir="/tmp/Endpoint_SlaveEndpointTest_NoAuthorizer_2_iprbQ0/store/appc" --authenticate_http_readonly="true"
--authenticate_http_readwrite="true" --authenticatee="crammd5" --authentication_backoff_factor="1secs"
--authorizer="local" --cgroups_cpu_enable_pids_and_tids_count="false" --cgroups_enable_cfs="false"
--cgroups_hierarchy="/sys/fs/cgroup" --cgroups_limit_swap="false" --cgroups_root="mesos" --container_disk_watch_interval="15secs"
--containerizers="mesos" --credential="/tmp/Endpoint_SlaveEndpointTest_NoAuthorizer_2_iprbQ0/credential"
--default_role="*" --disk_watch_interval="1mins" --docker="docker" --docker_kill_orphans="true"
--docker_registry="https://registry-1.docker.io" --docker_remove_delay="6hrs" --docker_socket="/var/run/docker.sock"
--docker_stop_timeout="0ns" --docker_store_dir="/tmp/Endpoint_SlaveEndpointTest_NoAuthorizer_2_iprbQ0/store/docker"
--docker_volume_checkpoint_dir="/var/run/mesos/isolators/docker/volume" --enforce_container_disk_quota="false"
--executor_registration_timeout="1mins" --executor_reregistration_timeout="2secs" --executor_shutdown_grace_period="5secs"
--fetcher_cache_dir="/tmp/Endpoint_SlaveEndpointTest_NoAuthorizer_2_iprbQ0/fetch" --fetcher_cache_size="2GB"
--frameworks_home="" --gc_delay="1weeks" --gc_disk_headroom="0.1" --hadoop_home="" --help="false"
--hostname_lookup="true" --http_command_executor="false" --http_credentials="/tmp/Endpoint_SlaveEndpointTest_NoAuthorizer_2_iprbQ0/http_credentials"
--http_heartbeat_interval="30secs" --initialize_driver_logging="true" --isolation="posix/cpu,posix/mem"
--launcher="posix" --launcher_dir="/mesos/mesos-1.4.0/_build/src" --logbufsecs="0" --logging_level="INFO"
--max_completed_executors_per_framework="150" --oversubscribed_resources_interval="15secs"
--perf_duration="10secs" --perf_interval="1mins" --port="5051" --qos_correction_interval_min="0ns"
--quiet="false" --recover="reconnect" --recovery_timeout="15mins" --registration_backoff_factor="10ms"
--resources="cpus:2;gpus:0;mem:1024;disk:1024;ports:[31000-32000]" --revocable_cpu_low_priority="true"
--runtime_dir="/tmp/Endpoint_SlaveEndpointTest_NoAuthorizer_2_iprbQ0" --sandbox_directory="/mnt/mesos/sandbox"
--strict="true" --switch_user="true" --systemd_enable_support="true" --systemd_runtime_directory="/run/systemd/system"
--version="false" --work_dir="/tmp/Endpoint_SlaveEndpointTest_NoAuthorizer_2_mS8Ue3"
I0726 06:08:48.165325  5038 credentials.hpp:86] Loading credential for authentication from
'/tmp/Endpoint_SlaveEndpointTest_NoAuthorizer_2_iprbQ0/credential'
I0726 06:08:48.165666  5038 slave.cpp:283] Agent using credential for: test-principal
I0726 06:08:48.165740  5038 credentials.hpp:37] Loading credentials for authentication from
'/tmp/Endpoint_SlaveEndpointTest_NoAuthorizer_2_iprbQ0/http_credentials'
I0726 06:08:48.166155  5038 http.cpp:993] Creating default 'basic' HTTP authenticator for
realm 'mesos-agent-readonly'
I0726 06:08:48.166419  5038 http.cpp:993] Creating default 'basic' HTTP authenticator for
realm 'mesos-agent-readwrite'
I0726 06:08:48.168658  5038 slave.cpp:565] Agent resources: [{"name":"cpus","scalar":{"value":2.0},"type":"SCALAR"},{"name":"mem","scalar":{"value":1024.0},"type":"SCALAR"},{"name":"disk","scalar":{"value":1024.0},"type":"SCALAR"},{"name":"ports","ranges":{"range":[{"begin":31000,"end":32000}]},"type":"RANGES"}]
I0726 06:08:48.169159  5038 slave.cpp:573] Agent attributes: [  ]
I0726 06:08:48.169181  5038 slave.cpp:582] Agent hostname: 59839cae445a
I0726 06:08:48.169486  5037 status_update_manager.cpp:177] Pausing sending status updates
I0726 06:08:48.171272  5040 state.cpp:64] Recovering state from '/tmp/Endpoint_SlaveEndpointTest_NoAuthorizer_2_mS8Ue3/meta'
I0726 06:08:48.171830  5037 status_update_manager.cpp:203] Recovering status update manager
I0726 06:08:48.172143  5037 containerizer.cpp:582] Recovering containerizer
I0726 06:08:48.174679  5039 provisioner.cpp:416] Provisioner recovery complete
I0726 06:08:48.175253  5039 slave.cpp:6207] Finished recovery
I0726 06:08:48.175873  5039 slave.cpp:6389] Querying resource estimator for oversubscribable
resources
I0726 06:08:48.176255  5044 slave.cpp:6403] Received oversubscribable resources {} from the
resource estimator
I0726 06:08:48.180063  5040 process.cpp:3837] Handling HTTP event for process 'slave(802)'
with path: '/slave(802)/containers'
I0726 06:08:48.182060  5044 http.cpp:1133] HTTP GET for /slave(802)/containers from 172.17.0.2:57182
I0726 06:08:48.182188  5044 http.cpp:957] Authorizing principal 'test-principal' to GET the
'/containers' endpoint
I0726 06:08:48.188767  5018 slave.cpp:843] Agent terminating
[       OK ] Endpoint/SlaveEndpointTest.NoAuthorizer/2 (48 ms)
[----------] 9 tests from Endpoint/SlaveEndpointTest (415 ms total)

[----------] Global test environment tear-down
[==========] 1639 tests from 179 test cases ran. (716014 ms total)
[  PASSED  ] 1635 tests.
[  FAILED  ] 4 tests, listed below:
[  FAILED  ] DefaultExecutorCheckTest.CommandCheckDeliveredAndReconciled
[  FAILED  ] DefaultExecutorCheckTest.CommandCheckStatusChange
[  FAILED  ] DefaultExecutorCheckTest.CommandCheckSeesParentsEnv
[  FAILED  ] DefaultExecutorCheckTest.CommandCheckSharesWorkDirWithTask

 4 FAILED TESTS
  YOU HAVE 20 DISABLED TESTS

I0726 06:08:48.333621  5045 process.cpp:1006] Failed to accept socket: future discarded
make[4]: *** [check-local] Error 1
make[4]: Leaving directory `/mesos/mesos-1.4.0/_build/src'
make[3]: *** [check-am] Error 2
make[3]: Leaving directory `/mesos/mesos-1.4.0/_build/src'
make[2]: *** [check] Error 2
make[2]: Leaving directory `/mesos/mesos-1.4.0/_build/src'
make[1]: *** [check-recursive] Error 1
make[1]: Leaving directory `/mesos/mesos-1.4.0/_build'
make: *** [distcheck] Error 1
+ docker rmi mesos-1501043681-31456
Untagged: mesos-1501043681-31456:latest
Deleted: sha256:c57f3313b28cc2ef0825858dc6d8411dd3ed40369f025153889cd8059f9e08cc
Deleted: sha256:c5460ea5f3fa81126bec89de3e12a26e71d52fadff83a8130c05acc621187e74
Deleted: sha256:1a69ef1cef02e45c6c7ca7aa31b1761c7e64754fafebcf097a1dbeafac3e4ece
Deleted: sha256:2926ee34468049e07cabe76108d7ae935c648396b190d087c2d0defaefc63ece
Deleted: sha256:26a0f9c7da7ef7943b187dbfb9ff56ae08b1dffa4f038e25d9fa0a96f88184a6
Deleted: sha256:75c940054ac45829c2f0b56ecfdc255ba61f96c473f7e2609764fa456a9e4abc
Deleted: sha256:3b82429a5aab9524bcd89f64cf35613d8a34c2a0c8341c02ef57fcfa039e0f92
Deleted: sha256:6005559135af59453ea9b3779a262c25a161ca642b0f42a8e2d66f2e1faa8e51
Deleted: sha256:d119e3ad60576f14dba763a11b61967257ffd26107bba3ea6956a111428d649c
Deleted: sha256:ae1d2f42ef5585f7e0d9f8a5dbb9b9812735707934b95feb6c087544da016301
Deleted: sha256:778e8f1157522e772cf01de834f0b41b90207247310565f26bc89d29334a65a7
Deleted: sha256:b7ea9d79ae4f9d98e3dd2a50b0797ab3b10bffcc28e20d4431a4ec75979d4ad4
Deleted: sha256:9ac7eae2fcb0d404158407aac8a36687b3721659aeaf7d58bf4b5b577be1c909
Deleted: sha256:7fd9b6e2a9ceafc66c0ae15193848cf89dc34341e46bae722b26c4a03db3ddc2
Deleted: sha256:835c452cdec3aa050349d09837086cf34d74ce690426c00c487deb731a2bee57
Deleted: sha256:57a401603bd80c9c3af74e859515b740cc8b2cd45062e4925afdfb171a5dfd67
Deleted: sha256:fbbf1c1e9ced5caeebc0b4f47959c125c9c66ec95836315a94022e0cc7d7e3fe
Deleted: sha256:4ee4fdc07331b2d203a7ffd12119619fb751e46fee16fe3b8583904105b21618
Deleted: sha256:0724b375fc00e64aee84cf18166e8d7763d8fb00ad7cc8d08e4c9ef8fbf9d2f8
Deleted: sha256:9244da96736d595861cea6228ed84d27fdc9c35c713ed436e00fa0224cab6853
Deleted: sha256:0e0ea547fbb55dbcc6857dbec98e1186f66d18c361cc90095c29ada4f9f36307
Deleted: sha256:ab4e33bbb1ef1bb7e0b18394f6e29c58dc685fda0a070a2e089ddf6c5eaf042a
Deleted: sha256:0290108fbb8937afd5b9f31a736d19d4bb4a94e7507c9fe9d2861136dff525c5
Deleted: sha256:ea46896f739ad84d3119df7660db5c1d6f27bf44a890cc969d1523aa3128ee6e
Build step 'Execute shell' marked build as failure

Mime
View raw message