mesos-builds mailing list archives

Site index · List index
Message view « Date » · « Thread »
Top « Date » · « Thread »
From Apache Jenkins Server <jenk...@builds.apache.org>
Subject Build failed in Jenkins: Mesos-Reviewbot #18471
Date Mon, 10 Jul 2017 18:24:03 GMT
See <https://builds.apache.org/job/Mesos-Reviewbot/18471/display/redirect?page=changes>

Changes:

[toenshoff] Fixes broken link in docs.

------------------------------------------
[...truncated 29.94 MB...]
I0710 18:23:51.001299  4967 containerizer.cpp:230] Using isolation: posix/cpu,posix/mem,filesystem/posix,network/cni,environment_secret
W0710 18:23:51.002115  4967 backend.cpp:76] Failed to create 'overlay' backend: OverlayBackend
requires root privileges
W0710 18:23:51.002300  4967 backend.cpp:76] Failed to create 'bind' backend: BindBackend requires
root privileges
I0710 18:23:51.002349  4967 provisioner.cpp:255] Using default backend 'copy'
I0710 18:23:51.011678  4987 slave.cpp:250] Mesos agent started on (778)@172.17.0.3:40757
I0710 18:23:51.012025  4987 slave.cpp:251] Flags at startup: --acls="" --appc_simple_discovery_uri_prefix="http://"
--appc_store_dir="/tmp/Endpoint_SlaveEndpointTest_AuthorizedRequest_2_1KhCWt/store/appc" --authenticate_http_readonly="true"
--authenticate_http_readwrite="true" --authenticatee="crammd5" --authentication_backoff_factor="1secs"
--authorizer="local" --cgroups_cpu_enable_pids_and_tids_count="false" --cgroups_enable_cfs="false"
--cgroups_hierarchy="/sys/fs/cgroup" --cgroups_limit_swap="false" --cgroups_root="mesos" --container_disk_watch_interval="15secs"
--containerizers="mesos" --credential="/tmp/Endpoint_SlaveEndpointTest_AuthorizedRequest_2_1KhCWt/credential"
--default_role="*" --disk_watch_interval="1mins" --docker="docker" --docker_kill_orphans="true"
--docker_registry="https://registry-1.docker.io" --docker_remove_delay="6hrs" --docker_socket="/var/run/docker.sock"
--docker_stop_timeout="0ns" --docker_store_dir="/tmp/Endpoint_SlaveEndpointTest_AuthorizedRequest_2_1KhCWt/store/docker"
--docker_volume_checkpoint_dir="/var/run/mesos/isolators/docker/volume" --enforce_container_disk_quota="false"
--executor_registration_timeout="1mins" --executor_reregistration_timeout="2secs" --executor_shutdown_grace_period="5secs"
--fetcher_cache_dir="/tmp/Endpoint_SlaveEndpointTest_AuthorizedRequest_2_1KhCWt/fetch" --fetcher_cache_size="2GB"
--frameworks_home="" --gc_delay="1weeks" --gc_disk_headroom="0.1" --hadoop_home="" --help="false"
--hostname_lookup="true" --http_command_executor="false" --http_credentials="/tmp/Endpoint_SlaveEndpointTest_AuthorizedRequest_2_1KhCWt/http_credentials"
--http_heartbeat_interval="30secs" --initialize_driver_logging="true" --isolation="posix/cpu,posix/mem"
--launcher="posix" --launcher_dir="/mesos/mesos-1.4.0/_build/src" --logbufsecs="0" --logging_level="INFO"
--max_completed_executors_per_framework="150" --oversubscribed_resources_interval="15secs"
--perf_duration="10secs" --perf_interval="1mins" --port="5051" --qos_correction_interval_min="0ns"
--quiet="false" --recover="reconnect" --recovery_timeout="15mins" --registration_backoff_factor="10ms"
--resources="cpus:2;gpus:0;mem:1024;disk:1024;ports:[31000-32000]" --revocable_cpu_low_priority="true"
--runtime_dir="/tmp/Endpoint_SlaveEndpointTest_AuthorizedRequest_2_1KhCWt" --sandbox_directory="/mnt/mesos/sandbox"
--strict="true" --switch_user="true" --systemd_enable_support="true" --systemd_runtime_directory="/run/systemd/system"
--version="false" --work_dir="/tmp/Endpoint_SlaveEndpointTest_AuthorizedRequest_2_eBTJSx"
I0710 18:23:51.013662  4987 credentials.hpp:86] Loading credential for authentication from
'/tmp/Endpoint_SlaveEndpointTest_AuthorizedRequest_2_1KhCWt/credential'
I0710 18:23:51.014140  4987 slave.cpp:283] Agent using credential for: test-principal
I0710 18:23:51.014205  4987 credentials.hpp:37] Loading credentials for authentication from
'/tmp/Endpoint_SlaveEndpointTest_AuthorizedRequest_2_1KhCWt/http_credentials'
I0710 18:23:51.014771  4987 http.cpp:976] Creating default 'basic' HTTP authenticator for
realm 'mesos-agent-readonly'
I0710 18:23:51.015136  4987 http.cpp:976] Creating default 'basic' HTTP authenticator for
realm 'mesos-agent-readwrite'
I0710 18:23:51.017645  4987 slave.cpp:565] Agent resources: [{"name":"cpus","scalar":{"value":2.0},"type":"SCALAR"},{"name":"mem","scalar":{"value":1024.0},"type":"SCALAR"},{"name":"disk","scalar":{"value":1024.0},"type":"SCALAR"},{"name":"ports","ranges":{"range":[{"begin":31000,"end":32000}]},"type":"RANGES"}]
I0710 18:23:51.018292  4987 slave.cpp:573] Agent attributes: [  ]
I0710 18:23:51.018379  4987 slave.cpp:578] Agent hostname: 8a0877099835
I0710 18:23:51.018829  4986 status_update_manager.cpp:177] Pausing sending status updates
I0710 18:23:51.024345  4987 state.cpp:64] Recovering state from '/tmp/Endpoint_SlaveEndpointTest_AuthorizedRequest_2_eBTJSx/meta'
I0710 18:23:51.027422  4987 status_update_manager.cpp:203] Recovering status update manager
I0710 18:23:51.027673  4987 containerizer.cpp:582] Recovering containerizer
I0710 18:23:51.030653  4991 provisioner.cpp:416] Provisioner recovery complete
I0710 18:23:51.031536  4991 slave.cpp:6203] Finished recovery
I0710 18:23:51.032287  4991 slave.cpp:6385] Querying resource estimator for oversubscribable
resources
I0710 18:23:51.033226  4991 slave.cpp:6399] Received oversubscribable resources {} from the
resource estimator
I0710 18:23:51.059778  4986 process.cpp:3820] Handling HTTP event for process 'slave(778)'
with path: '/slave(778)/containers'
I0710 18:23:51.062899  4986 http.cpp:1116] HTTP GET for /slave(778)/containers from 172.17.0.3:58178
I0710 18:23:51.063030  4986 http.cpp:937] Authorizing principal 'test-principal' to GET the
'/containers' endpoint
I0710 18:23:51.082551  4967 slave.cpp:839] Agent terminating
[       OK ] Endpoint/SlaveEndpointTest.AuthorizedRequest/2 (107 ms)
[ RUN      ] Endpoint/SlaveEndpointTest.UnauthorizedRequest/0
I0710 18:23:51.109210  4967 containerizer.cpp:230] Using isolation: posix/cpu,posix/mem,filesystem/posix,network/cni,environment_secret
W0710 18:23:51.110426  4967 backend.cpp:76] Failed to create 'overlay' backend: OverlayBackend
requires root privileges
W0710 18:23:51.110908  4967 backend.cpp:76] Failed to create 'bind' backend: BindBackend requires
root privileges
I0710 18:23:51.110987  4967 provisioner.cpp:255] Using default backend 'copy'
I0710 18:23:51.120074  4990 slave.cpp:250] Mesos agent started on (779)@172.17.0.3:40757
I0710 18:23:51.120121  4990 slave.cpp:251] Flags at startup: --acls="" --appc_simple_discovery_uri_prefix="http://"
--appc_store_dir="/tmp/Endpoint_SlaveEndpointTest_UnauthorizedRequest_0_dxi06e/store/appc"
--authenticate_http_readonly="true" --authenticate_http_readwrite="true" --authenticatee="crammd5"
--authentication_backoff_factor="1secs" --authorizer="local" --cgroups_cpu_enable_pids_and_tids_count="false"
--cgroups_enable_cfs="false" --cgroups_hierarchy="/sys/fs/cgroup" --cgroups_limit_swap="false"
--cgroups_root="mesos" --container_disk_watch_interval="15secs" --containerizers="mesos" --credential="/tmp/Endpoint_SlaveEndpointTest_UnauthorizedRequest_0_dxi06e/credential"
--default_role="*" --disk_watch_interval="1mins" --docker="docker" --docker_kill_orphans="true"
--docker_registry="https://registry-1.docker.io" --docker_remove_delay="6hrs" --docker_socket="/var/run/docker.sock"
--docker_stop_timeout="0ns" --docker_store_dir="/tmp/Endpoint_SlaveEndpointTest_UnauthorizedRequest_0_dxi06e/store/docker"
--docker_volume_checkpoint_dir="/var/run/mesos/isolators/docker/volume" --enforce_container_disk_quota="false"
--executor_registration_timeout="1mins" --executor_reregistration_timeout="2secs" --executor_shutdown_grace_period="5secs"
--fetcher_cache_dir="/tmp/Endpoint_SlaveEndpointTest_UnauthorizedRequest_0_dxi06e/fetch" --fetcher_cache_size="2GB"
--frameworks_home="" --gc_delay="1weeks" --gc_disk_headroom="0.1" --hadoop_home="" --help="false"
--hostname_lookup="true" --http_command_executor="false" --http_credentials="/tmp/Endpoint_SlaveEndpointTest_UnauthorizedRequest_0_dxi06e/http_credentials"
--http_heartbeat_interval="30secs" --initialize_driver_logging="true" --isolation="posix/cpu,posix/mem"
--launcher="posix" --launcher_dir="/mesos/mesos-1.4.0/_build/src" --logbufsecs="0" --logging_level="INFO"
--max_completed_executors_per_framework="150" --oversubscribed_resources_interval="15secs"
--perf_duration="10secs" --perf_interval="1mins" --port="5051" --qos_correction_interval_min="0ns"
--quiet="false" --recover="reconnect" --recovery_timeout="15mins" --registration_backoff_factor="10ms"
--resources="cpus:2;gpus:0;mem:1024;disk:1024;ports:[31000-32000]" --revocable_cpu_low_priority="true"
--runtime_dir="/tmp/Endpoint_SlaveEndpointTest_UnauthorizedRequest_0_dxi06e" --sandbox_directory="/mnt/mesos/sandbox"
--strict="true" --switch_user="true" --systemd_enable_support="true" --systemd_runtime_directory="/run/systemd/system"
--version="false" --work_dir="/tmp/Endpoint_SlaveEndpointTest_UnauthorizedRequest_0_UmYQLi"
I0710 18:23:51.121644  4990 credentials.hpp:86] Loading credential for authentication from
'/tmp/Endpoint_SlaveEndpointTest_UnauthorizedRequest_0_dxi06e/credential'
I0710 18:23:51.122153  4990 slave.cpp:283] Agent using credential for: test-principal
I0710 18:23:51.122256  4990 credentials.hpp:37] Loading credentials for authentication from
'/tmp/Endpoint_SlaveEndpointTest_UnauthorizedRequest_0_dxi06e/http_credentials'
I0710 18:23:51.122872  4990 http.cpp:976] Creating default 'basic' HTTP authenticator for
realm 'mesos-agent-readonly'
I0710 18:23:51.123805  4990 http.cpp:976] Creating default 'basic' HTTP authenticator for
realm 'mesos-agent-readwrite'
I0710 18:23:51.126567  4990 slave.cpp:565] Agent resources: [{"name":"cpus","scalar":{"value":2.0},"type":"SCALAR"},{"name":"mem","scalar":{"value":1024.0},"type":"SCALAR"},{"name":"disk","scalar":{"value":1024.0},"type":"SCALAR"},{"name":"ports","ranges":{"range":[{"begin":31000,"end":32000}]},"type":"RANGES"}]
I0710 18:23:51.127684  4990 slave.cpp:573] Agent attributes: [  ]
I0710 18:23:51.128047  4990 slave.cpp:578] Agent hostname: 8a0877099835
I0710 18:23:51.128513  4992 status_update_manager.cpp:177] Pausing sending status updates
I0710 18:23:51.131361  4988 state.cpp:64] Recovering state from '/tmp/Endpoint_SlaveEndpointTest_UnauthorizedRequest_0_UmYQLi/meta'
I0710 18:23:51.132194  4989 status_update_manager.cpp:203] Recovering status update manager
I0710 18:23:51.132807  4986 containerizer.cpp:582] Recovering containerizer
I0710 18:23:51.135552  4992 provisioner.cpp:416] Provisioner recovery complete
I0710 18:23:51.136386  4986 slave.cpp:6203] Finished recovery
I0710 18:23:51.137454  4986 slave.cpp:6385] Querying resource estimator for oversubscribable
resources
I0710 18:23:51.137984  4986 slave.cpp:6399] Received oversubscribable resources {} from the
resource estimator
I0710 18:23:51.145318  4989 process.cpp:3820] Handling HTTP event for process 'slave(779)'
with path: '/slave(779)/monitor/statistics'
I0710 18:23:51.148099  4989 http.cpp:1116] HTTP GET for /slave(779)/monitor/statistics from
172.17.0.3:58182
I0710 18:23:51.148329  4989 http.cpp:937] Authorizing principal 'test-principal' to GET the
'/monitor/statistics' endpoint
I0710 18:23:51.153916  4967 slave.cpp:839] Agent terminating
[       OK ] Endpoint/SlaveEndpointTest.UnauthorizedRequest/0 (66 ms)
[ RUN      ] Endpoint/SlaveEndpointTest.UnauthorizedRequest/1
I0710 18:23:51.177563  4967 containerizer.cpp:230] Using isolation: posix/cpu,posix/mem,filesystem/posix,network/cni,environment_secret
W0710 18:23:51.180147  4967 backend.cpp:76] Failed to create 'overlay' backend: OverlayBackend
requires root privileges
W0710 18:23:51.180667  4967 backend.cpp:76] Failed to create 'bind' backend: BindBackend requires
root privileges
I0710 18:23:51.180763  4967 provisioner.cpp:255] Using default backend 'copy'
I0710 18:23:51.193414  4993 slave.cpp:250] Mesos agent started on (780)@172.17.0.3:40757
I0710 18:23:51.193465  4993 slave.cpp:251] Flags at startup: --acls="" --appc_simple_discovery_uri_prefix="http://"
--appc_store_dir="/tmp/Endpoint_SlaveEndpointTest_UnauthorizedRequest_1_xrJO40/store/appc"
--authenticate_http_readonly="true" --authenticate_http_readwrite="true" --authenticatee="crammd5"
--authentication_backoff_factor="1secs" --authorizer="local" --cgroups_cpu_enable_pids_and_tids_count="false"
--cgroups_enable_cfs="false" --cgroups_hierarchy="/sys/fs/cgroup" --cgroups_limit_swap="false"
--cgroups_root="mesos" --container_disk_watch_interval="15secs" --containerizers="mesos" --credential="/tmp/Endpoint_SlaveEndpointTest_UnauthorizedRequest_1_xrJO40/credential"
--default_role="*" --disk_watch_interval="1mins" --docker="docker" --docker_kill_orphans="true"
--docker_registry="https://registry-1.docker.io" --docker_remove_delay="6hrs" --docker_socket="/var/run/docker.sock"
--docker_stop_timeout="0ns" --docker_store_dir="/tmp/Endpoint_SlaveEndpointTest_UnauthorizedRequest_1_xrJO40/store/docker"
--docker_volume_checkpoint_dir="/var/run/mesos/isolators/docker/volume" --enforce_container_disk_quota="false"
--executor_registration_timeout="1mins" --executor_reregistration_timeout="2secs" --executor_shutdown_grace_period="5secs"
--fetcher_cache_dir="/tmp/Endpoint_SlaveEndpointTest_UnauthorizedRequest_1_xrJO40/fetch" --fetcher_cache_size="2GB"
--frameworks_home="" --gc_delay="1weeks" --gc_disk_headroom="0.1" --hadoop_home="" --help="false"
--hostname_lookup="true" --http_command_executor="false" --http_credentials="/tmp/Endpoint_SlaveEndpointTest_UnauthorizedRequest_1_xrJO40/http_credentials"
--http_heartbeat_interval="30secs" --initialize_driver_logging="true" --isolation="posix/cpu,posix/mem"
--launcher="posix" --launcher_dir="/mesos/mesos-1.4.0/_build/src" --logbufsecs="0" --logging_level="INFO"
--max_completed_executors_per_framework="150" --oversubscribed_resources_interval="15secs"
--perf_duration="10secs" --perf_interval="1mins" --port="5051" --qos_correction_interval_min="0ns"
--quiet="false" --recover="reconnect" --recovery_timeout="15mins" --registration_backoff_factor="10ms"
--resources="cpus:2;gpus:0;mem:1024;disk:1024;ports:[31000-32000]" --revocable_cpu_low_priority="true"
--runtime_dir="/tmp/Endpoint_SlaveEndpointTest_UnauthorizedRequest_1_xrJO40" --sandbox_directory="/mnt/mesos/sandbox"
--strict="true" --switch_user="true" --systemd_enable_support="true" --systemd_runtime_directory="/run/systemd/system"
--version="false" --work_dir="/tmp/Endpoint_SlaveEndpointTest_UnauthorizedRequest_1_47sRy4"
I0710 18:23:51.194609  4993 credentials.hpp:86] Loading credential for authentication from
'/tmp/Endpoint_SlaveEndpointTest_UnauthorizedRequest_1_xrJO40/credential'
I0710 18:23:51.195024  4993 slave.cpp:283] Agent using credential for: test-principal
I0710 18:23:51.195070  4993 credentials.hpp:37] Loading credentials for authentication from
'/tmp/Endpoint_SlaveEndpointTest_UnauthorizedRequest_1_xrJO40/http_credentials'
I0710 18:23:51.195641  4993 http.cpp:976] Creating default 'basic' HTTP authenticator for
realm 'mesos-agent-readonly'
I0710 18:23:51.196068  4993 http.cpp:976] Creating default 'basic' HTTP authenticator for
realm 'mesos-agent-readwrite'
I0710 18:23:51.198703  4993 slave.cpp:565] Agent resources: [{"name":"cpus","scalar":{"value":2.0},"type":"SCALAR"},{"name":"mem","scalar":{"value":1024.0},"type":"SCALAR"},{"name":"disk","scalar":{"value":1024.0},"type":"SCALAR"},{"name":"ports","ranges":{"range":[{"begin":31000,"end":32000}]},"type":"RANGES"}]
I0710 18:23:51.199180  4993 slave.cpp:573] Agent attributes: [  ]
I0710 18:23:51.199209  4993 slave.cpp:578] Agent hostname: 8a0877099835
I0710 18:23:51.205760  4987 status_update_manager.cpp:177] Pausing sending status updates
I0710 18:23:51.208036  4989 state.cpp:64] Recovering state from '/tmp/Endpoint_SlaveEndpointTest_UnauthorizedRequest_1_47sRy4/meta'
I0710 18:23:51.213536  4988 status_update_manager.cpp:203] Recovering status update manager
I0710 18:23:51.213953  4988 containerizer.cpp:582] Recovering containerizer
I0710 18:23:51.216823  4986 provisioner.cpp:416] Provisioner recovery complete
I0710 18:23:51.217916  4986 slave.cpp:6203] Finished recovery
I0710 18:23:51.218611  4986 slave.cpp:6385] Querying resource estimator for oversubscribable
resources
I0710 18:23:51.219012  4986 slave.cpp:6399] Received oversubscribable resources {} from the
resource estimator
I0710 18:23:51.225193  4991 process.cpp:3820] Handling HTTP event for process 'slave(780)'
with path: '/slave(780)/monitor/statistics.json'
I0710 18:23:51.227987  4989 http.cpp:1116] HTTP GET for /slave(780)/monitor/statistics.json
from 172.17.0.3:58192
I0710 18:23:51.228392  4989 http.cpp:937] Authorizing principal 'test-principal' to GET the
'/monitor/statistics.json' endpoint
I0710 18:23:51.235935  4992 slave.cpp:839] Agent terminating
[       OK ] Endpoint/SlaveEndpointTest.UnauthorizedRequest/1 (89 ms)
[ RUN      ] Endpoint/SlaveEndpointTest.UnauthorizedRequest/2
I0710 18:23:51.270432  4967 containerizer.cpp:230] Using isolation: posix/cpu,posix/mem,filesystem/posix,network/cni,environment_secret
W0710 18:23:51.271401  4967 backend.cpp:76] Failed to create 'overlay' backend: OverlayBackend
requires root privileges
W0710 18:23:51.271603  4967 backend.cpp:76] Failed to create 'bind' backend: BindBackend requires
root privileges
I0710 18:23:51.271755  4967 provisioner.cpp:255] Using default backend 'copy'
I0710 18:23:51.279103  4987 slave.cpp:250] Mesos agent started on (781)@172.17.0.3:40757
I0710 18:23:51.279147  4987 slave.cpp:251] Flags at startup: --acls="" --appc_simple_discovery_uri_prefix="http://"
--appc_store_dir="/tmp/Endpoint_SlaveEndpointTest_UnauthorizedRequest_2_jAIOWN/store/appc"
--authenticate_http_readonly="true" --authenticate_http_readwrite="true" --authenticatee="crammd5"
--authentication_backoff_factor="1secs" --authorizer="local" --cgroups_cpu_enable_pids_and_tids_count="false"
--cgroups_enable_cfs="false" --cgroups_hierarchy="/sys/fs/cgroup" --cgroups_limit_swap="false"
--cgroups_root="mesos" --container_disk_watch_interval="15secs" --containerizers="mesos" --credential="/tmp/Endpoint_SlaveEndpointTest_UnauthorizedRequest_2_jAIOWN/credential"
--default_role="*" --disk_watch_interval="1mins" --docker="docker" --docker_kill_orphans="true"
--docker_registry="https://registry-1.docker.io" --docker_remove_delay="6hrs" --docker_socket="/var/run/docker.sock"
--docker_stop_timeout="0ns" --docker_store_dir="/tmp/Endpoint_SlaveEndpointTest_UnauthorizedRequest_2_jAIOWN/store/docker"
--docker_volume_checkpoint_dir="/var/run/mesos/isolators/docker/volume" --enforce_container_disk_quota="false"
--executor_registration_timeout="1mins" --executor_reregistration_timeout="2secs" --executor_shutdown_grace_period="5secs"
--fetcher_cache_dir="/tmp/Endpoint_SlaveEndpointTest_UnauthorizedRequest_2_jAIOWN/fetch" --fetcher_cache_size="2GB"
--frameworks_home="" --gc_delay="1weeks" --gc_disk_headroom="0.1" --hadoop_home="" --help="false"
--hostname_lookup="true" --http_command_executor="false" --http_credentials="/tmp/Endpoint_SlaveEndpointTest_UnauthorizedRequest_2_jAIOWN/http_credentials"
--http_heartbeat_interval="30secs" --initialize_driver_logging="true" --isolation="posix/cpu,posix/mem"
--launcher="posix" --launcher_dir="/mesos/mesos-1.4.0/_build/src" --logbufsecs="0" --logging_level="INFO"
--max_completed_executors_per_framework="150" --oversubscribed_resources_interval="15secs"
--perf_duration="10secs" --perf_interval="1mins" --port="5051" --qos_correction_interval_min="0ns"
--quiet="false" --recover="reconnect" --recovery_timeout="15mins" --registration_backoff_factor="10ms"
--resources="cpus:2;gpus:0;mem:1024;disk:1024;ports:[31000-32000]" --revocable_cpu_low_priority="true"
--runtime_dir="/tmp/Endpoint_SlaveEndpointTest_UnauthorizedRequest_2_jAIOWN" --sandbox_directory="/mnt/mesos/sandbox"
--strict="true" --switch_user="true" --systemd_enable_support="true" --systemd_runtime_directory="/run/systemd/system"
--version="false" --work_dir="/tmp/Endpoint_SlaveEndpointTest_UnauthorizedRequest_2_SjjycR"
I0710 18:23:51.280020  4987 credentials.hpp:86] Loading credential for authentication from
'/tmp/Endpoint_SlaveEndpointTest_UnauthorizedRequest_2_jAIOWN/credential'
I0710 18:23:51.280432  4987 slave.cpp:283] Agent using credential for: test-principal
I0710 18:23:51.280472  4987 credentials.hpp:37] Loading credentials for authentication from
'/tmp/Endpoint_SlaveEndpointTest_UnauthorizedRequest_2_jAIOWN/http_credentials'
I0710 18:23:51.281038  4987 http.cpp:976] Creating default 'basic' HTTP authenticator for
realm 'mesos-agent-readonly'
I0710 18:23:51.281400  4987 http.cpp:976] Creating default 'basic' HTTP authenticator for
realm 'mesos-agent-readwrite'
I0710 18:23:51.283923  4987 slave.cpp:565] Agent resources: [{"name":"cpus","scalar":{"value":2.0},"type":"SCALAR"},{"name":"mem","scalar":{"value":1024.0},"type":"SCALAR"},{"name":"disk","scalar":{"value":1024.0},"type":"SCALAR"},{"name":"ports","ranges":{"range":[{"begin":31000,"end":32000}]},"type":"RANGES"}]
I0710 18:23:51.284399  4987 slave.cpp:573] Agent attributes: [  ]
I0710 18:23:51.284428  4987 slave.cpp:578] Agent hostname: 8a0877099835
I0710 18:23:51.284891  4986 status_update_manager.cpp:177] Pausing sending status updates
I0710 18:23:51.287317  4991 state.cpp:64] Recovering state from '/tmp/Endpoint_SlaveEndpointTest_UnauthorizedRequest_2_SjjycR/meta'
I0710 18:23:51.288282  4987 status_update_manager.cpp:203] Recovering status update manager
I0710 18:23:51.288529  4987 containerizer.cpp:582] Recovering containerizer
I0710 18:23:51.291677  4988 provisioner.cpp:416] Provisioner recovery complete
I0710 18:23:51.292438  4992 slave.cpp:6203] Finished recovery
I0710 18:23:51.293679  4992 slave.cpp:6385] Querying resource estimator for oversubscribable
resources
I0710 18:23:51.296524  4992 slave.cpp:6399] Received oversubscribable resources {} from the
resource estimator
I0710 18:23:51.303197  4988 process.cpp:3820] Handling HTTP event for process 'slave(781)'
with path: '/slave(781)/containers'
I0710 18:23:51.305882  4988 http.cpp:1116] HTTP GET for /slave(781)/containers from 172.17.0.3:58198
I0710 18:23:51.306017  4988 http.cpp:937] Authorizing principal 'test-principal' to GET the
'/containers' endpoint
I0710 18:23:51.320510  4967 slave.cpp:839] Agent terminating
[       OK ] Endpoint/SlaveEndpointTest.UnauthorizedRequest/2 (76 ms)
[ RUN      ] Endpoint/SlaveEndpointTest.NoAuthorizer/0
I0710 18:23:51.339854  4967 containerizer.cpp:230] Using isolation: posix/cpu,posix/mem,filesystem/posix,network/cni,environment_secret
W0710 18:23:51.340678  4967 backend.cpp:76] Failed to create 'overlay' backend: OverlayBackend
requires root privileges
W0710 18:23:51.340869  4967 backend.cpp:76] Failed to create 'bind' backend: BindBackend requires
root privileges
I0710 18:23:51.340917  4967 provisioner.cpp:255] Using default backend 'copy'
I0710 18:23:51.348320  4967 cluster.cpp:448] Creating default 'local' authorizer
I0710 18:23:51.351455  4992 slave.cpp:250] Mesos agent started on (782)@172.17.0.3:40757
I0710 18:23:51.351501  4992 slave.cpp:251] Flags at startup: --acls="" --appc_simple_discovery_uri_prefix="http://"
--appc_store_dir="/tmp/Endpoint_SlaveEndpointTest_NoAuthorizer_0_JplIBB/store/appc" --authenticate_http_readonly="true"
--authenticate_http_readwrite="true" --authenticatee="crammd5" --authentication_backoff_factor="1secs"
--authorizer="local" --cgroups_cpu_enable_pids_and_tids_count="false" --cgroups_enable_cfs="false"
--cgroups_hierarchy="/sys/fs/cgroup" --cgroups_limit_swap="false" --cgroups_root="mesos" --container_disk_watch_interval="15secs"
--containerizers="mesos" --credential="/tmp/Endpoint_SlaveEndpointTest_NoAuthorizer_0_JplIBB/credential"
--default_role="*" --disk_watch_interval="1mins" --docker="docker" --docker_kill_orphans="true"
--docker_registry="https://registry-1.docker.io" --docker_remove_delay="6hrs" --docker_socket="/var/run/docker.sock"
--docker_stop_timeout="0ns" --docker_store_dir="/tmp/Endpoint_SlaveEndpointTest_NoAuthorizer_0_JplIBB/store/docker"
--docker_volume_checkpoint_dir="/var/run/mesos/isolators/docker/volume" --enforce_container_disk_quota="false"
--executor_registration_timeout="1mins" --executor_reregistration_timeout="2secs" --executor_shutdown_grace_period="5secs"
--fetcher_cache_dir="/tmp/Endpoint_SlaveEndpointTest_NoAuthorizer_0_JplIBB/fetch" --fetcher_cache_size="2GB"
--frameworks_home="" --gc_delay="1weeks" --gc_disk_headroom="0.1" --hadoop_home="" --help="false"
--hostname_lookup="true" --http_command_executor="false" --http_credentials="/tmp/Endpoint_SlaveEndpointTest_NoAuthorizer_0_JplIBB/http_credentials"
--http_heartbeat_interval="30secs" --initialize_driver_logging="true" --isolation="posix/cpu,posix/mem"
--launcher="posix" --launcher_dir="/mesos/mesos-1.4.0/_build/src" --logbufsecs="0" --logging_level="INFO"
--max_completed_executors_per_framework="150" --oversubscribed_resources_interval="15secs"
--perf_duration="10secs" --perf_interval="1mins" --port="5051" --qos_correction_interval_min="0ns"
--quiet="false" --recover="reconnect" --recovery_timeout="15mins" --registration_backoff_factor="10ms"
--resources="cpus:2;gpus:0;mem:1024;disk:1024;ports:[31000-32000]" --revocable_cpu_low_priority="true"
--runtime_dir="/tmp/Endpoint_SlaveEndpointTest_NoAuthorizer_0_JplIBB" --sandbox_directory="/mnt/mesos/sandbox"
--strict="true" --switch_user="true" --systemd_enable_support="true" --systemd_runtime_directory="/run/systemd/system"
--version="false" --work_dir="/tmp/Endpoint_SlaveEndpointTest_NoAuthorizer_0_sqOcFE"
I0710 18:23:51.352300  4992 credentials.hpp:86] Loading credential for authentication from
'/tmp/Endpoint_SlaveEndpointTest_NoAuthorizer_0_JplIBB/credential'
I0710 18:23:51.352583  4992 slave.cpp:283] Agent using credential for: test-principal
I0710 18:23:51.352620  4992 credentials.hpp:37] Loading credentials for authentication from
'/tmp/Endpoint_SlaveEndpointTest_NoAuthorizer_0_JplIBB/http_credentials'
I0710 18:23:51.353065  4992 http.cpp:976] Creating default 'basic' HTTP authenticator for
realm 'mesos-agent-readonly'
I0710 18:23:51.353332  4992 http.cpp:976] Creating default 'basic' HTTP authenticator for
realm 'mesos-agent-readwrite'
I0710 18:23:51.356899  4992 slave.cpp:565] Agent resources: [{"name":"cpus","scalar":{"value":2.0},"type":"SCALAR"},{"name":"mem","scalar":{"value":1024.0},"type":"SCALAR"},{"name":"disk","scalar":{"value":1024.0},"type":"SCALAR"},{"name":"ports","ranges":{"range":[{"begin":31000,"end":32000}]},"type":"RANGES"}]
I0710 18:23:51.357412  4992 slave.cpp:573] Agent attributes: [  ]
I0710 18:23:51.357439  4992 slave.cpp:578] Agent hostname: 8a0877099835
I0710 18:23:51.358815  4991 status_update_manager.cpp:177] Pausing sending status updates
I0710 18:23:51.361222  4986 state.cpp:64] Recovering state from '/tmp/Endpoint_SlaveEndpointTest_NoAuthorizer_0_sqOcFE/meta'
I0710 18:23:51.362264  4990 status_update_manager.cpp:203] Recovering status update manager
I0710 18:23:51.362596  4990 containerizer.cpp:582] Recovering containerizer
I0710 18:23:51.365928  4987 provisioner.cpp:416] Provisioner recovery complete
I0710 18:23:51.366958  4987 slave.cpp:6203] Finished recovery
I0710 18:23:51.368039  4987 slave.cpp:6385] Querying resource estimator for oversubscribable
resources
I0710 18:23:51.369105  4989 slave.cpp:6399] Received oversubscribable resources {} from the
resource estimator
I0710 18:23:51.378388  4992 process.cpp:3820] Handling HTTP event for process 'slave(782)'
with path: '/slave(782)/monitor/statistics'
I0710 18:23:51.382508  4987 http.cpp:1116] HTTP GET for /slave(782)/monitor/statistics from
172.17.0.3:58202
I0710 18:23:51.382755  4987 http.cpp:937] Authorizing principal 'test-principal' to GET the
'/monitor/statistics' endpoint
I0710 18:23:51.390775  4967 slave.cpp:839] Agent terminating
[       OK ] Endpoint/SlaveEndpointTest.NoAuthorizer/0 (75 ms)
[ RUN      ] Endpoint/SlaveEndpointTest.NoAuthorizer/1
I0710 18:23:51.417309  4967 containerizer.cpp:230] Using isolation: posix/cpu,posix/mem,filesystem/posix,network/cni,environment_secret
W0710 18:23:51.418483  4967 backend.cpp:76] Failed to create 'overlay' backend: OverlayBackend
requires root privileges
W0710 18:23:51.418810  4967 backend.cpp:76] Failed to create 'bind' backend: BindBackend requires
root privileges
I0710 18:23:51.419528  4967 provisioner.cpp:255] Using default backend 'copy'
I0710 18:23:51.422631  4967 cluster.cpp:448] Creating default 'local' authorizer
I0710 18:23:51.427781  4988 slave.cpp:250] Mesos agent started on (783)@172.17.0.3:40757
I0710 18:23:51.427830  4988 slave.cpp:251] Flags at startup: --acls="" --appc_simple_discovery_uri_prefix="http://"
--appc_store_dir="/tmp/Endpoint_SlaveEndpointTest_NoAuthorizer_1_pRZs3p/store/appc" --authenticate_http_readonly="true"
--authenticate_http_readwrite="true" --authenticatee="crammd5" --authentication_backoff_factor="1secs"
--authorizer="local" --cgroups_cpu_enable_pids_and_tids_count="false" --cgroups_enable_cfs="false"
--cgroups_hierarchy="/sys/fs/cgroup" --cgroups_limit_swap="false" --cgroups_root="mesos" --container_disk_watch_interval="15secs"
--containerizers="mesos" --credential="/tmp/Endpoint_SlaveEndpointTest_NoAuthorizer_1_pRZs3p/credential"
--default_role="*" --disk_watch_interval="1mins" --docker="docker" --docker_kill_orphans="true"
--docker_registry="https://registry-1.docker.io" --docker_remove_delay="6hrs" --docker_socket="/var/run/docker.sock"
--docker_stop_timeout="0ns" --docker_store_dir="/tmp/Endpoint_SlaveEndpointTest_NoAuthorizer_1_pRZs3p/store/docker"
--docker_volume_checkpoint_dir="/var/run/mesos/isolators/docker/volume" --enforce_container_disk_quota="false"
--executor_registration_timeout="1mins" --executor_reregistration_timeout="2secs" --executor_shutdown_grace_period="5secs"
--fetcher_cache_dir="/tmp/Endpoint_SlaveEndpointTest_NoAuthorizer_1_pRZs3p/fetch" --fetcher_cache_size="2GB"
--frameworks_home="" --gc_delay="1weeks" --gc_disk_headroom="0.1" --hadoop_home="" --help="false"
--hostname_lookup="true" --http_command_executor="false" --http_credentials="/tmp/Endpoint_SlaveEndpointTest_NoAuthorizer_1_pRZs3p/http_credentials"
--http_heartbeat_interval="30secs" --initialize_driver_logging="true" --isolation="posix/cpu,posix/mem"
--launcher="posix" --launcher_dir="/mesos/mesos-1.4.0/_build/src" --logbufsecs="0" --logging_level="INFO"
--max_completed_executors_per_framework="150" --oversubscribed_resources_interval="15secs"
--perf_duration="10secs" --perf_interval="1mins" --port="5051" --qos_correction_interval_min="0ns"
--quiet="false" --recover="reconnect" --recovery_timeout="15mins" --registration_backoff_factor="10ms"
--resources="cpus:2;gpus:0;mem:1024;disk:1024;ports:[31000-32000]" --revocable_cpu_low_priority="true"
--runtime_dir="/tmp/Endpoint_SlaveEndpointTest_NoAuthorizer_1_pRZs3p" --sandbox_directory="/mnt/mesos/sandbox"
--strict="true" --switch_user="true" --systemd_enable_support="true" --systemd_runtime_directory="/run/systemd/system"
--version="false" --work_dir="/tmp/Endpoint_SlaveEndpointTest_NoAuthorizer_1_2AnGUs"
I0710 18:23:51.428773  4988 credentials.hpp:86] Loading credential for authentication from
'/tmp/Endpoint_SlaveEndpointTest_NoAuthorizer_1_pRZs3p/credential'
I0710 18:23:51.429227  4988 slave.cpp:283] Agent using credential for: test-principal
I0710 18:23:51.429276  4988 credentials.hpp:37] Loading credentials for authentication from
'/tmp/Endpoint_SlaveEndpointTest_NoAuthorizer_1_pRZs3p/http_credentials'
I0710 18:23:51.429761  4988 http.cpp:976] Creating default 'basic' HTTP authenticator for
realm 'mesos-agent-readonly'
I0710 18:23:51.430052  4988 http.cpp:976] Creating default 'basic' HTTP authenticator for
realm 'mesos-agent-readwrite'
I0710 18:23:51.432459  4988 slave.cpp:565] Agent resources: [{"name":"cpus","scalar":{"value":2.0},"type":"SCALAR"},{"name":"mem","scalar":{"value":1024.0},"type":"SCALAR"},{"name":"disk","scalar":{"value":1024.0},"type":"SCALAR"},{"name":"ports","ranges":{"range":[{"begin":31000,"end":32000}]},"type":"RANGES"}]
I0710 18:23:51.432940  4988 slave.cpp:573] Agent attributes: [  ]
I0710 18:23:51.432971  4988 slave.cpp:578] Agent hostname: 8a0877099835
I0710 18:23:51.434417  4986 status_update_manager.cpp:177] Pausing sending status updates
I0710 18:23:51.437371  4987 state.cpp:64] Recovering state from '/tmp/Endpoint_SlaveEndpointTest_NoAuthorizer_1_2AnGUs/meta'
I0710 18:23:51.438364  4987 status_update_manager.cpp:203] Recovering status update manager
I0710 18:23:51.438896  4991 containerizer.cpp:582] Recovering containerizer
I0710 18:23:51.442395  4991 provisioner.cpp:416] Provisioner recovery complete
I0710 18:23:51.443327  4991 slave.cpp:6203] Finished recovery
I0710 18:23:51.454304  4991 slave.cpp:6385] Querying resource estimator for oversubscribable
resources
I0710 18:23:51.454816  4991 slave.cpp:6399] Received oversubscribable resources {} from the
resource estimator
I0710 18:23:51.460181  4987 process.cpp:3820] Handling HTTP event for process 'slave(783)'
with path: '/slave(783)/monitor/statistics.json'
I0710 18:23:51.462966  4987 http.cpp:1116] HTTP GET for /slave(783)/monitor/statistics.json
from 172.17.0.3:58210
I0710 18:23:51.463178  4987 http.cpp:937] Authorizing principal 'test-principal' to GET the
'/monitor/statistics.json' endpoint
I0710 18:23:51.471316  4967 slave.cpp:839] Agent terminating
[       OK ] Endpoint/SlaveEndpointTest.NoAuthorizer/1 (72 ms)
[ RUN      ] Endpoint/SlaveEndpointTest.NoAuthorizer/2
I0710 18:23:51.488159  4967 containerizer.cpp:230] Using isolation: posix/cpu,posix/mem,filesystem/posix,network/cni,environment_secret
W0710 18:23:51.489358  4967 backend.cpp:76] Failed to create 'overlay' backend: OverlayBackend
requires root privileges
W0710 18:23:51.489627  4967 backend.cpp:76] Failed to create 'bind' backend: BindBackend requires
root privileges
I0710 18:23:51.489840  4967 provisioner.cpp:255] Using default backend 'copy'
I0710 18:23:51.492544  4967 cluster.cpp:448] Creating default 'local' authorizer
I0710 18:23:51.496829  4989 slave.cpp:250] Mesos agent started on (784)@172.17.0.3:40757
I0710 18:23:51.496876  4989 slave.cpp:251] Flags at startup: --acls="" --appc_simple_discovery_uri_prefix="http://"
--appc_store_dir="/tmp/Endpoint_SlaveEndpointTest_NoAuthorizer_2_BFh2ae/store/appc" --authenticate_http_readonly="true"
--authenticate_http_readwrite="true" --authenticatee="crammd5" --authentication_backoff_factor="1secs"
--authorizer="local" --cgroups_cpu_enable_pids_and_tids_count="false" --cgroups_enable_cfs="false"
--cgroups_hierarchy="/sys/fs/cgroup" --cgroups_limit_swap="false" --cgroups_root="mesos" --container_disk_watch_interval="15secs"
--containerizers="mesos" --credential="/tmp/Endpoint_SlaveEndpointTest_NoAuthorizer_2_BFh2ae/credential"
--default_role="*" --disk_watch_interval="1mins" --docker="docker" --docker_kill_orphans="true"
--docker_registry="https://registry-1.docker.io" --docker_remove_delay="6hrs" --docker_socket="/var/run/docker.sock"
--docker_stop_timeout="0ns" --docker_store_dir="/tmp/Endpoint_SlaveEndpointTest_NoAuthorizer_2_BFh2ae/store/docker"
--docker_volume_checkpoint_dir="/var/run/mesos/isolators/docker/volume" --enforce_container_disk_quota="false"
--executor_registration_timeout="1mins" --executor_reregistration_timeout="2secs" --executor_shutdown_grace_period="5secs"
--fetcher_cache_dir="/tmp/Endpoint_SlaveEndpointTest_NoAuthorizer_2_BFh2ae/fetch" --fetcher_cache_size="2GB"
--frameworks_home="" --gc_delay="1weeks" --gc_disk_headroom="0.1" --hadoop_home="" --help="false"
--hostname_lookup="true" --http_command_executor="false" --http_credentials="/tmp/Endpoint_SlaveEndpointTest_NoAuthorizer_2_BFh2ae/http_credentials"
--http_heartbeat_interval="30secs" --initialize_driver_logging="true" --isolation="posix/cpu,posix/mem"
--launcher="posix" --launcher_dir="/mesos/mesos-1.4.0/_build/src" --logbufsecs="0" --logging_level="INFO"
--max_completed_executors_per_framework="150" --oversubscribed_resources_interval="15secs"
--perf_duration="10secs" --perf_interval="1mins" --port="5051" --qos_correction_interval_min="0ns"
--quiet="false" --recover="reconnect" --recovery_timeout="15mins" --registration_backoff_factor="10ms"
--resources="cpus:2;gpus:0;mem:1024;disk:1024;ports:[31000-32000]" --revocable_cpu_low_priority="true"
--runtime_dir="/tmp/Endpoint_SlaveEndpointTest_NoAuthorizer_2_BFh2ae" --sandbox_directory="/mnt/mesos/sandbox"
--strict="true" --switch_user="true" --systemd_enable_support="true" --systemd_runtime_directory="/run/systemd/system"
--version="false" --work_dir="/tmp/Endpoint_SlaveEndpointTest_NoAuthorizer_2_yLFnQg"
I0710 18:23:51.497570  4989 credentials.hpp:86] Loading credential for authentication from
'/tmp/Endpoint_SlaveEndpointTest_NoAuthorizer_2_BFh2ae/credential'
I0710 18:23:51.497845  4989 slave.cpp:283] Agent using credential for: test-principal
I0710 18:23:51.497871  4989 credentials.hpp:37] Loading credentials for authentication from
'/tmp/Endpoint_SlaveEndpointTest_NoAuthorizer_2_BFh2ae/http_credentials'
I0710 18:23:51.498226  4989 http.cpp:976] Creating default 'basic' HTTP authenticator for
realm 'mesos-agent-readonly'
I0710 18:23:51.498447  4989 http.cpp:976] Creating default 'basic' HTTP authenticator for
realm 'mesos-agent-readwrite'
I0710 18:23:51.500540  4989 slave.cpp:565] Agent resources: [{"name":"cpus","scalar":{"value":2.0},"type":"SCALAR"},{"name":"mem","scalar":{"value":1024.0},"type":"SCALAR"},{"name":"disk","scalar":{"value":1024.0},"type":"SCALAR"},{"name":"ports","ranges":{"range":[{"begin":31000,"end":32000}]},"type":"RANGES"}]
I0710 18:23:51.501045  4989 slave.cpp:573] Agent attributes: [  ]
I0710 18:23:51.501066  4989 slave.cpp:578] Agent hostname: 8a0877099835
I0710 18:23:51.503728  4989 status_update_manager.cpp:177] Pausing sending status updates
I0710 18:23:51.504142  4993 state.cpp:64] Recovering state from '/tmp/Endpoint_SlaveEndpointTest_NoAuthorizer_2_yLFnQg/meta'
I0710 18:23:51.504938  4993 status_update_manager.cpp:203] Recovering status update manager
I0710 18:23:51.505352  4989 containerizer.cpp:582] Recovering containerizer
I0710 18:23:51.508435  4989 provisioner.cpp:416] Provisioner recovery complete
I0710 18:23:51.509264  4989 slave.cpp:6203] Finished recovery
I0710 18:23:51.509871  4989 slave.cpp:6385] Querying resource estimator for oversubscribable
resources
I0710 18:23:51.510934  4989 slave.cpp:6399] Received oversubscribable resources {} from the
resource estimator
I0710 18:23:51.516638  4989 process.cpp:3820] Handling HTTP event for process 'slave(784)'
with path: '/slave(784)/containers'
I0710 18:23:51.526677  4992 http.cpp:1116] HTTP GET for /slave(784)/containers from 172.17.0.3:58212
I0710 18:23:51.526829  4992 http.cpp:937] Authorizing principal 'test-principal' to GET the
'/containers' endpoint
I0710 18:23:51.540882  4967 slave.cpp:839] Agent terminating
[       OK ] Endpoint/SlaveEndpointTest.NoAuthorizer/2 (85 ms)
[----------] 9 tests from Endpoint/SlaveEndpointTest (762 ms total)

[----------] Global test environment tear-down
[==========] 1627 tests from 179 test cases ran. (883838 ms total)
[  PASSED  ] 1623 tests.
[  FAILED  ] 4 tests, listed below:
[  FAILED  ] DefaultExecutorCheckTest.CommandCheckDeliveredAndReconciled
[  FAILED  ] DefaultExecutorCheckTest.CommandCheckStatusChange
[  FAILED  ] DefaultExecutorCheckTest.CommandCheckSeesParentsEnv
[  FAILED  ] DefaultExecutorCheckTest.CommandCheckSharesWorkDirWithTask

 4 FAILED TESTS
  YOU HAVE 20 DISABLED TESTS

I0710 18:23:51.712535  4994 process.cpp:993] Failed to accept socket: future discarded
make[4]: *** [check-local] Error 1
make[4]: Leaving directory `/mesos/mesos-1.4.0/_build/src'
make[3]: *** [check-am] Error 2
make[3]: Leaving directory `/mesos/mesos-1.4.0/_build/src'
make[2]: *** [check] Error 2
make[2]: Leaving directory `/mesos/mesos-1.4.0/_build/src'
make[1]: *** [check-recursive] Error 1
make[1]: Leaving directory `/mesos/mesos-1.4.0/_build'
make: *** [distcheck] Error 1
+ docker rmi mesos-1499702330-31402
Untagged: mesos-1499702330-31402:latest
Deleted: sha256:2c7828c8a60215c5f11c0f7587c3cc8e730eb12e1a3af9da35a94c23a2162b91
Deleted: sha256:13686d094949923de7eade8f8104381febaccc87501603a570cb9450a68482b9
Deleted: sha256:d54000092a15d93f3cdf5b15b5a877317ba3abd6114ea509bd444598243373f4
Deleted: sha256:33d9d956857ad80bae89bb8d4f58f24fad4315c73509c873a0bbc0249c1881f6
Deleted: sha256:981186ddb223b8a9ba3ddb1da3cca1f3fbd3da1e7e94395dd9196cb5f5aea0b3
Deleted: sha256:6aa14c82d5f12871245e9f8031429c4592778933544ef6d3905a055913c3f07f
Deleted: sha256:014f1f0c776bab8ebf6376272a9e5365bf80473986fe6ee68dc42d45376b2fe8
Deleted: sha256:a432d96d90d91b89b2771af013ddac0c639b4617e187828f499fd06b28104c7f
Deleted: sha256:c0ba9fb07eeaee1f3c08cea875c2b30c4b95aaad23c25877a5742f42bec69db6
Deleted: sha256:742c7eeb8c2e11ce260c208cdd3eb8ab2ac617b06dcc25dc22a343645a8b87b6
Deleted: sha256:71b7d26ab3256b31f930324c9658540fb4c06365997cfae8f8890e8343c0a2fa
Deleted: sha256:63e57bd0106d620b65f6c987fea6ef16bc323d975692fcbc3b39acb1f7cbff50
Deleted: sha256:e2ee4a7f12837b6a3903bd8c58a159a8bcd45e15656450790f7182b503f14609
Deleted: sha256:619effc210637699942af593acff5eb80af63638c955312167b862472593b145
Deleted: sha256:c161dae02559b0965581f5b0b0a56d254d805469488edec2a409067d461e80c5
Deleted: sha256:b051bdc2b96f05af6cc37a4e9ba133e589541b8304cf84bb3dabc0bbcfab7eac
Deleted: sha256:a36b83c0fe09665b24ee87244c45e933cc8c4dd4a61eecd01925bd11de43a3f8
Deleted: sha256:40baa44bb161b14e6d50cc8f48ffe3779c094c3bcc3d98f547175f359faa4eeb
Deleted: sha256:f9ea5f6f5e566f2f7288303fc146f5f06f9fdac666e5629afbe5bfcd0bc3614f
Deleted: sha256:3c193c1fcdd9fc94bcd653d3d708560fe3b33599fed45d0cef8c8994108bb8bb
Deleted: sha256:3511cb162c984cf104d47bc783ea523e51e9d5b2e2bae194934fd36f6e93b9b4
Deleted: sha256:45e1fc010d2862331f58a931b1ed2e1500149c2a1bb8538ab494f4ad84abaf0d
Deleted: sha256:26fdf1793cb7e5c4a3807fe940674df8619a936b48da3331960dad6554c84029
Deleted: sha256:2d7cb855e416ad88f705f48bbdac44b9881d4153b6a985bc1bddab90ed1a07f4
Build step 'Execute shell' marked build as failure

Mime
View raw message