mesos-builds mailing list archives

Site index · List index
Message view « Date » · « Thread »
Top « Date » · « Thread »
From Apache Jenkins Server <jenk...@builds.apache.org>
Subject Build failed in Jenkins: Mesos-Buildbot » autotools,gcc,--verbose --enable-libevent --enable-ssl,GLOG_v=1 MESOS_VERBOSE=1,centos:7,(ubuntu)&&(!ubuntu-us1)&&(!ubuntu-eu2) #3976
Date Fri, 28 Jul 2017 22:58:55 GMT
See <https://builds.apache.org/job/Mesos-Buildbot/BUILDTOOL=autotools,COMPILER=gcc,CONFIGURATION=--verbose%20--enable-libevent%20--enable-ssl,ENVIRONMENT=GLOG_v=1%20MESOS_VERBOSE=1,OS=centos%3A7,label_exp=(ubuntu)&&(!ubuntu-us1)&&(!ubuntu-eu2)/3976/display/redirect?page=changes>

Changes:

[songzihao1990] Fixed the sandbox_path volume source path ownership.

[songzihao1990] Added MESOS-7830 to 1.2.2 CHANGELOG.

[songzihao1990] Fixed the sandbox volume relative host path ownership.

[songzihao1990] Added MESOS-5187 to 1.2.2 CHANGELOG.

------------------------------------------
[...truncated 3.36 MB...]
I0728 22:58:34.233404  1865 cluster.cpp:160] Creating default 'local' authorizer
I0728 22:58:34.236207  1893 master.cpp:383] Master a950e919-a136-4d23-9058-578d9eb18d9b (cf2516606fcb)
started on 172.17.0.6:38803
I0728 22:58:34.236244  1893 master.cpp:385] Flags at startup: --acls="" --agent_ping_timeout="15secs"
--agent_reregister_timeout="10mins" --allocation_interval="1secs" --allocator="HierarchicalDRF"
--authenticate_agents="true" --authenticate_frameworks="true" --authenticate_http_frameworks="true"
--authenticate_http_readonly="true" --authenticate_http_readwrite="true" --authenticators="crammd5"
--authorizers="local" --credentials="/tmp/02E2qy/credentials" --framework_sorter="drf" --help="false"
--hostname_lookup="true" --http_authenticators="basic" --http_framework_authenticators="basic"
--initialize_driver_logging="true" --log_auto_initialize="true" --logbufsecs="0" --logging_level="INFO"
--max_agent_ping_timeouts="5" --max_completed_frameworks="50" --max_completed_tasks_per_framework="1000"
--max_unreachable_tasks_per_framework="1000" --port="5050" --quiet="false" --recovery_agent_removal_limit="100%"
--registry="in_memory" --registry_fetch_timeout="1mins" --registry_gc_interval="15mins" --registry_max_agent_age="2weeks"
--registry_max_agent_count="102400" --registry_store_timeout="100secs" --registry_strict="false"
--root_submissions="true" --user_sorter="drf" --version="false" --webui_dir="/mesos/mesos-1.2.2/_inst/share/mesos/webui"
--work_dir="/tmp/02E2qy/master" --zk_session_timeout="10secs"
I0728 22:58:34.236698  1893 master.cpp:435] Master only allowing authenticated frameworks
to register
I0728 22:58:34.236711  1893 master.cpp:449] Master only allowing authenticated agents to register
I0728 22:58:34.236719  1893 master.cpp:462] Master only allowing authenticated HTTP frameworks
to register
I0728 22:58:34.236728  1893 credentials.hpp:37] Loading credentials for authentication from
'/tmp/02E2qy/credentials'
I0728 22:58:34.237010  1893 master.cpp:507] Using default 'crammd5' authenticator
I0728 22:58:34.237165  1893 http.cpp:919] Using default 'basic' HTTP authenticator for realm
'mesos-master-readonly'
I0728 22:58:34.237315  1893 http.cpp:919] Using default 'basic' HTTP authenticator for realm
'mesos-master-readwrite'
I0728 22:58:34.237593  1893 http.cpp:919] Using default 'basic' HTTP authenticator for realm
'mesos-master-scheduler'
I0728 22:58:34.237797  1893 master.cpp:587] Authorization enabled
I0728 22:58:34.238127  1898 hierarchical.cpp:161] Initialized hierarchical allocator process
I0728 22:58:34.238132  1903 whitelist_watcher.cpp:77] No whitelist given
I0728 22:58:34.241178  1890 master.cpp:2124] Elected as the leading master!
I0728 22:58:34.241209  1890 master.cpp:1646] Recovering from registrar
I0728 22:58:34.241344  1904 registrar.cpp:329] Recovering registrar
I0728 22:58:34.243490  1884 registrar.cpp:362] Successfully fetched the registry (0B) in 2.084096ms
I0728 22:58:34.243615  1884 registrar.cpp:461] Applied 1 operations in 24318ns; attempting
to update the registry
I0728 22:58:34.244547  1899 registrar.cpp:506] Successfully updated the registry in 856064ns
I0728 22:58:34.244688  1899 registrar.cpp:392] Successfully recovered registrar
I0728 22:58:34.245206  1896 master.cpp:1762] Recovered 0 agents from the registry (129B);
allowing 10mins for agents to re-register
I0728 22:58:34.245229  1891 hierarchical.cpp:188] Skipping recovery of hierarchical allocator:
nothing to recover
I0728 22:58:34.248198  1865 containerizer.cpp:221] Using isolation: posix/cpu,posix/mem,filesystem/posix,network/cni
W0728 22:58:34.248751  1865 backend.cpp:76] Failed to create 'aufs' backend: AufsBackend requires
root privileges
W0728 22:58:34.248863  1865 backend.cpp:76] Failed to create 'bind' backend: BindBackend requires
root privileges
I0728 22:58:34.248898  1865 provisioner.cpp:249] Using default backend 'copy'
I0728 22:58:34.253223  1907 slave.cpp:217] Mesos agent started on 172.17.0.6:38803
I0728 22:58:34.253247  1907 slave.cpp:218] Flags at startup: --acls="" --appc_simple_discovery_uri_prefix="http://"
--appc_store_dir="/tmp/mesos/store/appc" --authenticate_http_readonly="true" --authenticate_http_readwrite="true"
--authenticatee="crammd5" --authentication_backoff_factor="1secs" --authorizer="local" --cgroups_cpu_enable_pids_and_tids_count="false"
--cgroups_enable_cfs="false" --cgroups_hierarchy="/sys/fs/cgroup" --cgroups_limit_swap="false"
--cgroups_root="mesos" --container_disk_watch_interval="15secs" --containerizers="mesos" --credential="/tmp/HTTPCommandExecutorTest_TerminateWithACK_alQnNI/credential"
--default_role="*" --disk_watch_interval="1mins" --docker="docker" --docker_kill_orphans="true"
--docker_registry="https://registry-1.docker.io" --docker_remove_delay="6hrs" --docker_socket="/var/run/docker.sock"
--docker_stop_timeout="0ns" --docker_store_dir="/tmp/mesos/store/docker" --docker_volume_checkpoint_dir="/var/run/mesos/isolators/docker/volume"
--enforce_container_disk_quota="false" --executor_registration_timeout="1mins" --executor_reregistration_timeout="2secs"
--executor_shutdown_grace_period="5secs" --fetcher_cache_dir="/tmp/HTTPCommandExecutorTest_TerminateWithACK_alQnNI/fetch"
--fetcher_cache_size="2GB" --frameworks_home="" --gc_delay="1weeks" --gc_disk_headroom="0.1"
--hadoop_home="" --help="false" --hostname_lookup="true" --http_authenticators="basic" --http_command_executor="true"
--http_credentials="/tmp/HTTPCommandExecutorTest_TerminateWithACK_alQnNI/http_credentials"
--http_heartbeat_interval="30secs" --initialize_driver_logging="true" --isolation="posix/cpu,posix/mem"
--launcher="posix" --launcher_dir="/mesos/mesos-1.2.2/_build/src" --logbufsecs="0" --logging_level="INFO"
--max_completed_executors_per_framework="150" --oversubscribed_resources_interval="15secs"
--perf_duration="10secs" --perf_interval="1mins" --port="5051" --qos_correction_interval_min="0ns"
--quiet="false" --recover="reconnect" --recovery_timeout="15mins" --registration_backoff_factor="10ms"
--resources="cpus:2;gpus:0;mem:1024;disk:1024;ports:[31000-32000]" --revocable_cpu_low_priority="true"
--runtime_dir="/tmp/HTTPCommandExecutorTest_TerminateWithACK_alQnNI" --sandbox_directory="/mnt/mesos/sandbox"
--strict="true" --switch_user="true" --systemd_enable_support="true" --systemd_runtime_directory="/run/systemd/system"
--version="false" --work_dir="/tmp/HTTPCommandExecutorTest_TerminateWithACK_jOycCD"
I0728 22:58:34.253818  1907 credentials.hpp:86] Loading credential for authentication from
'/tmp/HTTPCommandExecutorTest_TerminateWithACK_alQnNI/credential'
I0728 22:58:34.253988  1907 slave.cpp:360] Agent using credential for: test-principal
I0728 22:58:34.254011  1907 credentials.hpp:37] Loading credentials for authentication from
'/tmp/HTTPCommandExecutorTest_TerminateWithACK_alQnNI/http_credentials'
I0728 22:58:34.254272  1907 http.cpp:919] Using default 'basic' HTTP authenticator for realm
'mesos-agent-readonly'
I0728 22:58:34.254433  1907 http.cpp:919] Using default 'basic' HTTP authenticator for realm
'mesos-agent-readwrite'
I0728 22:58:34.254535  1865 sched.cpp:232] Version: 1.2.2
I0728 22:58:34.255244  1891 sched.cpp:336] New master detected at master@172.17.0.6:38803
I0728 22:58:34.255352  1891 sched.cpp:407] Authenticating with master master@172.17.0.6:38803
I0728 22:58:34.255373  1891 sched.cpp:414] Using default CRAM-MD5 authenticatee
I0728 22:58:34.255611  1905 authenticatee.cpp:121] Creating new client SASL connection
I0728 22:58:34.255906  1899 master.cpp:7199] Authenticating scheduler-fac42f00-9966-4c0d-8e5e-ff4591bbb3ac@172.17.0.6:38803
I0728 22:58:34.255888  1907 slave.cpp:547] Agent resources: cpus(*):2; mem(*):1024; disk(*):1024;
ports(*):[31000-32000]
I0728 22:58:34.255991  1907 slave.cpp:555] Agent attributes: [  ]
I0728 22:58:34.256006  1907 slave.cpp:560] Agent hostname: cf2516606fcb
I0728 22:58:34.256028  1903 authenticator.cpp:414] Starting authentication session for crammd5-authenticatee(34)@172.17.0.6:38803
I0728 22:58:34.256157  1891 status_update_manager.cpp:177] Pausing sending status updates
I0728 22:58:34.256362  1884 authenticator.cpp:98] Creating new server SASL connection
I0728 22:58:34.256593  1897 authenticatee.cpp:213] Received SASL authentication mechanisms:
CRAM-MD5
I0728 22:58:34.256625  1897 authenticatee.cpp:239] Attempting to authenticate with mechanism
'CRAM-MD5'
I0728 22:58:34.256745  1902 authenticator.cpp:204] Received SASL authentication start
I0728 22:58:34.256808  1902 authenticator.cpp:326] Authentication requires more steps
I0728 22:58:34.256916  1890 authenticatee.cpp:259] Received SASL authentication step
I0728 22:58:34.257203  1892 authenticator.cpp:232] Received SASL authentication step
I0728 22:58:34.257239  1892 auxprop.cpp:109] Request to lookup properties for user: 'test-principal'
realm: 'cf2516606fcb' server FQDN: 'cf2516606fcb' SASL_AUXPROP_VERIFY_AGAINST_HASH: false
SASL_AUXPROP_OVERRIDE: false SASL_AUXPROP_AUTHZID: false 
I0728 22:58:34.257254  1892 auxprop.cpp:181] Looking up auxiliary property '*userPassword'
I0728 22:58:34.257294  1892 auxprop.cpp:181] Looking up auxiliary property '*cmusaslsecretCRAM-MD5'
I0728 22:58:34.257316  1892 auxprop.cpp:109] Request to lookup properties for user: 'test-principal'
realm: 'cf2516606fcb' server FQDN: 'cf2516606fcb' SASL_AUXPROP_VERIFY_AGAINST_HASH: false
SASL_AUXPROP_OVERRIDE: false SASL_AUXPROP_AUTHZID: true 
I0728 22:58:34.257329  1892 auxprop.cpp:131] Skipping auxiliary property '*userPassword' since
SASL_AUXPROP_AUTHZID == true
I0728 22:58:34.257340  1892 auxprop.cpp:131] Skipping auxiliary property '*cmusaslsecretCRAM-MD5'
since SASL_AUXPROP_AUTHZID == true
I0728 22:58:34.257357  1892 authenticator.cpp:318] Authentication success
I0728 22:58:34.257513  1894 authenticatee.cpp:299] Authentication success
I0728 22:58:34.257596  1896 master.cpp:7229] Successfully authenticated principal 'test-principal'
at scheduler-fac42f00-9966-4c0d-8e5e-ff4591bbb3ac@172.17.0.6:38803
I0728 22:58:34.257787  1888 authenticator.cpp:432] Authentication session cleanup for crammd5-authenticatee(34)@172.17.0.6:38803
I0728 22:58:34.258000  1902 sched.cpp:513] Successfully authenticated with master master@172.17.0.6:38803
I0728 22:58:34.258023  1902 sched.cpp:836] Sending SUBSCRIBE call to master@172.17.0.6:38803
I0728 22:58:34.258132  1902 sched.cpp:869] Will retry registration in 1.346257707secs if necessary
I0728 22:58:34.258329  1899 master.cpp:2737] Received SUBSCRIBE call for framework 'default'
at scheduler-fac42f00-9966-4c0d-8e5e-ff4591bbb3ac@172.17.0.6:38803
I0728 22:58:34.258337  1894 state.cpp:62] Recovering state from '/tmp/HTTPCommandExecutorTest_TerminateWithACK_jOycCD/meta'
I0728 22:58:34.258409  1899 master.cpp:2160] Authorizing framework principal 'test-principal'
to receive offers for role '*'
I0728 22:58:34.258692  1892 status_update_manager.cpp:203] Recovering status update manager
I0728 22:58:34.258960  1890 containerizer.cpp:600] Recovering containerizer
I0728 22:58:34.259042  1889 master.cpp:2813] Subscribing framework default with checkpointing
disabled and capabilities [  ]
I0728 22:58:34.259609  1886 sched.cpp:759] Framework registered with a950e919-a136-4d23-9058-578d9eb18d9b-0000
I0728 22:58:34.259667  1886 sched.cpp:773] Scheduler::registered took 30716ns
I0728 22:58:34.260098  1899 hierarchical.cpp:286] Added framework a950e919-a136-4d23-9058-578d9eb18d9b-0000
I0728 22:58:34.260243  1899 hierarchical.cpp:1810] No allocations performed
I0728 22:58:34.260285  1899 hierarchical.cpp:1900] No inverse offers to send out!
I0728 22:58:34.260345  1899 hierarchical.cpp:1394] Performed allocation for 0 agents in 147098ns
I0728 22:58:34.260773  1888 provisioner.cpp:410] Provisioner recovery complete
I0728 22:58:34.261201  1895 slave.cpp:5662] Finished recovery
I0728 22:58:34.261723  1895 slave.cpp:5836] Querying resource estimator for oversubscribable
resources
I0728 22:58:34.261961  1895 slave.cpp:937] New master detected at master@172.17.0.6:38803
I0728 22:58:34.261970  1903 status_update_manager.cpp:177] Pausing sending status updates
I0728 22:58:34.262058  1895 slave.cpp:972] Detecting new master
I0728 22:58:34.264250  1905 slave.cpp:999] Authenticating with master master@172.17.0.6:38803
I0728 22:58:34.264312  1905 slave.cpp:1010] Using default CRAM-MD5 authenticatee
I0728 22:58:34.264478  1906 authenticatee.cpp:121] Creating new client SASL connection
I0728 22:58:34.264715  1895 master.cpp:7199] Authenticating (13)@172.17.0.6:38803
I0728 22:58:34.264814  1901 authenticator.cpp:414] Starting authentication session for crammd5-authenticatee(35)@172.17.0.6:38803
I0728 22:58:34.265033  1897 authenticator.cpp:98] Creating new server SASL connection
I0728 22:58:34.265272  1907 authenticatee.cpp:213] Received SASL authentication mechanisms:
CRAM-MD5
I0728 22:58:34.265308  1907 authenticatee.cpp:239] Attempting to authenticate with mechanism
'CRAM-MD5'
I0728 22:58:34.265417  1888 authenticator.cpp:204] Received SASL authentication start
I0728 22:58:34.265468  1888 authenticator.cpp:326] Authentication requires more steps
I0728 22:58:34.265583  1894 authenticatee.cpp:259] Received SASL authentication step
I0728 22:58:34.265750  1895 authenticator.cpp:232] Received SASL authentication step
I0728 22:58:34.265786  1895 auxprop.cpp:109] Request to lookup properties for user: 'test-principal'
realm: 'cf2516606fcb' server FQDN: 'cf2516606fcb' SASL_AUXPROP_VERIFY_AGAINST_HASH: false
SASL_AUXPROP_OVERRIDE: false SASL_AUXPROP_AUTHZID: false 
I0728 22:58:34.265801  1895 auxprop.cpp:181] Looking up auxiliary property '*userPassword'
I0728 22:58:34.265835  1895 auxprop.cpp:181] Looking up auxiliary property '*cmusaslsecretCRAM-MD5'
I0728 22:58:34.265854  1895 auxprop.cpp:109] Request to lookup properties for user: 'test-principal'
realm: 'cf2516606fcb' server FQDN: 'cf2516606fcb' SASL_AUXPROP_VERIFY_AGAINST_HASH: false
SASL_AUXPROP_OVERRIDE: false SASL_AUXPROP_AUTHZID: true 
I0728 22:58:34.265866  1895 auxprop.cpp:131] Skipping auxiliary property '*userPassword' since
SASL_AUXPROP_AUTHZID == true
I0728 22:58:34.265877  1895 auxprop.cpp:131] Skipping auxiliary property '*cmusaslsecretCRAM-MD5'
since SASL_AUXPROP_AUTHZID == true
I0728 22:58:34.265892  1895 authenticator.cpp:318] Authentication success
I0728 22:58:34.265980  1907 authenticatee.cpp:299] Authentication success
I0728 22:58:34.266111  1896 master.cpp:7229] Successfully authenticated principal 'test-principal'
at (13)@172.17.0.6:38803
I0728 22:58:34.266297  1892 authenticator.cpp:432] Authentication session cleanup for crammd5-authenticatee(35)@172.17.0.6:38803
I0728 22:58:34.266360  1891 slave.cpp:1094] Successfully authenticated with master master@172.17.0.6:38803
I0728 22:58:34.266559  1891 slave.cpp:1521] Will retry registration in 3.928176ms if necessary
I0728 22:58:34.266783  1904 master.cpp:5396] Registering agent at (13)@172.17.0.6:38803 (cf2516606fcb)
with id a950e919-a136-4d23-9058-578d9eb18d9b-S0
I0728 22:58:34.267295  1897 registrar.cpp:461] Applied 1 operations in 69644ns; attempting
to update the registry
I0728 22:58:34.269516  1897 registrar.cpp:506] Successfully updated the registry in 2.147072ms
I0728 22:58:34.270390  1901 slave.cpp:4395] Received ping from slave-observer(9)@172.17.0.6:38803
I0728 22:58:34.270577  1901 slave.cpp:1140] Registered with master master@172.17.0.6:38803;
given agent ID a950e919-a136-4d23-9058-578d9eb18d9b-S0
I0728 22:58:34.270603  1901 fetcher.cpp:94] Clearing fetcher cache
I0728 22:58:34.270509  1898 master.cpp:5470] Registered agent a950e919-a136-4d23-9058-578d9eb18d9b-S0
at (13)@172.17.0.6:38803 (cf2516606fcb) with cpus(*):2; mem(*):1024; disk(*):1024; ports(*):[31000-32000]
I0728 22:58:34.270738  1899 status_update_manager.cpp:184] Resuming sending status updates
I0728 22:58:34.270848  1884 hierarchical.cpp:516] Added agent a950e919-a136-4d23-9058-578d9eb18d9b-S0
(cf2516606fcb) with cpus(*):2; mem(*):1024; disk(*):1024; ports(*):[31000-32000] (allocated:
{})
I0728 22:58:34.270977  1901 slave.cpp:1168] Checkpointing SlaveInfo to '/tmp/HTTPCommandExecutorTest_TerminateWithACK_jOycCD/meta/slaves/a950e919-a136-4d23-9058-578d9eb18d9b-S0/slave.info'
I0728 22:58:34.272055  1884 hierarchical.cpp:1900] No inverse offers to send out!
I0728 22:58:34.272114  1884 hierarchical.cpp:1394] Performed allocation for 1 agents in 1.143246ms
I0728 22:58:34.272707  1894 master.cpp:7028] Sending 1 offers to framework a950e919-a136-4d23-9058-578d9eb18d9b-0000
(default) at scheduler-fac42f00-9966-4c0d-8e5e-ff4591bbb3ac@172.17.0.6:38803
I0728 22:58:34.273210  1897 sched.cpp:933] Scheduler::resourceOffers took 116511ns
I0728 22:58:34.275216  1895 master.cpp:3776] Processing ACCEPT call for offers: [ a950e919-a136-4d23-9058-578d9eb18d9b-O0
] on agent a950e919-a136-4d23-9058-578d9eb18d9b-S0 at (13)@172.17.0.6:38803 (cf2516606fcb)
for framework a950e919-a136-4d23-9058-578d9eb18d9b-0000 (default) at scheduler-fac42f00-9966-4c0d-8e5e-ff4591bbb3ac@172.17.0.6:38803
I0728 22:58:34.275312  1895 master.cpp:3352] Authorizing framework principal 'test-principal'
to launch task c0091b35-0255-405a-bc4d-7e2f0b7b84d4
I0728 22:58:34.277485  1895 master.cpp:9089] Adding task c0091b35-0255-405a-bc4d-7e2f0b7b84d4
with resources cpus(*)(allocated: *):2; mem(*)(allocated: *):1024; disk(*)(allocated: *):1024;
ports(*)(allocated: *):[31000-32000] on agent a950e919-a136-4d23-9058-578d9eb18d9b-S0 at (13)@172.17.0.6:38803
(cf2516606fcb)
I0728 22:58:34.277827  1895 master.cpp:4426] Launching task c0091b35-0255-405a-bc4d-7e2f0b7b84d4
of framework a950e919-a136-4d23-9058-578d9eb18d9b-0000 (default) at scheduler-fac42f00-9966-4c0d-8e5e-ff4591bbb3ac@172.17.0.6:38803
with resources cpus(*)(allocated: *):2; mem(*)(allocated: *):1024; disk(*)(allocated: *):1024;
ports(*)(allocated: *):[31000-32000] on agent a950e919-a136-4d23-9058-578d9eb18d9b-S0 at (13)@172.17.0.6:38803
(cf2516606fcb)
I0728 22:58:34.278697  1903 slave.cpp:1631] Got assigned task 'c0091b35-0255-405a-bc4d-7e2f0b7b84d4'
for framework a950e919-a136-4d23-9058-578d9eb18d9b-0000
I0728 22:58:34.279737  1903 slave.cpp:1791] Launching task 'c0091b35-0255-405a-bc4d-7e2f0b7b84d4'
for framework a950e919-a136-4d23-9058-578d9eb18d9b-0000
I0728 22:58:34.280442  1898 hierarchical.cpp:807] Updated allocation of framework a950e919-a136-4d23-9058-578d9eb18d9b-0000
on agent a950e919-a136-4d23-9058-578d9eb18d9b-S0 from cpus(*)(allocated: *):2; mem(*)(allocated:
*):1024; disk(*)(allocated: *):1024; ports(*)(allocated: *):[31000-32000] to cpus(*)(allocated:
*):2; mem(*)(allocated: *):1024; disk(*)(allocated: *):1024; ports(*)(allocated: *):[31000-32000]
I0728 22:58:34.280902  1903 paths.cpp:547] Trying to chown '/tmp/HTTPCommandExecutorTest_TerminateWithACK_jOycCD/slaves/a950e919-a136-4d23-9058-578d9eb18d9b-S0/frameworks/a950e919-a136-4d23-9058-578d9eb18d9b-0000/executors/c0091b35-0255-405a-bc4d-7e2f0b7b84d4/runs/f30fa449-168f-42bf-82e6-9dbdf40e4139'
to user 'mesos'
I0728 22:58:34.281311  1903 slave.cpp:6584] Launching executor 'c0091b35-0255-405a-bc4d-7e2f0b7b84d4'
of framework a950e919-a136-4d23-9058-578d9eb18d9b-0000 with resources cpus(*)(allocated: *):0.1;
mem(*)(allocated: *):32 in work directory '/tmp/HTTPCommandExecutorTest_TerminateWithACK_jOycCD/slaves/a950e919-a136-4d23-9058-578d9eb18d9b-S0/frameworks/a950e919-a136-4d23-9058-578d9eb18d9b-0000/executors/c0091b35-0255-405a-bc4d-7e2f0b7b84d4/runs/f30fa449-168f-42bf-82e6-9dbdf40e4139'
I0728 22:58:34.282421  1901 containerizer.cpp:993] Starting container f30fa449-168f-42bf-82e6-9dbdf40e4139
for executor 'c0091b35-0255-405a-bc4d-7e2f0b7b84d4' of framework a950e919-a136-4d23-9058-578d9eb18d9b-0000
I0728 22:58:34.282567  1903 slave.cpp:2124] Queued task 'c0091b35-0255-405a-bc4d-7e2f0b7b84d4'
for executor 'c0091b35-0255-405a-bc4d-7e2f0b7b84d4' of framework a950e919-a136-4d23-9058-578d9eb18d9b-0000
I0728 22:58:34.282667  1903 slave.cpp:890] Successfully attached file '/tmp/HTTPCommandExecutorTest_TerminateWithACK_jOycCD/slaves/a950e919-a136-4d23-9058-578d9eb18d9b-S0/frameworks/a950e919-a136-4d23-9058-578d9eb18d9b-0000/executors/c0091b35-0255-405a-bc4d-7e2f0b7b84d4/runs/f30fa449-168f-42bf-82e6-9dbdf40e4139'
I0728 22:58:34.293809  1897 containerizer.cpp:1524] Launching 'mesos-containerizer' with flags
'--help="false" --launch_info="{"command":{"arguments":["mesos-executor","--launcher_dir=\/mesos\/mesos-1.2.2\/_build\/src"],"shell":false,"value":"\/mesos\/mesos-1.2.2\/_build\/src\/mesos-executor"},"environment":{"variables":[{"name":"LIBPROCESS_PORT","value":"0"},{"name":"MESOS_AGENT_ENDPOINT","value":"172.17.0.6:38803"},{"name":"MESOS_CHECKPOINT","value":"0"},{"name":"MESOS_DIRECTORY","value":"\/tmp\/HTTPCommandExecutorTest_TerminateWithACK_jOycCD\/slaves\/a950e919-a136-4d23-9058-578d9eb18d9b-S0\/frameworks\/a950e919-a136-4d23-9058-578d9eb18d9b-0000\/executors\/c0091b35-0255-405a-bc4d-7e2f0b7b84d4\/runs\/f30fa449-168f-42bf-82e6-9dbdf40e4139"},{"name":"MESOS_EXECUTOR_ID","value":"c0091b35-0255-405a-bc4d-7e2f0b7b84d4"},{"name":"MESOS_EXECUTOR_SHUTDOWN_GRACE_PERIOD","value":"5secs"},{"name":"MESOS_FRAMEWORK_ID","value":"a950e919-a136-4d23-9058-578d9eb18d9b-0000"},{"name":"MESOS_HTTP_COMMAND_EXECUTOR","value":"1"},{"name":"MESOS_SLAVE_ID","value":"a950e919-a136-4d23-9058-578d9eb18d9b-S0"},{"name":"MESOS_SLAVE_PID","value":"(13)@172.17.0.6:38803"},{"name":"MESOS_SANDBOX","value":"\/tmp\/HTTPCommandExecutorTest_TerminateWithACK_jOycCD\/slaves\/a950e919-a136-4d23-9058-578d9eb18d9b-S0\/frameworks\/a950e919-a136-4d23-9058-578d9eb18d9b-0000\/executors\/c0091b35-0255-405a-bc4d-7e2f0b7b84d4\/runs\/f30fa449-168f-42bf-82e6-9dbdf40e4139"}]},"user":"mesos","working_directory":"\/tmp\/HTTPCommandExecutorTest_TerminateWithACK_jOycCD\/slaves\/a950e919-a136-4d23-9058-578d9eb18d9b-S0\/frameworks\/a950e919-a136-4d23-9058-578d9eb18d9b-0000\/executors\/c0091b35-0255-405a-bc4d-7e2f0b7b84d4\/runs\/f30fa449-168f-42bf-82e6-9dbdf40e4139"}"
--pipe_read="7" --pipe_write="8" --runtime_directory="/tmp/HTTPCommandExecutorTest_TerminateWithACK_alQnNI/containers/f30fa449-168f-42bf-82e6-9dbdf40e4139"
--unshare_namespace_mnt="false"'
I0728 22:58:34.296495  1897 launcher.cpp:135] Forked child with pid '1920' for container 'f30fa449-168f-42bf-82e6-9dbdf40e4139'
I0728 22:58:34.301633  1888 fetcher.cpp:353] Starting to fetch URIs for container: f30fa449-168f-42bf-82e6-9dbdf40e4139,
directory: /tmp/HTTPCommandExecutorTest_TerminateWithACK_jOycCD/slaves/a950e919-a136-4d23-9058-578d9eb18d9b-S0/frameworks/a950e919-a136-4d23-9058-578d9eb18d9b-0000/executors/c0091b35-0255-405a-bc4d-7e2f0b7b84d4/runs/f30fa449-168f-42bf-82e6-9dbdf40e4139
I0728 22:58:35.239825  1907 hierarchical.cpp:1810] No allocations performed
I0728 22:58:35.239924  1907 hierarchical.cpp:1900] No inverse offers to send out!
I0728 22:58:35.240002  1907 hierarchical.cpp:1394] Performed allocation for 1 agents in 423367ns
I0728 22:58:36.241276  1899 hierarchical.cpp:1810] No allocations performed
I0728 22:58:36.241369  1899 hierarchical.cpp:1900] No inverse offers to send out!
I0728 22:58:36.241446  1899 hierarchical.cpp:1394] Performed allocation for 1 agents in 379660ns
I0728 22:58:37.242743  1886 hierarchical.cpp:1810] No allocations performed
I0728 22:58:37.242868  1886 hierarchical.cpp:1900] No inverse offers to send out!
I0728 22:58:37.242985  1886 hierarchical.cpp:1394] Performed allocation for 1 agents in 497132ns
I0728 22:58:38.244138  1899 hierarchical.cpp:1810] No allocations performed
I0728 22:58:38.244304  1899 hierarchical.cpp:1900] No inverse offers to send out!
I0728 22:58:38.244426  1899 hierarchical.cpp:1394] Performed allocation for 1 agents in 587063ns
I0728 22:58:39.245761  1905 hierarchical.cpp:1810] No allocations performed
I0728 22:58:39.245841  1905 hierarchical.cpp:1900] No inverse offers to send out!
I0728 22:58:39.245898  1905 hierarchical.cpp:1394] Performed allocation for 1 agents in 321684ns
I0728 22:58:40.246562  1906 hierarchical.cpp:1810] No allocations performed
I0728 22:58:40.246644  1906 hierarchical.cpp:1900] No inverse offers to send out!
I0728 22:58:40.246718  1906 hierarchical.cpp:1394] Performed allocation for 1 agents in 314266ns
I0728 22:58:41.247915  1891 hierarchical.cpp:1810] No allocations performed
I0728 22:58:41.248009  1891 hierarchical.cpp:1900] No inverse offers to send out!
I0728 22:58:41.248070  1891 hierarchical.cpp:1394] Performed allocation for 1 agents in 342631ns
I0728 22:58:42.249447  1889 hierarchical.cpp:1810] No allocations performed
I0728 22:58:42.249527  1889 hierarchical.cpp:1900] No inverse offers to send out!
I0728 22:58:42.249596  1889 hierarchical.cpp:1394] Performed allocation for 1 agents in 342830ns
I0728 22:58:43.250118  1892 hierarchical.cpp:1810] No allocations performed
I0728 22:58:43.250221  1892 hierarchical.cpp:1900] No inverse offers to send out!
I0728 22:58:43.250321  1892 hierarchical.cpp:1394] Performed allocation for 1 agents in 371093ns
I0728 22:58:44.251561  1904 hierarchical.cpp:1810] No allocations performed
I0728 22:58:44.251646  1904 hierarchical.cpp:1900] No inverse offers to send out!
I0728 22:58:44.251706  1904 hierarchical.cpp:1394] Performed allocation for 1 agents in 334291ns
I0728 22:58:45.253049  1902 hierarchical.cpp:1810] No allocations performed
I0728 22:58:45.253146  1902 hierarchical.cpp:1900] No inverse offers to send out!
I0728 22:58:45.253232  1902 hierarchical.cpp:1394] Performed allocation for 1 agents in 403953ns
I0728 22:58:46.254307  1901 hierarchical.cpp:1810] No allocations performed
I0728 22:58:46.254398  1901 hierarchical.cpp:1900] No inverse offers to send out!
I0728 22:58:46.254459  1901 hierarchical.cpp:1394] Performed allocation for 1 agents in 433856ns
I0728 22:58:47.255733  1896 hierarchical.cpp:1810] No allocations performed
I0728 22:58:47.255808  1896 hierarchical.cpp:1900] No inverse offers to send out!
I0728 22:58:47.255867  1896 hierarchical.cpp:1394] Performed allocation for 1 agents in 292480ns
I0728 22:58:48.256907  1892 hierarchical.cpp:1810] No allocations performed
I0728 22:58:48.257000  1892 hierarchical.cpp:1900] No inverse offers to send out!
I0728 22:58:48.257072  1892 hierarchical.cpp:1394] Performed allocation for 1 agents in 342006ns
I0728 22:58:49.258213  1889 hierarchical.cpp:1810] No allocations performed
I0728 22:58:49.258318  1889 hierarchical.cpp:1900] No inverse offers to send out!
I0728 22:58:49.258395  1889 hierarchical.cpp:1394] Performed allocation for 1 agents in 413123ns
I0728 22:58:49.271165  1884 slave.cpp:4395] Received ping from slave-observer(9)@172.17.0.6:38803
../../src/tests/command_executor_tests.cpp:402: Failure
Failed to wait 15secs for statusRunning
I0728 22:58:49.276003  1889 master.cpp:1381] Framework a950e919-a136-4d23-9058-578d9eb18d9b-0000
(default) at scheduler-fac42f00-9966-4c0d-8e5e-ff4591bbb3ac@172.17.0.6:38803 disconnected
I0728 22:58:49.276069  1889 master.cpp:3081] Deactivating framework a950e919-a136-4d23-9058-578d9eb18d9b-0000
(default) at scheduler-fac42f00-9966-4c0d-8e5e-ff4591bbb3ac@172.17.0.6:38803
I0728 22:58:49.276206  1889 master.cpp:3058] Disconnecting framework a950e919-a136-4d23-9058-578d9eb18d9b-0000
(default) at scheduler-fac42f00-9966-4c0d-8e5e-ff4591bbb3ac@172.17.0.6:38803
I0728 22:58:49.276289  1898 hierarchical.cpp:415] Deactivated framework a950e919-a136-4d23-9058-578d9eb18d9b-0000
I0728 22:58:49.276285  1889 master.cpp:1396] Giving framework a950e919-a136-4d23-9058-578d9eb18d9b-0000
(default) at scheduler-fac42f00-9966-4c0d-8e5e-ff4591bbb3ac@172.17.0.6:38803 0ns to failover
I0728 22:58:49.276605  1906 master.cpp:6868] Framework failover timeout, removing framework
a950e919-a136-4d23-9058-578d9eb18d9b-0000 (default) at scheduler-fac42f00-9966-4c0d-8e5e-ff4591bbb3ac@172.17.0.6:38803
I0728 22:58:49.276643  1906 master.cpp:7753] Removing framework a950e919-a136-4d23-9058-578d9eb18d9b-0000
(default) at scheduler-fac42f00-9966-4c0d-8e5e-ff4591bbb3ac@172.17.0.6:38803
../../src/tests/command_executor_tests.cpp:391: Failure
Actual function call count doesn't match EXPECT_CALL(sched, statusUpdate(_, _))...
         Expected: to be called twice
           Actual: never called - unsatisfied and active
I0728 22:58:49.276860  1906 master.cpp:8338] Updating the state of task c0091b35-0255-405a-bc4d-7e2f0b7b84d4
of framework a950e919-a136-4d23-9058-578d9eb18d9b-0000 (latest state: TASK_KILLED, status
update state: TASK_KILLED)
I0728 22:58:49.276927  1903 slave.cpp:2664] Asked to shut down framework a950e919-a136-4d23-9058-578d9eb18d9b-0000
by master@172.17.0.6:38803
I0728 22:58:49.276983  1903 slave.cpp:2689] Shutting down framework a950e919-a136-4d23-9058-578d9eb18d9b-0000
I0728 22:58:49.277060  1903 slave.cpp:5131] Shutting down executor 'c0091b35-0255-405a-bc4d-7e2f0b7b84d4'
of framework a950e919-a136-4d23-9058-578d9eb18d9b-0000
W0728 22:58:49.277088  1903 slave.hpp:915] Unable to send event to executor 'c0091b35-0255-405a-bc4d-7e2f0b7b84d4'
of framework a950e919-a136-4d23-9058-578d9eb18d9b-0000: unknown connection type
../../src/tests/command_executor_tests.cpp:396: Failure
Actual function call count doesn't match EXPECT_CALL(slave, executorTerminated(_, _, _))...
         Expected: to be called once
           Actual: never called - unsatisfied and active
I0728 22:58:49.277884  1906 master.cpp:8432] Removing task c0091b35-0255-405a-bc4d-7e2f0b7b84d4
with resources cpus(*)(allocated: *):2; mem(*)(allocated: *):1024; disk(*)(allocated: *):1024;
ports(*)(allocated: *):[31000-32000] of framework a950e919-a136-4d23-9058-578d9eb18d9b-0000
on agent a950e919-a136-4d23-9058-578d9eb18d9b-S0 at (13)@172.17.0.6:38803 (cf2516606fcb)
I0728 22:58:49.278347  1887 hierarchical.cpp:1064] Recovered cpus(*)(allocated: *):2; mem(*)(allocated:
*):1024; disk(*)(allocated: *):1024; ports(*)(allocated: *):[31000-32000] (total: cpus(*):2;
mem(*):1024; disk(*):1024; ports(*):[31000-32000], allocated: {}) on agent a950e919-a136-4d23-9058-578d9eb18d9b-S0
from framework a950e919-a136-4d23-9058-578d9eb18d9b-0000
I0728 22:58:49.278648  1887 hierarchical.cpp:362] Removed framework a950e919-a136-4d23-9058-578d9eb18d9b-0000
*** Aborted at 1501282729 (unix time) try "date -d @1501282729" if you are using GNU date
***
PC: @                0x0 (unknown)
*** SIGSEGV (@0x0) received by PID 1865 (TID 0x7f4e46059700) from PID 0; stack trace: ***
    @     0x7f4e502c7370 (unknown)
make[4]: *** [check-local] Segmentation fault (core dumped)
make[4]: Leaving directory `/mesos/mesos-1.2.2/_build/src'
make[3]: *** [check-am] Error 2
make[3]: Leaving directory `/mesos/mesos-1.2.2/_build/src'
make[2]: *** [check] Error 2
make[2]: Leaving directory `/mesos/mesos-1.2.2/_build/src'
make[1]: *** [check-recursive] Error 1
make[1]: Leaving directory `/mesos/mesos-1.2.2/_build'
make: *** [distcheck] Error 1
+ docker rmi mesos-1501280837-17103
Untagged: mesos-1501280837-17103:latest
Deleted: sha256:9797cbf2dc7bc0c29c563f9e58cc1e35e6f43fcc84892d57f1f308640b2c0a9f
Deleted: sha256:d8a0eb5a801ecb84e16c59945f18950b2ba0f97dfbc7c5e940636feb90f3fb55
Deleted: sha256:503638c38a20e1d55b8421ee9523cc43795da8d0e86a6d82cc6f96e24037cc8d
Deleted: sha256:9796f977043ae88b74191cf5c0a98a4729ce8ea66455ad4ba087cfdf30b355c6
Deleted: sha256:7e3e9a82c76bfaa08fb830dea0d541a0843ad394376b3aa22f128cac5ec95892
Deleted: sha256:f54fc48856d0f2b98eeecb7fdb3028b3558de3d53ba3a3e76ca73b1d9203fb84
Deleted: sha256:c0f69c4d96c5a7b9ce717393cf3affac05badf7a2eebf6030e6dbbd53664f5cd
Deleted: sha256:5abb267d3e4df495c873ad9096a1a1a843e316a961ed76189599f685047b3a69
Deleted: sha256:813275a5abc12f6057ab0e4edb7aa8c6c938cc76362ba578db67162519b94a65
Deleted: sha256:cd2a02f170424be64cc9d63b5114699b8a2026cab2e18f2f7b2551824560b2c4
Deleted: sha256:bdc00d989605e49f1f4444594a6764656d4c6ad4a11782d0caba60e6a639b069
Deleted: sha256:6d9a5a26f906c165d1336d26990c6b9b0360070fc5ea6ae325032d952a41b4c9
Deleted: sha256:2e3bb6106ed51e2b3196eb69b6714cf5525cf2176bafaba8cd0077f20e66844b
Deleted: sha256:b990f1b61c5eda01822dfc90074b73e4a643d0168286aa107d81c5fd8dadd395
Deleted: sha256:7c7c00cf0a00095ac8eba2c145f5aa845302c6a2dcfa69f4aa8fac8a76ffdb16
Deleted: sha256:5d8cb4b8c93ea94a533d873c7c67c784dd01c59d0d62cabf30fc0509ac3d1ca6
Deleted: sha256:edaa636ea1af4c676e0887752ad2b20d34123276e44933590328157338f34438
Deleted: sha256:c908fd355ef3972262273b8bfc2529d3f1a085e7f4b6a720989d174355395069
Deleted: sha256:46ff86f14503efc903a1a82139e7417f708f1e153d13e8723f45d6de6af0fb80
Deleted: sha256:06c9d50bec4ac564102c72c3f29dc659da78987e0ca13559ead5d6a9b94f17de
Deleted: sha256:5a88962573b6265287560f5272f943950b4ecc41f70e959bca8795872f1cde32
Deleted: sha256:15a9b282f15f267c771b48d2da5da7d5cf20417e42ea8f5a4a825aa5f6a6e633
Deleted: sha256:9a11ee74ae69cf1cf1665cc90d0d7166a33f0681c2f513aeae7486d0d7941974
Deleted: sha256:b27a9acb07726d049c65d8298eced0832fbf1865ee8cd9eb8ed129b31d376fde
Deleted: sha256:65947fe008cebb2c7b3f93f57604ace7025d84eb708c5fc8c1b70baa36ca5840
Build step 'Execute shell' marked build as failure
Not sending mail to unregistered user songzihao1990@gmail.com

Mime
View raw message