mesos-builds mailing list archives

Site index · List index
Message view « Date » · « Thread »
Top « Date » · « Thread »
From Apache Jenkins Server <jenk...@builds.apache.org>
Subject Build failed in Jenkins: Mesos-Reviewbot #18577
Date Sun, 23 Jul 2017 10:58:52 GMT
See <https://builds.apache.org/job/Mesos-Reviewbot/18577/display/redirect>

------------------------------------------
[...truncated 30.15 MB...]
I0723 10:58:45.263574  5025 containerizer.cpp:230] Using isolation: posix/cpu,posix/mem,filesystem/posix,network/cni,environment_secret
W0723 10:58:45.264402  5025 backend.cpp:76] Failed to create 'overlay' backend: OverlayBackend
requires root privileges
W0723 10:58:45.264570  5025 backend.cpp:76] Failed to create 'bind' backend: BindBackend requires
root privileges
I0723 10:58:45.264613  5025 provisioner.cpp:255] Using default backend 'copy'
I0723 10:58:45.269510  5051 slave.cpp:250] Mesos agent started on (792)@172.17.0.2:37315
I0723 10:58:45.269552  5051 slave.cpp:251] Flags at startup: --acls="" --appc_simple_discovery_uri_prefix="http://"
--appc_store_dir="/tmp/Endpoint_SlaveEndpointTest_AuthorizedRequest_2_fSbjNh/store/appc" --authenticate_http_readonly="true"
--authenticate_http_readwrite="true" --authenticatee="crammd5" --authentication_backoff_factor="1secs"
--authorizer="local" --cgroups_cpu_enable_pids_and_tids_count="false" --cgroups_enable_cfs="false"
--cgroups_hierarchy="/sys/fs/cgroup" --cgroups_limit_swap="false" --cgroups_root="mesos" --container_disk_watch_interval="15secs"
--containerizers="mesos" --credential="/tmp/Endpoint_SlaveEndpointTest_AuthorizedRequest_2_fSbjNh/credential"
--default_role="*" --disk_watch_interval="1mins" --docker="docker" --docker_kill_orphans="true"
--docker_registry="https://registry-1.docker.io" --docker_remove_delay="6hrs" --docker_socket="/var/run/docker.sock"
--docker_stop_timeout="0ns" --docker_store_dir="/tmp/Endpoint_SlaveEndpointTest_AuthorizedRequest_2_fSbjNh/store/docker"
--docker_volume_checkpoint_dir="/var/run/mesos/isolators/docker/volume" --enforce_container_disk_quota="false"
--executor_registration_timeout="1mins" --executor_reregistration_timeout="2secs" --executor_shutdown_grace_period="5secs"
--fetcher_cache_dir="/tmp/Endpoint_SlaveEndpointTest_AuthorizedRequest_2_fSbjNh/fetch" --fetcher_cache_size="2GB"
--frameworks_home="" --gc_delay="1weeks" --gc_disk_headroom="0.1" --hadoop_home="" --help="false"
--hostname_lookup="true" --http_command_executor="false" --http_credentials="/tmp/Endpoint_SlaveEndpointTest_AuthorizedRequest_2_fSbjNh/http_credentials"
--http_heartbeat_interval="30secs" --initialize_driver_logging="true" --isolation="posix/cpu,posix/mem"
--launcher="posix" --launcher_dir="/mesos/mesos-1.4.0/_build/src" --logbufsecs="0" --logging_level="INFO"
--max_completed_executors_per_framework="150" --oversubscribed_resources_interval="15secs"
--perf_duration="10secs" --perf_interval="1mins" --port="5051" --qos_correction_interval_min="0ns"
--quiet="false" --recover="reconnect" --recovery_timeout="15mins" --registration_backoff_factor="10ms"
--resources="cpus:2;gpus:0;mem:1024;disk:1024;ports:[31000-32000]" --revocable_cpu_low_priority="true"
--runtime_dir="/tmp/Endpoint_SlaveEndpointTest_AuthorizedRequest_2_fSbjNh" --sandbox_directory="/mnt/mesos/sandbox"
--strict="true" --switch_user="true" --systemd_enable_support="true" --systemd_runtime_directory="/run/systemd/system"
--version="false" --work_dir="/tmp/Endpoint_SlaveEndpointTest_AuthorizedRequest_2_chLoAy"
I0723 10:58:45.270265  5051 credentials.hpp:86] Loading credential for authentication from
'/tmp/Endpoint_SlaveEndpointTest_AuthorizedRequest_2_fSbjNh/credential'
I0723 10:58:45.270517  5051 slave.cpp:283] Agent using credential for: test-principal
I0723 10:58:45.270541  5051 credentials.hpp:37] Loading credentials for authentication from
'/tmp/Endpoint_SlaveEndpointTest_AuthorizedRequest_2_fSbjNh/http_credentials'
I0723 10:58:45.270879  5051 http.cpp:993] Creating default 'basic' HTTP authenticator for
realm 'mesos-agent-readonly'
I0723 10:58:45.271085  5051 http.cpp:993] Creating default 'basic' HTTP authenticator for
realm 'mesos-agent-readwrite'
I0723 10:58:45.273196  5051 slave.cpp:565] Agent resources: [{"name":"cpus","scalar":{"value":2.0},"type":"SCALAR"},{"name":"mem","scalar":{"value":1024.0},"type":"SCALAR"},{"name":"disk","scalar":{"value":1024.0},"type":"SCALAR"},{"name":"ports","ranges":{"range":[{"begin":31000,"end":32000}]},"type":"RANGES"}]
I0723 10:58:45.273620  5051 slave.cpp:573] Agent attributes: [  ]
I0723 10:58:45.273643  5051 slave.cpp:582] Agent hostname: 2fa0205e6580
I0723 10:58:45.273912  5045 status_update_manager.cpp:177] Pausing sending status updates
I0723 10:58:45.275768  5044 state.cpp:64] Recovering state from '/tmp/Endpoint_SlaveEndpointTest_AuthorizedRequest_2_chLoAy/meta'
I0723 10:58:45.276319  5047 status_update_manager.cpp:203] Recovering status update manager
I0723 10:58:45.276659  5046 containerizer.cpp:582] Recovering containerizer
I0723 10:58:45.278800  5050 provisioner.cpp:416] Provisioner recovery complete
I0723 10:58:45.279613  5048 slave.cpp:6207] Finished recovery
I0723 10:58:45.280355  5048 slave.cpp:6389] Querying resource estimator for oversubscribable
resources
I0723 10:58:45.280719  5051 slave.cpp:6403] Received oversubscribable resources {} from the
resource estimator
I0723 10:58:45.285141  5048 process.cpp:3837] Handling HTTP event for process 'slave(792)'
with path: '/slave(792)/containers'
I0723 10:58:45.287240  5051 http.cpp:1133] HTTP GET for /slave(792)/containers from 172.17.0.2:44608
I0723 10:58:45.287400  5051 http.cpp:957] Authorizing principal 'test-principal' to GET the
'/containers' endpoint
I0723 10:58:45.292862  5045 slave.cpp:843] Agent terminating
[       OK ] Endpoint/SlaveEndpointTest.AuthorizedRequest/2 (45 ms)
[ RUN      ] Endpoint/SlaveEndpointTest.UnauthorizedRequest/0
I0723 10:58:45.309216  5025 containerizer.cpp:230] Using isolation: posix/cpu,posix/mem,filesystem/posix,network/cni,environment_secret
W0723 10:58:45.309989  5025 backend.cpp:76] Failed to create 'overlay' backend: OverlayBackend
requires root privileges
W0723 10:58:45.310153  5025 backend.cpp:76] Failed to create 'bind' backend: BindBackend requires
root privileges
I0723 10:58:45.310194  5025 provisioner.cpp:255] Using default backend 'copy'
I0723 10:58:45.315306  5048 slave.cpp:250] Mesos agent started on (793)@172.17.0.2:37315
I0723 10:58:45.315347  5048 slave.cpp:251] Flags at startup: --acls="" --appc_simple_discovery_uri_prefix="http://"
--appc_store_dir="/tmp/Endpoint_SlaveEndpointTest_UnauthorizedRequest_0_NfSZ1c/store/appc"
--authenticate_http_readonly="true" --authenticate_http_readwrite="true" --authenticatee="crammd5"
--authentication_backoff_factor="1secs" --authorizer="local" --cgroups_cpu_enable_pids_and_tids_count="false"
--cgroups_enable_cfs="false" --cgroups_hierarchy="/sys/fs/cgroup" --cgroups_limit_swap="false"
--cgroups_root="mesos" --container_disk_watch_interval="15secs" --containerizers="mesos" --credential="/tmp/Endpoint_SlaveEndpointTest_UnauthorizedRequest_0_NfSZ1c/credential"
--default_role="*" --disk_watch_interval="1mins" --docker="docker" --docker_kill_orphans="true"
--docker_registry="https://registry-1.docker.io" --docker_remove_delay="6hrs" --docker_socket="/var/run/docker.sock"
--docker_stop_timeout="0ns" --docker_store_dir="/tmp/Endpoint_SlaveEndpointTest_UnauthorizedRequest_0_NfSZ1c/store/docker"
--docker_volume_checkpoint_dir="/var/run/mesos/isolators/docker/volume" --enforce_container_disk_quota="false"
--executor_registration_timeout="1mins" --executor_reregistration_timeout="2secs" --executor_shutdown_grace_period="5secs"
--fetcher_cache_dir="/tmp/Endpoint_SlaveEndpointTest_UnauthorizedRequest_0_NfSZ1c/fetch" --fetcher_cache_size="2GB"
--frameworks_home="" --gc_delay="1weeks" --gc_disk_headroom="0.1" --hadoop_home="" --help="false"
--hostname_lookup="true" --http_command_executor="false" --http_credentials="/tmp/Endpoint_SlaveEndpointTest_UnauthorizedRequest_0_NfSZ1c/http_credentials"
--http_heartbeat_interval="30secs" --initialize_driver_logging="true" --isolation="posix/cpu,posix/mem"
--launcher="posix" --launcher_dir="/mesos/mesos-1.4.0/_build/src" --logbufsecs="0" --logging_level="INFO"
--max_completed_executors_per_framework="150" --oversubscribed_resources_interval="15secs"
--perf_duration="10secs" --perf_interval="1mins" --port="5051" --qos_correction_interval_min="0ns"
--quiet="false" --recover="reconnect" --recovery_timeout="15mins" --registration_backoff_factor="10ms"
--resources="cpus:2;gpus:0;mem:1024;disk:1024;ports:[31000-32000]" --revocable_cpu_low_priority="true"
--runtime_dir="/tmp/Endpoint_SlaveEndpointTest_UnauthorizedRequest_0_NfSZ1c" --sandbox_directory="/mnt/mesos/sandbox"
--strict="true" --switch_user="true" --systemd_enable_support="true" --systemd_runtime_directory="/run/systemd/system"
--version="false" --work_dir="/tmp/Endpoint_SlaveEndpointTest_UnauthorizedRequest_0_CkbHHt"
I0723 10:58:45.316172  5048 credentials.hpp:86] Loading credential for authentication from
'/tmp/Endpoint_SlaveEndpointTest_UnauthorizedRequest_0_NfSZ1c/credential'
I0723 10:58:45.316546  5048 slave.cpp:283] Agent using credential for: test-principal
I0723 10:58:45.316575  5048 credentials.hpp:37] Loading credentials for authentication from
'/tmp/Endpoint_SlaveEndpointTest_UnauthorizedRequest_0_NfSZ1c/http_credentials'
I0723 10:58:45.317019  5048 http.cpp:993] Creating default 'basic' HTTP authenticator for
realm 'mesos-agent-readonly'
I0723 10:58:45.317332  5048 http.cpp:993] Creating default 'basic' HTTP authenticator for
realm 'mesos-agent-readwrite'
I0723 10:58:45.319589  5048 slave.cpp:565] Agent resources: [{"name":"cpus","scalar":{"value":2.0},"type":"SCALAR"},{"name":"mem","scalar":{"value":1024.0},"type":"SCALAR"},{"name":"disk","scalar":{"value":1024.0},"type":"SCALAR"},{"name":"ports","ranges":{"range":[{"begin":31000,"end":32000}]},"type":"RANGES"}]
I0723 10:58:45.320017  5048 slave.cpp:573] Agent attributes: [  ]
I0723 10:58:45.320039  5048 slave.cpp:582] Agent hostname: 2fa0205e6580
I0723 10:58:45.320379  5050 status_update_manager.cpp:177] Pausing sending status updates
I0723 10:58:45.322465  5046 state.cpp:64] Recovering state from '/tmp/Endpoint_SlaveEndpointTest_UnauthorizedRequest_0_CkbHHt/meta'
I0723 10:58:45.322937  5050 status_update_manager.cpp:203] Recovering status update manager
I0723 10:58:45.323259  5048 containerizer.cpp:582] Recovering containerizer
I0723 10:58:45.325410  5047 provisioner.cpp:416] Provisioner recovery complete
I0723 10:58:45.325983  5046 slave.cpp:6207] Finished recovery
I0723 10:58:45.326620  5046 slave.cpp:6389] Querying resource estimator for oversubscribable
resources
I0723 10:58:45.326968  5044 slave.cpp:6403] Received oversubscribable resources {} from the
resource estimator
I0723 10:58:45.331146  5048 process.cpp:3837] Handling HTTP event for process 'slave(793)'
with path: '/slave(793)/monitor/statistics'
I0723 10:58:45.333226  5044 http.cpp:1133] HTTP GET for /slave(793)/monitor/statistics from
172.17.0.2:44610
I0723 10:58:45.333413  5044 http.cpp:957] Authorizing principal 'test-principal' to GET the
'/monitor/statistics' endpoint
I0723 10:58:45.337126  5051 slave.cpp:843] Agent terminating
[       OK ] Endpoint/SlaveEndpointTest.UnauthorizedRequest/0 (43 ms)
[ RUN      ] Endpoint/SlaveEndpointTest.UnauthorizedRequest/1
I0723 10:58:45.352355  5025 containerizer.cpp:230] Using isolation: posix/cpu,posix/mem,filesystem/posix,network/cni,environment_secret
W0723 10:58:45.353135  5025 backend.cpp:76] Failed to create 'overlay' backend: OverlayBackend
requires root privileges
W0723 10:58:45.353298  5025 backend.cpp:76] Failed to create 'bind' backend: BindBackend requires
root privileges
I0723 10:58:45.353338  5025 provisioner.cpp:255] Using default backend 'copy'
I0723 10:58:45.358379  5044 slave.cpp:250] Mesos agent started on (794)@172.17.0.2:37315
I0723 10:58:45.358422  5044 slave.cpp:251] Flags at startup: --acls="" --appc_simple_discovery_uri_prefix="http://"
--appc_store_dir="/tmp/Endpoint_SlaveEndpointTest_UnauthorizedRequest_1_lJ58I8/store/appc"
--authenticate_http_readonly="true" --authenticate_http_readwrite="true" --authenticatee="crammd5"
--authentication_backoff_factor="1secs" --authorizer="local" --cgroups_cpu_enable_pids_and_tids_count="false"
--cgroups_enable_cfs="false" --cgroups_hierarchy="/sys/fs/cgroup" --cgroups_limit_swap="false"
--cgroups_root="mesos" --container_disk_watch_interval="15secs" --containerizers="mesos" --credential="/tmp/Endpoint_SlaveEndpointTest_UnauthorizedRequest_1_lJ58I8/credential"
--default_role="*" --disk_watch_interval="1mins" --docker="docker" --docker_kill_orphans="true"
--docker_registry="https://registry-1.docker.io" --docker_remove_delay="6hrs" --docker_socket="/var/run/docker.sock"
--docker_stop_timeout="0ns" --docker_store_dir="/tmp/Endpoint_SlaveEndpointTest_UnauthorizedRequest_1_lJ58I8/store/docker"
--docker_volume_checkpoint_dir="/var/run/mesos/isolators/docker/volume" --enforce_container_disk_quota="false"
--executor_registration_timeout="1mins" --executor_reregistration_timeout="2secs" --executor_shutdown_grace_period="5secs"
--fetcher_cache_dir="/tmp/Endpoint_SlaveEndpointTest_UnauthorizedRequest_1_lJ58I8/fetch" --fetcher_cache_size="2GB"
--frameworks_home="" --gc_delay="1weeks" --gc_disk_headroom="0.1" --hadoop_home="" --help="false"
--hostname_lookup="true" --http_command_executor="false" --http_credentials="/tmp/Endpoint_SlaveEndpointTest_UnauthorizedRequest_1_lJ58I8/http_credentials"
--http_heartbeat_interval="30secs" --initialize_driver_logging="true" --isolation="posix/cpu,posix/mem"
--launcher="posix" --launcher_dir="/mesos/mesos-1.4.0/_build/src" --logbufsecs="0" --logging_level="INFO"
--max_completed_executors_per_framework="150" --oversubscribed_resources_interval="15secs"
--perf_duration="10secs" --perf_interval="1mins" --port="5051" --qos_correction_interval_min="0ns"
--quiet="false" --recover="reconnect" --recovery_timeout="15mins" --registration_backoff_factor="10ms"
--resources="cpus:2;gpus:0;mem:1024;disk:1024;ports:[31000-32000]" --revocable_cpu_low_priority="true"
--runtime_dir="/tmp/Endpoint_SlaveEndpointTest_UnauthorizedRequest_1_lJ58I8" --sandbox_directory="/mnt/mesos/sandbox"
--strict="true" --switch_user="true" --systemd_enable_support="true" --systemd_runtime_directory="/run/systemd/system"
--version="false" --work_dir="/tmp/Endpoint_SlaveEndpointTest_UnauthorizedRequest_1_gDfRhp"
I0723 10:58:45.359135  5044 credentials.hpp:86] Loading credential for authentication from
'/tmp/Endpoint_SlaveEndpointTest_UnauthorizedRequest_1_lJ58I8/credential'
I0723 10:58:45.359382  5044 slave.cpp:283] Agent using credential for: test-principal
I0723 10:58:45.359402  5044 credentials.hpp:37] Loading credentials for authentication from
'/tmp/Endpoint_SlaveEndpointTest_UnauthorizedRequest_1_lJ58I8/http_credentials'
I0723 10:58:45.360010  5044 http.cpp:993] Creating default 'basic' HTTP authenticator for
realm 'mesos-agent-readonly'
I0723 10:58:45.360309  5044 http.cpp:993] Creating default 'basic' HTTP authenticator for
realm 'mesos-agent-readwrite'
I0723 10:58:45.362588  5044 slave.cpp:565] Agent resources: [{"name":"cpus","scalar":{"value":2.0},"type":"SCALAR"},{"name":"mem","scalar":{"value":1024.0},"type":"SCALAR"},{"name":"disk","scalar":{"value":1024.0},"type":"SCALAR"},{"name":"ports","ranges":{"range":[{"begin":31000,"end":32000}]},"type":"RANGES"}]
I0723 10:58:45.363023  5044 slave.cpp:573] Agent attributes: [  ]
I0723 10:58:45.363044  5044 slave.cpp:582] Agent hostname: 2fa0205e6580
I0723 10:58:45.363451  5048 status_update_manager.cpp:177] Pausing sending status updates
I0723 10:58:45.365630  5048 state.cpp:64] Recovering state from '/tmp/Endpoint_SlaveEndpointTest_UnauthorizedRequest_1_gDfRhp/meta'
I0723 10:58:45.366209  5051 status_update_manager.cpp:203] Recovering status update manager
I0723 10:58:45.366474  5051 containerizer.cpp:582] Recovering containerizer
I0723 10:58:45.368398  5044 provisioner.cpp:416] Provisioner recovery complete
I0723 10:58:45.368834  5045 slave.cpp:6207] Finished recovery
I0723 10:58:45.369416  5045 slave.cpp:6389] Querying resource estimator for oversubscribable
resources
I0723 10:58:45.369882  5047 slave.cpp:6403] Received oversubscribable resources {} from the
resource estimator
I0723 10:58:45.374094  5047 process.cpp:3837] Handling HTTP event for process 'slave(794)'
with path: '/slave(794)/monitor/statistics.json'
I0723 10:58:45.376025  5050 http.cpp:1133] HTTP GET for /slave(794)/monitor/statistics.json
from 172.17.0.2:44612
I0723 10:58:45.376157  5050 http.cpp:957] Authorizing principal 'test-principal' to GET the
'/monitor/statistics.json' endpoint
I0723 10:58:45.379439  5045 slave.cpp:843] Agent terminating
[       OK ] Endpoint/SlaveEndpointTest.UnauthorizedRequest/1 (42 ms)
[ RUN      ] Endpoint/SlaveEndpointTest.UnauthorizedRequest/2
I0723 10:58:45.394863  5025 containerizer.cpp:230] Using isolation: posix/cpu,posix/mem,filesystem/posix,network/cni,environment_secret
W0723 10:58:45.395655  5025 backend.cpp:76] Failed to create 'overlay' backend: OverlayBackend
requires root privileges
W0723 10:58:45.395833  5025 backend.cpp:76] Failed to create 'bind' backend: BindBackend requires
root privileges
I0723 10:58:45.395880  5025 provisioner.cpp:255] Using default backend 'copy'
I0723 10:58:45.400828  5045 slave.cpp:250] Mesos agent started on (795)@172.17.0.2:37315
I0723 10:58:45.400866  5045 slave.cpp:251] Flags at startup: --acls="" --appc_simple_discovery_uri_prefix="http://"
--appc_store_dir="/tmp/Endpoint_SlaveEndpointTest_UnauthorizedRequest_2_Hg2TR4/store/appc"
--authenticate_http_readonly="true" --authenticate_http_readwrite="true" --authenticatee="crammd5"
--authentication_backoff_factor="1secs" --authorizer="local" --cgroups_cpu_enable_pids_and_tids_count="false"
--cgroups_enable_cfs="false" --cgroups_hierarchy="/sys/fs/cgroup" --cgroups_limit_swap="false"
--cgroups_root="mesos" --container_disk_watch_interval="15secs" --containerizers="mesos" --credential="/tmp/Endpoint_SlaveEndpointTest_UnauthorizedRequest_2_Hg2TR4/credential"
--default_role="*" --disk_watch_interval="1mins" --docker="docker" --docker_kill_orphans="true"
--docker_registry="https://registry-1.docker.io" --docker_remove_delay="6hrs" --docker_socket="/var/run/docker.sock"
--docker_stop_timeout="0ns" --docker_store_dir="/tmp/Endpoint_SlaveEndpointTest_UnauthorizedRequest_2_Hg2TR4/store/docker"
--docker_volume_checkpoint_dir="/var/run/mesos/isolators/docker/volume" --enforce_container_disk_quota="false"
--executor_registration_timeout="1mins" --executor_reregistration_timeout="2secs" --executor_shutdown_grace_period="5secs"
--fetcher_cache_dir="/tmp/Endpoint_SlaveEndpointTest_UnauthorizedRequest_2_Hg2TR4/fetch" --fetcher_cache_size="2GB"
--frameworks_home="" --gc_delay="1weeks" --gc_disk_headroom="0.1" --hadoop_home="" --help="false"
--hostname_lookup="true" --http_command_executor="false" --http_credentials="/tmp/Endpoint_SlaveEndpointTest_UnauthorizedRequest_2_Hg2TR4/http_credentials"
--http_heartbeat_interval="30secs" --initialize_driver_logging="true" --isolation="posix/cpu,posix/mem"
--launcher="posix" --launcher_dir="/mesos/mesos-1.4.0/_build/src" --logbufsecs="0" --logging_level="INFO"
--max_completed_executors_per_framework="150" --oversubscribed_resources_interval="15secs"
--perf_duration="10secs" --perf_interval="1mins" --port="5051" --qos_correction_interval_min="0ns"
--quiet="false" --recover="reconnect" --recovery_timeout="15mins" --registration_backoff_factor="10ms"
--resources="cpus:2;gpus:0;mem:1024;disk:1024;ports:[31000-32000]" --revocable_cpu_low_priority="true"
--runtime_dir="/tmp/Endpoint_SlaveEndpointTest_UnauthorizedRequest_2_Hg2TR4" --sandbox_directory="/mnt/mesos/sandbox"
--strict="true" --switch_user="true" --systemd_enable_support="true" --systemd_runtime_directory="/run/systemd/system"
--version="false" --work_dir="/tmp/Endpoint_SlaveEndpointTest_UnauthorizedRequest_2_Ud1Ijl"
I0723 10:58:45.401587  5045 credentials.hpp:86] Loading credential for authentication from
'/tmp/Endpoint_SlaveEndpointTest_UnauthorizedRequest_2_Hg2TR4/credential'
I0723 10:58:45.401834  5045 slave.cpp:283] Agent using credential for: test-principal
I0723 10:58:45.401855  5045 credentials.hpp:37] Loading credentials for authentication from
'/tmp/Endpoint_SlaveEndpointTest_UnauthorizedRequest_2_Hg2TR4/http_credentials'
I0723 10:58:45.402205  5045 http.cpp:993] Creating default 'basic' HTTP authenticator for
realm 'mesos-agent-readonly'
I0723 10:58:45.402427  5045 http.cpp:993] Creating default 'basic' HTTP authenticator for
realm 'mesos-agent-readwrite'
I0723 10:58:45.404598  5045 slave.cpp:565] Agent resources: [{"name":"cpus","scalar":{"value":2.0},"type":"SCALAR"},{"name":"mem","scalar":{"value":1024.0},"type":"SCALAR"},{"name":"disk","scalar":{"value":1024.0},"type":"SCALAR"},{"name":"ports","ranges":{"range":[{"begin":31000,"end":32000}]},"type":"RANGES"}]
I0723 10:58:45.405026  5045 slave.cpp:573] Agent attributes: [  ]
I0723 10:58:45.405048  5045 slave.cpp:582] Agent hostname: 2fa0205e6580
I0723 10:58:45.405284  5047 status_update_manager.cpp:177] Pausing sending status updates
I0723 10:58:45.407346  5049 state.cpp:64] Recovering state from '/tmp/Endpoint_SlaveEndpointTest_UnauthorizedRequest_2_Ud1Ijl/meta'
I0723 10:58:45.407827  5050 status_update_manager.cpp:203] Recovering status update manager
I0723 10:58:45.408195  5048 containerizer.cpp:582] Recovering containerizer
I0723 10:58:45.410457  5048 provisioner.cpp:416] Provisioner recovery complete
I0723 10:58:45.411097  5046 slave.cpp:6207] Finished recovery
I0723 10:58:45.411806  5046 slave.cpp:6389] Querying resource estimator for oversubscribable
resources
I0723 10:58:45.412204  5045 slave.cpp:6403] Received oversubscribable resources {} from the
resource estimator
I0723 10:58:45.416379  5045 process.cpp:3837] Handling HTTP event for process 'slave(795)'
with path: '/slave(795)/containers'
I0723 10:58:45.418303  5050 http.cpp:1133] HTTP GET for /slave(795)/containers from 172.17.0.2:44614
I0723 10:58:45.418432  5050 http.cpp:957] Authorizing principal 'test-principal' to GET the
'/containers' endpoint
I0723 10:58:45.421993  5025 slave.cpp:843] Agent terminating
[       OK ] Endpoint/SlaveEndpointTest.UnauthorizedRequest/2 (42 ms)
[ RUN      ] Endpoint/SlaveEndpointTest.NoAuthorizer/0
I0723 10:58:45.438104  5025 containerizer.cpp:230] Using isolation: posix/cpu,posix/mem,filesystem/posix,network/cni,environment_secret
W0723 10:58:45.438980  5025 backend.cpp:76] Failed to create 'overlay' backend: OverlayBackend
requires root privileges
W0723 10:58:45.439219  5025 backend.cpp:76] Failed to create 'bind' backend: BindBackend requires
root privileges
I0723 10:58:45.439266  5025 provisioner.cpp:255] Using default backend 'copy'
I0723 10:58:45.441715  5025 cluster.cpp:448] Creating default 'local' authorizer
I0723 10:58:45.444545  5045 slave.cpp:250] Mesos agent started on (796)@172.17.0.2:37315
I0723 10:58:45.444638  5045 slave.cpp:251] Flags at startup: --acls="" --appc_simple_discovery_uri_prefix="http://"
--appc_store_dir="/tmp/Endpoint_SlaveEndpointTest_NoAuthorizer_0_ZnYhs1/store/appc" --authenticate_http_readonly="true"
--authenticate_http_readwrite="true" --authenticatee="crammd5" --authentication_backoff_factor="1secs"
--authorizer="local" --cgroups_cpu_enable_pids_and_tids_count="false" --cgroups_enable_cfs="false"
--cgroups_hierarchy="/sys/fs/cgroup" --cgroups_limit_swap="false" --cgroups_root="mesos" --container_disk_watch_interval="15secs"
--containerizers="mesos" --credential="/tmp/Endpoint_SlaveEndpointTest_NoAuthorizer_0_ZnYhs1/credential"
--default_role="*" --disk_watch_interval="1mins" --docker="docker" --docker_kill_orphans="true"
--docker_registry="https://registry-1.docker.io" --docker_remove_delay="6hrs" --docker_socket="/var/run/docker.sock"
--docker_stop_timeout="0ns" --docker_store_dir="/tmp/Endpoint_SlaveEndpointTest_NoAuthorizer_0_ZnYhs1/store/docker"
--docker_volume_checkpoint_dir="/var/run/mesos/isolators/docker/volume" --enforce_container_disk_quota="false"
--executor_registration_timeout="1mins" --executor_reregistration_timeout="2secs" --executor_shutdown_grace_period="5secs"
--fetcher_cache_dir="/tmp/Endpoint_SlaveEndpointTest_NoAuthorizer_0_ZnYhs1/fetch" --fetcher_cache_size="2GB"
--frameworks_home="" --gc_delay="1weeks" --gc_disk_headroom="0.1" --hadoop_home="" --help="false"
--hostname_lookup="true" --http_command_executor="false" --http_credentials="/tmp/Endpoint_SlaveEndpointTest_NoAuthorizer_0_ZnYhs1/http_credentials"
--http_heartbeat_interval="30secs" --initialize_driver_logging="true" --isolation="posix/cpu,posix/mem"
--launcher="posix" --launcher_dir="/mesos/mesos-1.4.0/_build/src" --logbufsecs="0" --logging_level="INFO"
--max_completed_executors_per_framework="150" --oversubscribed_resources_interval="15secs"
--perf_duration="10secs" --perf_interval="1mins" --port="5051" --qos_correction_interval_min="0ns"
--quiet="false" --recover="reconnect" --recovery_timeout="15mins" --registration_backoff_factor="10ms"
--resources="cpus:2;gpus:0;mem:1024;disk:1024;ports:[31000-32000]" --revocable_cpu_low_priority="true"
--runtime_dir="/tmp/Endpoint_SlaveEndpointTest_NoAuthorizer_0_ZnYhs1" --sandbox_directory="/mnt/mesos/sandbox"
--strict="true" --switch_user="true" --systemd_enable_support="true" --systemd_runtime_directory="/run/systemd/system"
--version="false" --work_dir="/tmp/Endpoint_SlaveEndpointTest_NoAuthorizer_0_c1AbNh"
I0723 10:58:45.445389  5045 credentials.hpp:86] Loading credential for authentication from
'/tmp/Endpoint_SlaveEndpointTest_NoAuthorizer_0_ZnYhs1/credential'
I0723 10:58:45.445754  5045 slave.cpp:283] Agent using credential for: test-principal
I0723 10:58:45.445827  5045 credentials.hpp:37] Loading credentials for authentication from
'/tmp/Endpoint_SlaveEndpointTest_NoAuthorizer_0_ZnYhs1/http_credentials'
I0723 10:58:45.446275  5045 http.cpp:993] Creating default 'basic' HTTP authenticator for
realm 'mesos-agent-readonly'
I0723 10:58:45.446550  5045 http.cpp:993] Creating default 'basic' HTTP authenticator for
realm 'mesos-agent-readwrite'
I0723 10:58:45.448765  5045 slave.cpp:565] Agent resources: [{"name":"cpus","scalar":{"value":2.0},"type":"SCALAR"},{"name":"mem","scalar":{"value":1024.0},"type":"SCALAR"},{"name":"disk","scalar":{"value":1024.0},"type":"SCALAR"},{"name":"ports","ranges":{"range":[{"begin":31000,"end":32000}]},"type":"RANGES"}]
I0723 10:58:45.449193  5045 slave.cpp:573] Agent attributes: [  ]
I0723 10:58:45.449286  5045 slave.cpp:582] Agent hostname: 2fa0205e6580
I0723 10:58:45.449687  5051 status_update_manager.cpp:177] Pausing sending status updates
I0723 10:58:45.451861  5046 state.cpp:64] Recovering state from '/tmp/Endpoint_SlaveEndpointTest_NoAuthorizer_0_c1AbNh/meta'
I0723 10:58:45.452416  5050 status_update_manager.cpp:203] Recovering status update manager
I0723 10:58:45.452725  5044 containerizer.cpp:582] Recovering containerizer
I0723 10:58:45.455171  5044 provisioner.cpp:416] Provisioner recovery complete
I0723 10:58:45.455824  5045 slave.cpp:6207] Finished recovery
I0723 10:58:45.456493  5045 slave.cpp:6389] Querying resource estimator for oversubscribable
resources
I0723 10:58:45.456897  5048 slave.cpp:6403] Received oversubscribable resources {} from the
resource estimator
I0723 10:58:45.461009  5048 process.cpp:3837] Handling HTTP event for process 'slave(796)'
with path: '/slave(796)/monitor/statistics'
I0723 10:58:45.462935  5045 http.cpp:1133] HTTP GET for /slave(796)/monitor/statistics from
172.17.0.2:44616
I0723 10:58:45.463062  5045 http.cpp:957] Authorizing principal 'test-principal' to GET the
'/monitor/statistics' endpoint
I0723 10:58:45.468914  5050 slave.cpp:843] Agent terminating
[       OK ] Endpoint/SlaveEndpointTest.NoAuthorizer/0 (52 ms)
[ RUN      ] Endpoint/SlaveEndpointTest.NoAuthorizer/1
I0723 10:58:45.489717  5025 containerizer.cpp:230] Using isolation: posix/cpu,posix/mem,filesystem/posix,network/cni,environment_secret
W0723 10:58:45.490499  5025 backend.cpp:76] Failed to create 'overlay' backend: OverlayBackend
requires root privileges
W0723 10:58:45.490666  5025 backend.cpp:76] Failed to create 'bind' backend: BindBackend requires
root privileges
I0723 10:58:45.490710  5025 provisioner.cpp:255] Using default backend 'copy'
I0723 10:58:45.493048  5025 cluster.cpp:448] Creating default 'local' authorizer
I0723 10:58:45.495760  5045 slave.cpp:250] Mesos agent started on (797)@172.17.0.2:37315
I0723 10:58:45.495802  5045 slave.cpp:251] Flags at startup: --acls="" --appc_simple_discovery_uri_prefix="http://"
--appc_store_dir="/tmp/Endpoint_SlaveEndpointTest_NoAuthorizer_1_VL42yY/store/appc" --authenticate_http_readonly="true"
--authenticate_http_readwrite="true" --authenticatee="crammd5" --authentication_backoff_factor="1secs"
--authorizer="local" --cgroups_cpu_enable_pids_and_tids_count="false" --cgroups_enable_cfs="false"
--cgroups_hierarchy="/sys/fs/cgroup" --cgroups_limit_swap="false" --cgroups_root="mesos" --container_disk_watch_interval="15secs"
--containerizers="mesos" --credential="/tmp/Endpoint_SlaveEndpointTest_NoAuthorizer_1_VL42yY/credential"
--default_role="*" --disk_watch_interval="1mins" --docker="docker" --docker_kill_orphans="true"
--docker_registry="https://registry-1.docker.io" --docker_remove_delay="6hrs" --docker_socket="/var/run/docker.sock"
--docker_stop_timeout="0ns" --docker_store_dir="/tmp/Endpoint_SlaveEndpointTest_NoAuthorizer_1_VL42yY/store/docker"
--docker_volume_checkpoint_dir="/var/run/mesos/isolators/docker/volume" --enforce_container_disk_quota="false"
--executor_registration_timeout="1mins" --executor_reregistration_timeout="2secs" --executor_shutdown_grace_period="5secs"
--fetcher_cache_dir="/tmp/Endpoint_SlaveEndpointTest_NoAuthorizer_1_VL42yY/fetch" --fetcher_cache_size="2GB"
--frameworks_home="" --gc_delay="1weeks" --gc_disk_headroom="0.1" --hadoop_home="" --help="false"
--hostname_lookup="true" --http_command_executor="false" --http_credentials="/tmp/Endpoint_SlaveEndpointTest_NoAuthorizer_1_VL42yY/http_credentials"
--http_heartbeat_interval="30secs" --initialize_driver_logging="true" --isolation="posix/cpu,posix/mem"
--launcher="posix" --launcher_dir="/mesos/mesos-1.4.0/_build/src" --logbufsecs="0" --logging_level="INFO"
--max_completed_executors_per_framework="150" --oversubscribed_resources_interval="15secs"
--perf_duration="10secs" --perf_interval="1mins" --port="5051" --qos_correction_interval_min="0ns"
--quiet="false" --recover="reconnect" --recovery_timeout="15mins" --registration_backoff_factor="10ms"
--resources="cpus:2;gpus:0;mem:1024;disk:1024;ports:[31000-32000]" --revocable_cpu_low_priority="true"
--runtime_dir="/tmp/Endpoint_SlaveEndpointTest_NoAuthorizer_1_VL42yY" --sandbox_directory="/mnt/mesos/sandbox"
--strict="true" --switch_user="true" --systemd_enable_support="true" --systemd_runtime_directory="/run/systemd/system"
--version="false" --work_dir="/tmp/Endpoint_SlaveEndpointTest_NoAuthorizer_1_0SMzLe"
I0723 10:58:45.496661  5045 credentials.hpp:86] Loading credential for authentication from
'/tmp/Endpoint_SlaveEndpointTest_NoAuthorizer_1_VL42yY/credential'
I0723 10:58:45.497066  5045 slave.cpp:283] Agent using credential for: test-principal
I0723 10:58:45.497098  5045 credentials.hpp:37] Loading credentials for authentication from
'/tmp/Endpoint_SlaveEndpointTest_NoAuthorizer_1_VL42yY/http_credentials'
I0723 10:58:45.497630  5045 http.cpp:993] Creating default 'basic' HTTP authenticator for
realm 'mesos-agent-readonly'
I0723 10:58:45.497966  5045 http.cpp:993] Creating default 'basic' HTTP authenticator for
realm 'mesos-agent-readwrite'
I0723 10:58:45.500232  5045 slave.cpp:565] Agent resources: [{"name":"cpus","scalar":{"value":2.0},"type":"SCALAR"},{"name":"mem","scalar":{"value":1024.0},"type":"SCALAR"},{"name":"disk","scalar":{"value":1024.0},"type":"SCALAR"},{"name":"ports","ranges":{"range":[{"begin":31000,"end":32000}]},"type":"RANGES"}]
I0723 10:58:45.500664  5045 slave.cpp:573] Agent attributes: [  ]
I0723 10:58:45.500689  5045 slave.cpp:582] Agent hostname: 2fa0205e6580
I0723 10:58:45.501034  5046 status_update_manager.cpp:177] Pausing sending status updates
I0723 10:58:45.503142  5050 state.cpp:64] Recovering state from '/tmp/Endpoint_SlaveEndpointTest_NoAuthorizer_1_0SMzLe/meta'
I0723 10:58:45.503630  5044 status_update_manager.cpp:203] Recovering status update manager
I0723 10:58:45.503923  5045 containerizer.cpp:582] Recovering containerizer
I0723 10:58:45.506090  5048 provisioner.cpp:416] Provisioner recovery complete
I0723 10:58:45.506690  5051 slave.cpp:6207] Finished recovery
I0723 10:58:45.507484  5051 slave.cpp:6389] Querying resource estimator for oversubscribable
resources
I0723 10:58:45.507959  5045 slave.cpp:6403] Received oversubscribable resources {} from the
resource estimator
I0723 10:58:45.512516  5044 process.cpp:3837] Handling HTTP event for process 'slave(797)'
with path: '/slave(797)/monitor/statistics.json'
I0723 10:58:45.514418  5045 http.cpp:1133] HTTP GET for /slave(797)/monitor/statistics.json
from 172.17.0.2:44618
I0723 10:58:45.514570  5045 http.cpp:957] Authorizing principal 'test-principal' to GET the
'/monitor/statistics.json' endpoint
I0723 10:58:45.520071  5025 slave.cpp:843] Agent terminating
[       OK ] Endpoint/SlaveEndpointTest.NoAuthorizer/1 (46 ms)
[ RUN      ] Endpoint/SlaveEndpointTest.NoAuthorizer/2
I0723 10:58:45.535774  5025 containerizer.cpp:230] Using isolation: posix/cpu,posix/mem,filesystem/posix,network/cni,environment_secret
W0723 10:58:45.536587  5025 backend.cpp:76] Failed to create 'overlay' backend: OverlayBackend
requires root privileges
W0723 10:58:45.536767  5025 backend.cpp:76] Failed to create 'bind' backend: BindBackend requires
root privileges
I0723 10:58:45.536813  5025 provisioner.cpp:255] Using default backend 'copy'
I0723 10:58:45.539314  5025 cluster.cpp:448] Creating default 'local' authorizer
I0723 10:58:45.541991  5050 slave.cpp:250] Mesos agent started on (798)@172.17.0.2:37315
I0723 10:58:45.542032  5050 slave.cpp:251] Flags at startup: --acls="" --appc_simple_discovery_uri_prefix="http://"
--appc_store_dir="/tmp/Endpoint_SlaveEndpointTest_NoAuthorizer_2_NH9naW/store/appc" --authenticate_http_readonly="true"
--authenticate_http_readwrite="true" --authenticatee="crammd5" --authentication_backoff_factor="1secs"
--authorizer="local" --cgroups_cpu_enable_pids_and_tids_count="false" --cgroups_enable_cfs="false"
--cgroups_hierarchy="/sys/fs/cgroup" --cgroups_limit_swap="false" --cgroups_root="mesos" --container_disk_watch_interval="15secs"
--containerizers="mesos" --credential="/tmp/Endpoint_SlaveEndpointTest_NoAuthorizer_2_NH9naW/credential"
--default_role="*" --disk_watch_interval="1mins" --docker="docker" --docker_kill_orphans="true"
--docker_registry="https://registry-1.docker.io" --docker_remove_delay="6hrs" --docker_socket="/var/run/docker.sock"
--docker_stop_timeout="0ns" --docker_store_dir="/tmp/Endpoint_SlaveEndpointTest_NoAuthorizer_2_NH9naW/store/docker"
--docker_volume_checkpoint_dir="/var/run/mesos/isolators/docker/volume" --enforce_container_disk_quota="false"
--executor_registration_timeout="1mins" --executor_reregistration_timeout="2secs" --executor_shutdown_grace_period="5secs"
--fetcher_cache_dir="/tmp/Endpoint_SlaveEndpointTest_NoAuthorizer_2_NH9naW/fetch" --fetcher_cache_size="2GB"
--frameworks_home="" --gc_delay="1weeks" --gc_disk_headroom="0.1" --hadoop_home="" --help="false"
--hostname_lookup="true" --http_command_executor="false" --http_credentials="/tmp/Endpoint_SlaveEndpointTest_NoAuthorizer_2_NH9naW/http_credentials"
--http_heartbeat_interval="30secs" --initialize_driver_logging="true" --isolation="posix/cpu,posix/mem"
--launcher="posix" --launcher_dir="/mesos/mesos-1.4.0/_build/src" --logbufsecs="0" --logging_level="INFO"
--max_completed_executors_per_framework="150" --oversubscribed_resources_interval="15secs"
--perf_duration="10secs" --perf_interval="1mins" --port="5051" --qos_correction_interval_min="0ns"
--quiet="false" --recover="reconnect" --recovery_timeout="15mins" --registration_backoff_factor="10ms"
--resources="cpus:2;gpus:0;mem:1024;disk:1024;ports:[31000-32000]" --revocable_cpu_low_priority="true"
--runtime_dir="/tmp/Endpoint_SlaveEndpointTest_NoAuthorizer_2_NH9naW" --sandbox_directory="/mnt/mesos/sandbox"
--strict="true" --switch_user="true" --systemd_enable_support="true" --systemd_runtime_directory="/run/systemd/system"
--version="false" --work_dir="/tmp/Endpoint_SlaveEndpointTest_NoAuthorizer_2_G8ctfc"
I0723 10:58:45.542770  5050 credentials.hpp:86] Loading credential for authentication from
'/tmp/Endpoint_SlaveEndpointTest_NoAuthorizer_2_NH9naW/credential'
I0723 10:58:45.543023  5050 slave.cpp:283] Agent using credential for: test-principal
I0723 10:58:45.543056  5050 credentials.hpp:37] Loading credentials for authentication from
'/tmp/Endpoint_SlaveEndpointTest_NoAuthorizer_2_NH9naW/http_credentials'
I0723 10:58:45.543437  5050 http.cpp:993] Creating default 'basic' HTTP authenticator for
realm 'mesos-agent-readonly'
I0723 10:58:45.543659  5050 http.cpp:993] Creating default 'basic' HTTP authenticator for
realm 'mesos-agent-readwrite'
I0723 10:58:45.545815  5050 slave.cpp:565] Agent resources: [{"name":"cpus","scalar":{"value":2.0},"type":"SCALAR"},{"name":"mem","scalar":{"value":1024.0},"type":"SCALAR"},{"name":"disk","scalar":{"value":1024.0},"type":"SCALAR"},{"name":"ports","ranges":{"range":[{"begin":31000,"end":32000}]},"type":"RANGES"}]
I0723 10:58:45.546247  5050 slave.cpp:573] Agent attributes: [  ]
I0723 10:58:45.546267  5050 slave.cpp:582] Agent hostname: 2fa0205e6580
I0723 10:58:45.546584  5044 status_update_manager.cpp:177] Pausing sending status updates
I0723 10:58:45.548463  5051 state.cpp:64] Recovering state from '/tmp/Endpoint_SlaveEndpointTest_NoAuthorizer_2_G8ctfc/meta'
I0723 10:58:45.548981  5044 status_update_manager.cpp:203] Recovering status update manager
I0723 10:58:45.549413  5048 containerizer.cpp:582] Recovering containerizer
I0723 10:58:45.551672  5050 provisioner.cpp:416] Provisioner recovery complete
I0723 10:58:45.552259  5044 slave.cpp:6207] Finished recovery
I0723 10:58:45.552975  5044 slave.cpp:6389] Querying resource estimator for oversubscribable
resources
I0723 10:58:45.553342  5050 slave.cpp:6403] Received oversubscribable resources {} from the
resource estimator
I0723 10:58:45.557792  5050 process.cpp:3837] Handling HTTP event for process 'slave(798)'
with path: '/slave(798)/containers'
I0723 10:58:45.559698  5046 http.cpp:1133] HTTP GET for /slave(798)/containers from 172.17.0.2:44620
I0723 10:58:45.559983  5046 http.cpp:957] Authorizing principal 'test-principal' to GET the
'/containers' endpoint
I0723 10:58:45.566354  5049 slave.cpp:843] Agent terminating
[       OK ] Endpoint/SlaveEndpointTest.NoAuthorizer/2 (47 ms)
[----------] 9 tests from Endpoint/SlaveEndpointTest (413 ms total)

[----------] Global test environment tear-down
[==========] 1637 tests from 179 test cases ran. (720454 ms total)
[  PASSED  ] 1633 tests.
[  FAILED  ] 4 tests, listed below:
[  FAILED  ] DefaultExecutorCheckTest.CommandCheckDeliveredAndReconciled
[  FAILED  ] DefaultExecutorCheckTest.CommandCheckStatusChange
[  FAILED  ] DefaultExecutorCheckTest.CommandCheckSeesParentsEnv
[  FAILED  ] DefaultExecutorCheckTest.CommandCheckSharesWorkDirWithTask

 4 FAILED TESTS
  YOU HAVE 20 DISABLED TESTS

I0723 10:58:45.711299  5052 process.cpp:1006] Failed to accept socket: future discarded
make[4]: *** [check-local] Error 1
make[4]: Leaving directory `/mesos/mesos-1.4.0/_build/src'
make[3]: *** [check-am] Error 2
make[3]: Leaving directory `/mesos/mesos-1.4.0/_build/src'
make[2]: *** [check] Error 2
make[2]: Leaving directory `/mesos/mesos-1.4.0/_build/src'
make[1]: *** [check-recursive] Error 1
make[1]: Leaving directory `/mesos/mesos-1.4.0/_build'
make: *** [distcheck] Error 1
+ docker rmi mesos-1500801871-6472
Untagged: mesos-1500801871-6472:latest
Deleted: sha256:091fd53b6c366418fce05aad2dbbe9a4cf900a1152be9fa265201c6becc7fa30
Deleted: sha256:4a06c7d5050b7aadf90212968569ba565da6a2401a1d764219662f2759cc97b5
Deleted: sha256:b636e8d17f36029fd5232cf7ac8151cf604aff1067eda2ac7647d52338fb4f59
Deleted: sha256:aeba73ecfeb6f0d15498a99dd44cc358b66a5a5867c07d8bf13f8a4333aebf2b
Deleted: sha256:23f16fa3f63ee57bfda687efdcfcf9a02fe87d9c9fde801a36ab90de8ca251a7
Deleted: sha256:cc878bab264b7890d5216642ff679e398ed0e2a5cd9fa01a441739d204991edd
Deleted: sha256:692bdb43f0a3d58499248f5e6475176fb92afce5360f5b784be560e2d5be30a0
Deleted: sha256:71ab9c59779c4469621005b93820e85bbeb6b42bf146f848c1be3e28d1f33ce9
Deleted: sha256:75485df9037e081b07f56640518a0ce526add8e2055a61aa722e4d7786c1f931
Deleted: sha256:76f91b551ff438d300e9535c738e1c0f4faf365697d8f9d153e23cc5962a19e3
Deleted: sha256:0e53f9c0457ce6adbc2902de3ae21fbcccd2f5201f71ea8d6e446ad5c4640018
Deleted: sha256:e200c914e5715023f469fffe45b3c00800918cb7e4381c1fc385d033808f40ca
Deleted: sha256:a2636ad20a912af51146c5898a5fbaadaf8206e084e8ef7084d9cc73634775f9
Deleted: sha256:a77eb1664b5458425869a9e4e9b637a4d4e811b0e9777f9400bf40f32668625e
Deleted: sha256:22408f98b320d92836274efc825887a78f83cb8a74bd4aeae1e573b9d13fea3f
Deleted: sha256:102d1f93b970300740ede949d9d238fc9dffc8b567e113898cc6cd593807c1e0
Deleted: sha256:d100b2037fe15eed43475441b8648bee24428f340b023e06b38a55aa7a82f09b
Deleted: sha256:7dedf6dddee56a4d23137a42899620484539603f754652eb9c29164ad58c71cf
Deleted: sha256:3669c8ecc358eca3ff7795bea54cacf89ea8e2f589bdb23bb8f1c2236011044c
Deleted: sha256:8b39dbca12b4e750fef81e9b190075d05f55fac8916f0e383527fd1ad2707ddd
Deleted: sha256:0f123c77d33e9f3c629245ef95d1d108e66180785ec9b0c29b37577504c59c0c
Deleted: sha256:bd337d4c79fb33982c73996a1bec12ddf7e5e67460b3b2284c0a116b94586a98
Deleted: sha256:68d6adb6acff7551ac65b4d15e393c719c8ce80e3c76a74161906d5ec0b4b7d7
Deleted: sha256:2f7a889f1764c1397177710aa932811edcd896dd338c91cd6c38c90e40c02ecb
Build step 'Execute shell' marked build as failure

Mime
View raw message