mesos-builds mailing list archives

Site index · List index
Message view « Date » · « Thread »
Top « Date » · « Thread »
From Apache Jenkins Server <jenk...@builds.apache.org>
Subject Build failed in Jenkins: Mesos-Buildbot » autotools,clang,--verbose --enable-libevent --enable-ssl,GLOG_v=1 MESOS_VERBOSE=1,ubuntu:14.04,(ubuntu)&&(!ubuntu-us1)&&(!ubuntu-eu2) #3979
Date Sat, 29 Jul 2017 01:36:06 GMT
See <https://builds.apache.org/job/Mesos-Buildbot/BUILDTOOL=autotools,COMPILER=clang,CONFIGURATION=--verbose%20--enable-libevent%20--enable-ssl,ENVIRONMENT=GLOG_v=1%20MESOS_VERBOSE=1,OS=ubuntu%3A14.04,label_exp=(ubuntu)&&(!ubuntu-us1)&&(!ubuntu-eu2)/3979/display/redirect?page=changes>

Changes:

[mpark] Added MESOS-7728 to 1.3.1 CHANGELOG.

------------------------------------------
[...truncated 28.23 MB...]
I0729 01:35:50.555605 16329 process.cpp:3741] Handling HTTP event for process 'slave(746)'
with path: '/slave(746)/containers'
I0729 01:35:50.557154 16335 http.cpp:1115] HTTP GET for /slave(746)/containers from 172.17.0.5:46250
I0729 01:35:50.557276 16335 http.cpp:936] Authorizing principal 'test-principal' to GET the
'/containers' endpoint
I0729 01:35:50.561009 16325 slave.cpp:796] Agent terminating
[       OK ] Endpoint/SlaveEndpointTest.AuthorizedRequest/2 (31 ms)
[ RUN      ] Endpoint/SlaveEndpointTest.UnauthorizedRequest/0
I0729 01:35:50.573225 31317 containerizer.cpp:221] Using isolation: posix/cpu,posix/mem,filesystem/posix,network/cni
W0729 01:35:50.573863 31317 backend.cpp:76] Failed to create 'aufs' backend: AufsBackend requires
root privileges
W0729 01:35:50.573979 31317 backend.cpp:76] Failed to create 'bind' backend: BindBackend requires
root privileges
I0729 01:35:50.574021 31317 provisioner.cpp:249] Using default backend 'copy'
I0729 01:35:50.577420 16326 slave.cpp:231] Mesos agent started on (747)@172.17.0.5:41079
I0729 01:35:50.577463 16326 slave.cpp:232] Flags at startup: --acls="" --appc_simple_discovery_uri_prefix="http://"
--appc_store_dir="/tmp/mesos/store/appc" --authenticate_http_executors="true" --authenticate_http_readonly="true"
--authenticate_http_readwrite="true" --authenticatee="crammd5" --authentication_backoff_factor="1secs"
--authorizer="local" --cgroups_cpu_enable_pids_and_tids_count="false" --cgroups_enable_cfs="false"
--cgroups_hierarchy="/sys/fs/cgroup" --cgroups_limit_swap="false" --cgroups_root="mesos" --container_disk_watch_interval="15secs"
--containerizers="mesos" --credential="/tmp/Endpoint_SlaveEndpointTest_UnauthorizedRequest_0_NYUf59/credential"
--default_role="*" --disk_watch_interval="1mins" --docker="docker" --docker_kill_orphans="true"
--docker_registry="https://registry-1.docker.io" --docker_remove_delay="6hrs" --docker_socket="/var/run/docker.sock"
--docker_stop_timeout="0ns" --docker_store_dir="/tmp/mesos/store/docker" --docker_volume_checkpoint_dir="/var/run/mesos/isolators/docker/volume"
--enforce_container_disk_quota="false" --executor_registration_timeout="1mins" --executor_reregistration_timeout="2secs"
--executor_secret_key="/tmp/Endpoint_SlaveEndpointTest_UnauthorizedRequest_0_NYUf59/executor_secret_key"
--executor_shutdown_grace_period="5secs" --fetcher_cache_dir="/tmp/Endpoint_SlaveEndpointTest_UnauthorizedRequest_0_NYUf59/fetch"
--fetcher_cache_size="2GB" --frameworks_home="" --gc_delay="1weeks" --gc_disk_headroom="0.1"
--hadoop_home="" --help="false" --hostname_lookup="true" --http_command_executor="false" --http_credentials="/tmp/Endpoint_SlaveEndpointTest_UnauthorizedRequest_0_NYUf59/http_credentials"
--http_heartbeat_interval="30secs" --initialize_driver_logging="true" --isolation="posix/cpu,posix/mem"
--launcher="posix" --launcher_dir="/mesos/mesos-1.3.1/_build/src" --logbufsecs="0" --logging_level="INFO"
--max_completed_executors_per_framework="150" --oversubscribed_resources_interval="15secs"
--perf_duration="10secs" --perf_interval="1mins" --port="5051" --qos_correction_interval_min="0ns"
--quiet="false" --recover="reconnect" --recovery_timeout="15mins" --registration_backoff_factor="10ms"
--resources="cpus:2;gpus:0;mem:1024;disk:1024;ports:[31000-32000]" --revocable_cpu_low_priority="true"
--runtime_dir="/tmp/Endpoint_SlaveEndpointTest_UnauthorizedRequest_0_NYUf59" --sandbox_directory="/mnt/mesos/sandbox"
--strict="true" --switch_user="true" --systemd_enable_support="true" --systemd_runtime_directory="/run/systemd/system"
--version="false" --work_dir="/tmp/Endpoint_SlaveEndpointTest_UnauthorizedRequest_0_at3Do3"
I0729 01:35:50.577975 16326 credentials.hpp:86] Loading credential for authentication from
'/tmp/Endpoint_SlaveEndpointTest_UnauthorizedRequest_0_NYUf59/credential'
I0729 01:35:50.578179 16326 slave.cpp:264] Agent using credential for: test-principal
I0729 01:35:50.578207 16326 credentials.hpp:37] Loading credentials for authentication from
'/tmp/Endpoint_SlaveEndpointTest_UnauthorizedRequest_0_NYUf59/http_credentials'
I0729 01:35:50.578538 16326 http.cpp:975] Creating default 'basic' HTTP authenticator for
realm 'mesos-agent-executor'
I0729 01:35:50.578701 16326 http.cpp:996] Creating default 'jwt' HTTP authenticator for realm
'mesos-agent-executor'
I0729 01:35:50.578946 16326 http.cpp:975] Creating default 'basic' HTTP authenticator for
realm 'mesos-agent-readonly'
I0729 01:35:50.579071 16326 http.cpp:996] Creating default 'jwt' HTTP authenticator for realm
'mesos-agent-readonly'
I0729 01:35:50.579318 16326 http.cpp:975] Creating default 'basic' HTTP authenticator for
realm 'mesos-agent-readwrite'
I0729 01:35:50.579422 16326 http.cpp:996] Creating default 'jwt' HTTP authenticator for realm
'mesos-agent-readwrite'
I0729 01:35:50.581044 16326 slave.cpp:531] Agent resources: cpus(*):2; mem(*):1024; disk(*):1024;
ports(*):[31000-32000]
I0729 01:35:50.581147 16326 slave.cpp:539] Agent attributes: [  ]
I0729 01:35:50.581164 16326 slave.cpp:544] Agent hostname: 979f733825a6
I0729 01:35:50.581298 16325 status_update_manager.cpp:177] Pausing sending status updates
I0729 01:35:50.582662 16331 state.cpp:62] Recovering state from '/tmp/Endpoint_SlaveEndpointTest_UnauthorizedRequest_0_at3Do3/meta'
I0729 01:35:50.582876 16328 status_update_manager.cpp:203] Recovering status update manager
I0729 01:35:50.583042 16330 containerizer.cpp:608] Recovering containerizer
I0729 01:35:50.584257 16332 provisioner.cpp:410] Provisioner recovery complete
I0729 01:35:50.584606 16337 slave.cpp:6075] Finished recovery
I0729 01:35:50.585080 16337 slave.cpp:6257] Querying resource estimator for oversubscribable
resources
I0729 01:35:50.585299 16327 slave.cpp:6271] Received oversubscribable resources {} from the
resource estimator
I0729 01:35:50.587661 16332 process.cpp:3741] Handling HTTP event for process 'slave(747)'
with path: '/slave(747)/monitor/statistics'
I0729 01:35:50.589439 16329 http.cpp:1115] HTTP GET for /slave(747)/monitor/statistics from
172.17.0.5:46251
I0729 01:35:50.589556 16329 http.cpp:936] Authorizing principal 'test-principal' to GET the
'/monitor/statistics' endpoint
I0729 01:35:50.591779 16338 slave.cpp:796] Agent terminating
[       OK ] Endpoint/SlaveEndpointTest.UnauthorizedRequest/0 (29 ms)
[ RUN      ] Endpoint/SlaveEndpointTest.UnauthorizedRequest/1
I0729 01:35:50.602107 31317 containerizer.cpp:221] Using isolation: posix/cpu,posix/mem,filesystem/posix,network/cni
W0729 01:35:50.602684 31317 backend.cpp:76] Failed to create 'aufs' backend: AufsBackend requires
root privileges
W0729 01:35:50.602805 31317 backend.cpp:76] Failed to create 'bind' backend: BindBackend requires
root privileges
I0729 01:35:50.602845 31317 provisioner.cpp:249] Using default backend 'copy'
I0729 01:35:50.606047 16338 slave.cpp:231] Mesos agent started on (748)@172.17.0.5:41079
I0729 01:35:50.606088 16338 slave.cpp:232] Flags at startup: --acls="" --appc_simple_discovery_uri_prefix="http://"
--appc_store_dir="/tmp/mesos/store/appc" --authenticate_http_executors="true" --authenticate_http_readonly="true"
--authenticate_http_readwrite="true" --authenticatee="crammd5" --authentication_backoff_factor="1secs"
--authorizer="local" --cgroups_cpu_enable_pids_and_tids_count="false" --cgroups_enable_cfs="false"
--cgroups_hierarchy="/sys/fs/cgroup" --cgroups_limit_swap="false" --cgroups_root="mesos" --container_disk_watch_interval="15secs"
--containerizers="mesos" --credential="/tmp/Endpoint_SlaveEndpointTest_UnauthorizedRequest_1_ytrU5A/credential"
--default_role="*" --disk_watch_interval="1mins" --docker="docker" --docker_kill_orphans="true"
--docker_registry="https://registry-1.docker.io" --docker_remove_delay="6hrs" --docker_socket="/var/run/docker.sock"
--docker_stop_timeout="0ns" --docker_store_dir="/tmp/mesos/store/docker" --docker_volume_checkpoint_dir="/var/run/mesos/isolators/docker/volume"
--enforce_container_disk_quota="false" --executor_registration_timeout="1mins" --executor_reregistration_timeout="2secs"
--executor_secret_key="/tmp/Endpoint_SlaveEndpointTest_UnauthorizedRequest_1_ytrU5A/executor_secret_key"
--executor_shutdown_grace_period="5secs" --fetcher_cache_dir="/tmp/Endpoint_SlaveEndpointTest_UnauthorizedRequest_1_ytrU5A/fetch"
--fetcher_cache_size="2GB" --frameworks_home="" --gc_delay="1weeks" --gc_disk_headroom="0.1"
--hadoop_home="" --help="false" --hostname_lookup="true" --http_command_executor="false" --http_credentials="/tmp/Endpoint_SlaveEndpointTest_UnauthorizedRequest_1_ytrU5A/http_credentials"
--http_heartbeat_interval="30secs" --initialize_driver_logging="true" --isolation="posix/cpu,posix/mem"
--launcher="posix" --launcher_dir="/mesos/mesos-1.3.1/_build/src" --logbufsecs="0" --logging_level="INFO"
--max_completed_executors_per_framework="150" --oversubscribed_resources_interval="15secs"
--perf_duration="10secs" --perf_interval="1mins" --port="5051" --qos_correction_interval_min="0ns"
--quiet="false" --recover="reconnect" --recovery_timeout="15mins" --registration_backoff_factor="10ms"
--resources="cpus:2;gpus:0;mem:1024;disk:1024;ports:[31000-32000]" --revocable_cpu_low_priority="true"
--runtime_dir="/tmp/Endpoint_SlaveEndpointTest_UnauthorizedRequest_1_ytrU5A" --sandbox_directory="/mnt/mesos/sandbox"
--strict="true" --switch_user="true" --systemd_enable_support="true" --systemd_runtime_directory="/run/systemd/system"
--version="false" --work_dir="/tmp/Endpoint_SlaveEndpointTest_UnauthorizedRequest_1_gu0yku"
I0729 01:35:50.606684 16338 credentials.hpp:86] Loading credential for authentication from
'/tmp/Endpoint_SlaveEndpointTest_UnauthorizedRequest_1_ytrU5A/credential'
I0729 01:35:50.606868 16338 slave.cpp:264] Agent using credential for: test-principal
I0729 01:35:50.606894 16338 credentials.hpp:37] Loading credentials for authentication from
'/tmp/Endpoint_SlaveEndpointTest_UnauthorizedRequest_1_ytrU5A/http_credentials'
I0729 01:35:50.607233 16338 http.cpp:975] Creating default 'basic' HTTP authenticator for
realm 'mesos-agent-executor'
I0729 01:35:50.607370 16338 http.cpp:996] Creating default 'jwt' HTTP authenticator for realm
'mesos-agent-executor'
I0729 01:35:50.607659 16338 http.cpp:975] Creating default 'basic' HTTP authenticator for
realm 'mesos-agent-readonly'
I0729 01:35:50.607889 16338 http.cpp:996] Creating default 'jwt' HTTP authenticator for realm
'mesos-agent-readonly'
I0729 01:35:50.608114 16338 http.cpp:975] Creating default 'basic' HTTP authenticator for
realm 'mesos-agent-readwrite'
I0729 01:35:50.608203 16338 http.cpp:996] Creating default 'jwt' HTTP authenticator for realm
'mesos-agent-readwrite'
I0729 01:35:50.610085 16338 slave.cpp:531] Agent resources: cpus(*):2; mem(*):1024; disk(*):1024;
ports(*):[31000-32000]
I0729 01:35:50.610195 16338 slave.cpp:539] Agent attributes: [  ]
I0729 01:35:50.610215 16338 slave.cpp:544] Agent hostname: 979f733825a6
I0729 01:35:50.610363 16325 status_update_manager.cpp:177] Pausing sending status updates
I0729 01:35:50.611861 16337 state.cpp:62] Recovering state from '/tmp/Endpoint_SlaveEndpointTest_UnauthorizedRequest_1_gu0yku/meta'
I0729 01:35:50.612162 16339 status_update_manager.cpp:203] Recovering status update manager
I0729 01:35:50.612416 16334 containerizer.cpp:608] Recovering containerizer
I0729 01:35:50.613927 16334 provisioner.cpp:410] Provisioner recovery complete
I0729 01:35:50.614430 16331 slave.cpp:6075] Finished recovery
I0729 01:35:50.614928 16331 slave.cpp:6257] Querying resource estimator for oversubscribable
resources
I0729 01:35:50.615128 16335 slave.cpp:6271] Received oversubscribable resources {} from the
resource estimator
I0729 01:35:50.617156 16340 process.cpp:3741] Handling HTTP event for process 'slave(748)'
with path: '/slave(748)/monitor/statistics.json'
I0729 01:35:50.618762 16339 http.cpp:1115] HTTP GET for /slave(748)/monitor/statistics.json
from 172.17.0.5:46252
I0729 01:35:50.618834 16339 http.cpp:936] Authorizing principal 'test-principal' to GET the
'/monitor/statistics.json' endpoint
I0729 01:35:50.620669 16328 slave.cpp:796] Agent terminating
[       OK ] Endpoint/SlaveEndpointTest.UnauthorizedRequest/1 (29 ms)
[ RUN      ] Endpoint/SlaveEndpointTest.UnauthorizedRequest/2
I0729 01:35:50.632220 31317 containerizer.cpp:221] Using isolation: posix/cpu,posix/mem,filesystem/posix,network/cni
W0729 01:35:50.632751 31317 backend.cpp:76] Failed to create 'aufs' backend: AufsBackend requires
root privileges
W0729 01:35:50.632869 31317 backend.cpp:76] Failed to create 'bind' backend: BindBackend requires
root privileges
I0729 01:35:50.632913 31317 provisioner.cpp:249] Using default backend 'copy'
I0729 01:35:50.636262 16340 slave.cpp:231] Mesos agent started on (749)@172.17.0.5:41079
I0729 01:35:50.636312 16340 slave.cpp:232] Flags at startup: --acls="" --appc_simple_discovery_uri_prefix="http://"
--appc_store_dir="/tmp/mesos/store/appc" --authenticate_http_executors="true" --authenticate_http_readonly="true"
--authenticate_http_readwrite="true" --authenticatee="crammd5" --authentication_backoff_factor="1secs"
--authorizer="local" --cgroups_cpu_enable_pids_and_tids_count="false" --cgroups_enable_cfs="false"
--cgroups_hierarchy="/sys/fs/cgroup" --cgroups_limit_swap="false" --cgroups_root="mesos" --container_disk_watch_interval="15secs"
--containerizers="mesos" --credential="/tmp/Endpoint_SlaveEndpointTest_UnauthorizedRequest_2_37j3p2/credential"
--default_role="*" --disk_watch_interval="1mins" --docker="docker" --docker_kill_orphans="true"
--docker_registry="https://registry-1.docker.io" --docker_remove_delay="6hrs" --docker_socket="/var/run/docker.sock"
--docker_stop_timeout="0ns" --docker_store_dir="/tmp/mesos/store/docker" --docker_volume_checkpoint_dir="/var/run/mesos/isolators/docker/volume"
--enforce_container_disk_quota="false" --executor_registration_timeout="1mins" --executor_reregistration_timeout="2secs"
--executor_secret_key="/tmp/Endpoint_SlaveEndpointTest_UnauthorizedRequest_2_37j3p2/executor_secret_key"
--executor_shutdown_grace_period="5secs" --fetcher_cache_dir="/tmp/Endpoint_SlaveEndpointTest_UnauthorizedRequest_2_37j3p2/fetch"
--fetcher_cache_size="2GB" --frameworks_home="" --gc_delay="1weeks" --gc_disk_headroom="0.1"
--hadoop_home="" --help="false" --hostname_lookup="true" --http_command_executor="false" --http_credentials="/tmp/Endpoint_SlaveEndpointTest_UnauthorizedRequest_2_37j3p2/http_credentials"
--http_heartbeat_interval="30secs" --initialize_driver_logging="true" --isolation="posix/cpu,posix/mem"
--launcher="posix" --launcher_dir="/mesos/mesos-1.3.1/_build/src" --logbufsecs="0" --logging_level="INFO"
--max_completed_executors_per_framework="150" --oversubscribed_resources_interval="15secs"
--perf_duration="10secs" --perf_interval="1mins" --port="5051" --qos_correction_interval_min="0ns"
--quiet="false" --recover="reconnect" --recovery_timeout="15mins" --registration_backoff_factor="10ms"
--resources="cpus:2;gpus:0;mem:1024;disk:1024;ports:[31000-32000]" --revocable_cpu_low_priority="true"
--runtime_dir="/tmp/Endpoint_SlaveEndpointTest_UnauthorizedRequest_2_37j3p2" --sandbox_directory="/mnt/mesos/sandbox"
--strict="true" --switch_user="true" --systemd_enable_support="true" --systemd_runtime_directory="/run/systemd/system"
--version="false" --work_dir="/tmp/Endpoint_SlaveEndpointTest_UnauthorizedRequest_2_QhzOzV"
I0729 01:35:50.636852 16340 credentials.hpp:86] Loading credential for authentication from
'/tmp/Endpoint_SlaveEndpointTest_UnauthorizedRequest_2_37j3p2/credential'
I0729 01:35:50.637042 16340 slave.cpp:264] Agent using credential for: test-principal
I0729 01:35:50.637068 16340 credentials.hpp:37] Loading credentials for authentication from
'/tmp/Endpoint_SlaveEndpointTest_UnauthorizedRequest_2_37j3p2/http_credentials'
I0729 01:35:50.637409 16340 http.cpp:975] Creating default 'basic' HTTP authenticator for
realm 'mesos-agent-executor'
I0729 01:35:50.637573 16340 http.cpp:996] Creating default 'jwt' HTTP authenticator for realm
'mesos-agent-executor'
I0729 01:35:50.637814 16340 http.cpp:975] Creating default 'basic' HTTP authenticator for
realm 'mesos-agent-readonly'
I0729 01:35:50.637945 16340 http.cpp:996] Creating default 'jwt' HTTP authenticator for realm
'mesos-agent-readonly'
I0729 01:35:50.638286 16340 http.cpp:975] Creating default 'basic' HTTP authenticator for
realm 'mesos-agent-readwrite'
I0729 01:35:50.638402 16340 http.cpp:996] Creating default 'jwt' HTTP authenticator for realm
'mesos-agent-readwrite'
I0729 01:35:50.639902 16340 slave.cpp:531] Agent resources: cpus(*):2; mem(*):1024; disk(*):1024;
ports(*):[31000-32000]
I0729 01:35:50.639999 16340 slave.cpp:539] Agent attributes: [  ]
I0729 01:35:50.640015 16340 slave.cpp:544] Agent hostname: 979f733825a6
I0729 01:35:50.640164 16337 status_update_manager.cpp:177] Pausing sending status updates
I0729 01:35:50.641856 16337 state.cpp:62] Recovering state from '/tmp/Endpoint_SlaveEndpointTest_UnauthorizedRequest_2_QhzOzV/meta'
I0729 01:35:50.642067 16333 status_update_manager.cpp:203] Recovering status update manager
I0729 01:35:50.642231 16339 containerizer.cpp:608] Recovering containerizer
I0729 01:35:50.643376 16336 provisioner.cpp:410] Provisioner recovery complete
I0729 01:35:50.643715 16331 slave.cpp:6075] Finished recovery
I0729 01:35:50.644167 16331 slave.cpp:6257] Querying resource estimator for oversubscribable
resources
I0729 01:35:50.644408 16338 slave.cpp:6271] Received oversubscribable resources {} from the
resource estimator
I0729 01:35:50.646499 16333 process.cpp:3741] Handling HTTP event for process 'slave(749)'
with path: '/slave(749)/containers'
I0729 01:35:50.648937 16326 http.cpp:1115] HTTP GET for /slave(749)/containers from 172.17.0.5:46254
I0729 01:35:50.649022 16326 http.cpp:936] Authorizing principal 'test-principal' to GET the
'/containers' endpoint
I0729 01:35:50.651180 16339 slave.cpp:796] Agent terminating
[       OK ] Endpoint/SlaveEndpointTest.UnauthorizedRequest/2 (29 ms)
[ RUN      ] Endpoint/SlaveEndpointTest.NoAuthorizer/0
I0729 01:35:50.660429 31317 containerizer.cpp:221] Using isolation: posix/cpu,posix/mem,filesystem/posix,network/cni
W0729 01:35:50.660837 31317 backend.cpp:76] Failed to create 'aufs' backend: AufsBackend requires
root privileges
W0729 01:35:50.660929 31317 backend.cpp:76] Failed to create 'bind' backend: BindBackend requires
root privileges
I0729 01:35:50.660959 31317 provisioner.cpp:249] Using default backend 'copy'
I0729 01:35:50.662364 31317 cluster.cpp:448] Creating default 'local' authorizer
I0729 01:35:50.663702 16337 slave.cpp:231] Mesos agent started on (750)@172.17.0.5:41079
I0729 01:35:50.663741 16337 slave.cpp:232] Flags at startup: --acls="" --appc_simple_discovery_uri_prefix="http://"
--appc_store_dir="/tmp/mesos/store/appc" --authenticate_http_executors="true" --authenticate_http_readonly="true"
--authenticate_http_readwrite="true" --authenticatee="crammd5" --authentication_backoff_factor="1secs"
--authorizer="local" --cgroups_cpu_enable_pids_and_tids_count="false" --cgroups_enable_cfs="false"
--cgroups_hierarchy="/sys/fs/cgroup" --cgroups_limit_swap="false" --cgroups_root="mesos" --container_disk_watch_interval="15secs"
--containerizers="mesos" --credential="/tmp/Endpoint_SlaveEndpointTest_NoAuthorizer_0_d4012t/credential"
--default_role="*" --disk_watch_interval="1mins" --docker="docker" --docker_kill_orphans="true"
--docker_registry="https://registry-1.docker.io" --docker_remove_delay="6hrs" --docker_socket="/var/run/docker.sock"
--docker_stop_timeout="0ns" --docker_store_dir="/tmp/mesos/store/docker" --docker_volume_checkpoint_dir="/var/run/mesos/isolators/docker/volume"
--enforce_container_disk_quota="false" --executor_registration_timeout="1mins" --executor_reregistration_timeout="2secs"
--executor_secret_key="/tmp/Endpoint_SlaveEndpointTest_NoAuthorizer_0_d4012t/executor_secret_key"
--executor_shutdown_grace_period="5secs" --fetcher_cache_dir="/tmp/Endpoint_SlaveEndpointTest_NoAuthorizer_0_d4012t/fetch"
--fetcher_cache_size="2GB" --frameworks_home="" --gc_delay="1weeks" --gc_disk_headroom="0.1"
--hadoop_home="" --help="false" --hostname_lookup="true" --http_command_executor="false" --http_credentials="/tmp/Endpoint_SlaveEndpointTest_NoAuthorizer_0_d4012t/http_credentials"
--http_heartbeat_interval="30secs" --initialize_driver_logging="true" --isolation="posix/cpu,posix/mem"
--launcher="posix" --launcher_dir="/mesos/mesos-1.3.1/_build/src" --logbufsecs="0" --logging_level="INFO"
--max_completed_executors_per_framework="150" --oversubscribed_resources_interval="15secs"
--perf_duration="10secs" --perf_interval="1mins" --port="5051" --qos_correction_interval_min="0ns"
--quiet="false" --recover="reconnect" --recovery_timeout="15mins" --registration_backoff_factor="10ms"
--resources="cpus:2;gpus:0;mem:1024;disk:1024;ports:[31000-32000]" --revocable_cpu_low_priority="true"
--runtime_dir="/tmp/Endpoint_SlaveEndpointTest_NoAuthorizer_0_d4012t" --sandbox_directory="/mnt/mesos/sandbox"
--strict="true" --switch_user="true" --systemd_enable_support="true" --systemd_runtime_directory="/run/systemd/system"
--version="false" --work_dir="/tmp/Endpoint_SlaveEndpointTest_NoAuthorizer_0_Mch87m"
I0729 01:35:50.664161 16337 credentials.hpp:86] Loading credential for authentication from
'/tmp/Endpoint_SlaveEndpointTest_NoAuthorizer_0_d4012t/credential'
I0729 01:35:50.664288 16337 slave.cpp:264] Agent using credential for: test-principal
I0729 01:35:50.664306 16337 credentials.hpp:37] Loading credentials for authentication from
'/tmp/Endpoint_SlaveEndpointTest_NoAuthorizer_0_d4012t/http_credentials'
I0729 01:35:50.664539 16337 http.cpp:975] Creating default 'basic' HTTP authenticator for
realm 'mesos-agent-executor'
I0729 01:35:50.664640 16337 http.cpp:996] Creating default 'jwt' HTTP authenticator for realm
'mesos-agent-executor'
I0729 01:35:50.664839 16337 http.cpp:975] Creating default 'basic' HTTP authenticator for
realm 'mesos-agent-readonly'
I0729 01:35:50.664921 16337 http.cpp:996] Creating default 'jwt' HTTP authenticator for realm
'mesos-agent-readonly'
I0729 01:35:50.665114 16337 http.cpp:975] Creating default 'basic' HTTP authenticator for
realm 'mesos-agent-readwrite'
I0729 01:35:50.665221 16337 http.cpp:996] Creating default 'jwt' HTTP authenticator for realm
'mesos-agent-readwrite'
I0729 01:35:50.666481 16337 slave.cpp:531] Agent resources: cpus(*):2; mem(*):1024; disk(*):1024;
ports(*):[31000-32000]
I0729 01:35:50.666563 16337 slave.cpp:539] Agent attributes: [  ]
I0729 01:35:50.666584 16337 slave.cpp:544] Agent hostname: 979f733825a6
I0729 01:35:50.666703 16339 status_update_manager.cpp:177] Pausing sending status updates
I0729 01:35:50.667923 16339 state.cpp:62] Recovering state from '/tmp/Endpoint_SlaveEndpointTest_NoAuthorizer_0_Mch87m/meta'
I0729 01:35:50.668278 16335 status_update_manager.cpp:203] Recovering status update manager
I0729 01:35:50.668460 16329 containerizer.cpp:608] Recovering containerizer
I0729 01:35:50.669838 16327 provisioner.cpp:410] Provisioner recovery complete
I0729 01:35:50.670181 16330 slave.cpp:6075] Finished recovery
I0729 01:35:50.670671 16330 slave.cpp:6257] Querying resource estimator for oversubscribable
resources
I0729 01:35:50.670958 16335 slave.cpp:6271] Received oversubscribable resources {} from the
resource estimator
I0729 01:35:50.672585 16332 process.cpp:3741] Handling HTTP event for process 'slave(750)'
with path: '/slave(750)/monitor/statistics'
I0729 01:35:50.674002 16327 http.cpp:1115] HTTP GET for /slave(750)/monitor/statistics from
172.17.0.5:46255
I0729 01:35:50.674064 16327 http.cpp:936] Authorizing principal 'test-principal' to GET the
'/monitor/statistics' endpoint
I0729 01:35:50.676964 16338 slave.cpp:796] Agent terminating
[       OK ] Endpoint/SlaveEndpointTest.NoAuthorizer/0 (25 ms)
[ RUN      ] Endpoint/SlaveEndpointTest.NoAuthorizer/1
I0729 01:35:50.685828 31317 containerizer.cpp:221] Using isolation: posix/cpu,posix/mem,filesystem/posix,network/cni
W0729 01:35:50.686224 31317 backend.cpp:76] Failed to create 'aufs' backend: AufsBackend requires
root privileges
W0729 01:35:50.686305 31317 backend.cpp:76] Failed to create 'bind' backend: BindBackend requires
root privileges
I0729 01:35:50.686332 31317 provisioner.cpp:249] Using default backend 'copy'
I0729 01:35:50.687635 31317 cluster.cpp:448] Creating default 'local' authorizer
I0729 01:35:50.688984 16332 slave.cpp:231] Mesos agent started on (751)@172.17.0.5:41079
I0729 01:35:50.689020 16332 slave.cpp:232] Flags at startup: --acls="" --appc_simple_discovery_uri_prefix="http://"
--appc_store_dir="/tmp/mesos/store/appc" --authenticate_http_executors="true" --authenticate_http_readonly="true"
--authenticate_http_readwrite="true" --authenticatee="crammd5" --authentication_backoff_factor="1secs"
--authorizer="local" --cgroups_cpu_enable_pids_and_tids_count="false" --cgroups_enable_cfs="false"
--cgroups_hierarchy="/sys/fs/cgroup" --cgroups_limit_swap="false" --cgroups_root="mesos" --container_disk_watch_interval="15secs"
--containerizers="mesos" --credential="/tmp/Endpoint_SlaveEndpointTest_NoAuthorizer_1_0XWHWV/credential"
--default_role="*" --disk_watch_interval="1mins" --docker="docker" --docker_kill_orphans="true"
--docker_registry="https://registry-1.docker.io" --docker_remove_delay="6hrs" --docker_socket="/var/run/docker.sock"
--docker_stop_timeout="0ns" --docker_store_dir="/tmp/mesos/store/docker" --docker_volume_checkpoint_dir="/var/run/mesos/isolators/docker/volume"
--enforce_container_disk_quota="false" --executor_registration_timeout="1mins" --executor_reregistration_timeout="2secs"
--executor_secret_key="/tmp/Endpoint_SlaveEndpointTest_NoAuthorizer_1_0XWHWV/executor_secret_key"
--executor_shutdown_grace_period="5secs" --fetcher_cache_dir="/tmp/Endpoint_SlaveEndpointTest_NoAuthorizer_1_0XWHWV/fetch"
--fetcher_cache_size="2GB" --frameworks_home="" --gc_delay="1weeks" --gc_disk_headroom="0.1"
--hadoop_home="" --help="false" --hostname_lookup="true" --http_command_executor="false" --http_credentials="/tmp/Endpoint_SlaveEndpointTest_NoAuthorizer_1_0XWHWV/http_credentials"
--http_heartbeat_interval="30secs" --initialize_driver_logging="true" --isolation="posix/cpu,posix/mem"
--launcher="posix" --launcher_dir="/mesos/mesos-1.3.1/_build/src" --logbufsecs="0" --logging_level="INFO"
--max_completed_executors_per_framework="150" --oversubscribed_resources_interval="15secs"
--perf_duration="10secs" --perf_interval="1mins" --port="5051" --qos_correction_interval_min="0ns"
--quiet="false" --recover="reconnect" --recovery_timeout="15mins" --registration_backoff_factor="10ms"
--resources="cpus:2;gpus:0;mem:1024;disk:1024;ports:[31000-32000]" --revocable_cpu_low_priority="true"
--runtime_dir="/tmp/Endpoint_SlaveEndpointTest_NoAuthorizer_1_0XWHWV" --sandbox_directory="/mnt/mesos/sandbox"
--strict="true" --switch_user="true" --systemd_enable_support="true" --systemd_runtime_directory="/run/systemd/system"
--version="false" --work_dir="/tmp/Endpoint_SlaveEndpointTest_NoAuthorizer_1_xXXGXO"
I0729 01:35:50.689463 16332 credentials.hpp:86] Loading credential for authentication from
'/tmp/Endpoint_SlaveEndpointTest_NoAuthorizer_1_0XWHWV/credential'
I0729 01:35:50.689647 16332 slave.cpp:264] Agent using credential for: test-principal
I0729 01:35:50.689671 16332 credentials.hpp:37] Loading credentials for authentication from
'/tmp/Endpoint_SlaveEndpointTest_NoAuthorizer_1_0XWHWV/http_credentials'
I0729 01:35:50.689972 16332 http.cpp:975] Creating default 'basic' HTTP authenticator for
realm 'mesos-agent-executor'
I0729 01:35:50.690080 16332 http.cpp:996] Creating default 'jwt' HTTP authenticator for realm
'mesos-agent-executor'
I0729 01:35:50.690368 16332 http.cpp:975] Creating default 'basic' HTTP authenticator for
realm 'mesos-agent-readonly'
I0729 01:35:50.690481 16332 http.cpp:996] Creating default 'jwt' HTTP authenticator for realm
'mesos-agent-readonly'
I0729 01:35:50.690773 16332 http.cpp:975] Creating default 'basic' HTTP authenticator for
realm 'mesos-agent-readwrite'
I0729 01:35:50.690887 16332 http.cpp:996] Creating default 'jwt' HTTP authenticator for realm
'mesos-agent-readwrite'
I0729 01:35:50.692492 16332 slave.cpp:531] Agent resources: cpus(*):2; mem(*):1024; disk(*):1024;
ports(*):[31000-32000]
I0729 01:35:50.692584 16332 slave.cpp:539] Agent attributes: [  ]
I0729 01:35:50.692600 16332 slave.cpp:544] Agent hostname: 979f733825a6
I0729 01:35:50.692739 16334 status_update_manager.cpp:177] Pausing sending status updates
I0729 01:35:50.694118 16333 state.cpp:62] Recovering state from '/tmp/Endpoint_SlaveEndpointTest_NoAuthorizer_1_xXXGXO/meta'
I0729 01:35:50.694327 16327 status_update_manager.cpp:203] Recovering status update manager
I0729 01:35:50.694504 16326 containerizer.cpp:608] Recovering containerizer
I0729 01:35:50.695693 16335 provisioner.cpp:410] Provisioner recovery complete
I0729 01:35:50.695986 16339 slave.cpp:6075] Finished recovery
I0729 01:35:50.696401 16339 slave.cpp:6257] Querying resource estimator for oversubscribable
resources
I0729 01:35:50.696677 16338 slave.cpp:6271] Received oversubscribable resources {} from the
resource estimator
I0729 01:35:50.698356 16339 process.cpp:3741] Handling HTTP event for process 'slave(751)'
with path: '/slave(751)/monitor/statistics.json'
I0729 01:35:50.700028 16338 http.cpp:1115] HTTP GET for /slave(751)/monitor/statistics.json
from 172.17.0.5:46256
I0729 01:35:50.700109 16338 http.cpp:936] Authorizing principal 'test-principal' to GET the
'/monitor/statistics.json' endpoint
I0729 01:35:50.703472 16325 slave.cpp:796] Agent terminating
[       OK ] Endpoint/SlaveEndpointTest.NoAuthorizer/1 (26 ms)
[ RUN      ] Endpoint/SlaveEndpointTest.NoAuthorizer/2
I0729 01:35:50.712193 31317 containerizer.cpp:221] Using isolation: posix/cpu,posix/mem,filesystem/posix,network/cni
W0729 01:35:50.712571 31317 backend.cpp:76] Failed to create 'aufs' backend: AufsBackend requires
root privileges
W0729 01:35:50.712651 31317 backend.cpp:76] Failed to create 'bind' backend: BindBackend requires
root privileges
I0729 01:35:50.712685 31317 provisioner.cpp:249] Using default backend 'copy'
I0729 01:35:50.713990 31317 cluster.cpp:448] Creating default 'local' authorizer
I0729 01:35:50.715318 16338 slave.cpp:231] Mesos agent started on (752)@172.17.0.5:41079
I0729 01:35:50.715350 16338 slave.cpp:232] Flags at startup: --acls="" --appc_simple_discovery_uri_prefix="http://"
--appc_store_dir="/tmp/mesos/store/appc" --authenticate_http_executors="true" --authenticate_http_readonly="true"
--authenticate_http_readwrite="true" --authenticatee="crammd5" --authentication_backoff_factor="1secs"
--authorizer="local" --cgroups_cpu_enable_pids_and_tids_count="false" --cgroups_enable_cfs="false"
--cgroups_hierarchy="/sys/fs/cgroup" --cgroups_limit_swap="false" --cgroups_root="mesos" --container_disk_watch_interval="15secs"
--containerizers="mesos" --credential="/tmp/Endpoint_SlaveEndpointTest_NoAuthorizer_2_KNUs7n/credential"
--default_role="*" --disk_watch_interval="1mins" --docker="docker" --docker_kill_orphans="true"
--docker_registry="https://registry-1.docker.io" --docker_remove_delay="6hrs" --docker_socket="/var/run/docker.sock"
--docker_stop_timeout="0ns" --docker_store_dir="/tmp/mesos/store/docker" --docker_volume_checkpoint_dir="/var/run/mesos/isolators/docker/volume"
--enforce_container_disk_quota="false" --executor_registration_timeout="1mins" --executor_reregistration_timeout="2secs"
--executor_secret_key="/tmp/Endpoint_SlaveEndpointTest_NoAuthorizer_2_KNUs7n/executor_secret_key"
--executor_shutdown_grace_period="5secs" --fetcher_cache_dir="/tmp/Endpoint_SlaveEndpointTest_NoAuthorizer_2_KNUs7n/fetch"
--fetcher_cache_size="2GB" --frameworks_home="" --gc_delay="1weeks" --gc_disk_headroom="0.1"
--hadoop_home="" --help="false" --hostname_lookup="true" --http_command_executor="false" --http_credentials="/tmp/Endpoint_SlaveEndpointTest_NoAuthorizer_2_KNUs7n/http_credentials"
--http_heartbeat_interval="30secs" --initialize_driver_logging="true" --isolation="posix/cpu,posix/mem"
--launcher="posix" --launcher_dir="/mesos/mesos-1.3.1/_build/src" --logbufsecs="0" --logging_level="INFO"
--max_completed_executors_per_framework="150" --oversubscribed_resources_interval="15secs"
--perf_duration="10secs" --perf_interval="1mins" --port="5051" --qos_correction_interval_min="0ns"
--quiet="false" --recover="reconnect" --recovery_timeout="15mins" --registration_backoff_factor="10ms"
--resources="cpus:2;gpus:0;mem:1024;disk:1024;ports:[31000-32000]" --revocable_cpu_low_priority="true"
--runtime_dir="/tmp/Endpoint_SlaveEndpointTest_NoAuthorizer_2_KNUs7n" --sandbox_directory="/mnt/mesos/sandbox"
--strict="true" --switch_user="true" --systemd_enable_support="true" --systemd_runtime_directory="/run/systemd/system"
--version="false" --work_dir="/tmp/Endpoint_SlaveEndpointTest_NoAuthorizer_2_Thy93g"
I0729 01:35:50.715705 16338 credentials.hpp:86] Loading credential for authentication from
'/tmp/Endpoint_SlaveEndpointTest_NoAuthorizer_2_KNUs7n/credential'
I0729 01:35:50.715819 16338 slave.cpp:264] Agent using credential for: test-principal
I0729 01:35:50.715837 16338 credentials.hpp:37] Loading credentials for authentication from
'/tmp/Endpoint_SlaveEndpointTest_NoAuthorizer_2_KNUs7n/http_credentials'
I0729 01:35:50.716063 16338 http.cpp:975] Creating default 'basic' HTTP authenticator for
realm 'mesos-agent-executor'
I0729 01:35:50.716154 16338 http.cpp:996] Creating default 'jwt' HTTP authenticator for realm
'mesos-agent-executor'
I0729 01:35:50.716342 16338 http.cpp:975] Creating default 'basic' HTTP authenticator for
realm 'mesos-agent-readonly'
I0729 01:35:50.716449 16338 http.cpp:996] Creating default 'jwt' HTTP authenticator for realm
'mesos-agent-readonly'
I0729 01:35:50.716629 16338 http.cpp:975] Creating default 'basic' HTTP authenticator for
realm 'mesos-agent-readwrite'
I0729 01:35:50.716711 16338 http.cpp:996] Creating default 'jwt' HTTP authenticator for realm
'mesos-agent-readwrite'
I0729 01:35:50.717968 16338 slave.cpp:531] Agent resources: cpus(*):2; mem(*):1024; disk(*):1024;
ports(*):[31000-32000]
I0729 01:35:50.718041 16338 slave.cpp:539] Agent attributes: [  ]
I0729 01:35:50.718052 16338 slave.cpp:544] Agent hostname: 979f733825a6
I0729 01:35:50.718192 16340 status_update_manager.cpp:177] Pausing sending status updates
I0729 01:35:50.719197 16328 state.cpp:62] Recovering state from '/tmp/Endpoint_SlaveEndpointTest_NoAuthorizer_2_Thy93g/meta'
I0729 01:35:50.719543 16338 status_update_manager.cpp:203] Recovering status update manager
I0729 01:35:50.719707 16337 containerizer.cpp:608] Recovering containerizer
I0729 01:35:50.720923 16337 provisioner.cpp:410] Provisioner recovery complete
I0729 01:35:50.721267 16333 slave.cpp:6075] Finished recovery
I0729 01:35:50.721631 16333 slave.cpp:6257] Querying resource estimator for oversubscribable
resources
I0729 01:35:50.721818 16335 slave.cpp:6271] Received oversubscribable resources {} from the
resource estimator
I0729 01:35:50.723428 16333 process.cpp:3741] Handling HTTP event for process 'slave(752)'
with path: '/slave(752)/containers'
I0729 01:35:50.724772 16338 http.cpp:1115] HTTP GET for /slave(752)/containers from 172.17.0.5:46257
I0729 01:35:50.724835 16338 http.cpp:936] Authorizing principal 'test-principal' to GET the
'/containers' endpoint
I0729 01:35:50.728267 16340 slave.cpp:796] Agent terminating
[       OK ] Endpoint/SlaveEndpointTest.NoAuthorizer/2 (24 ms)
[----------] 9 tests from Endpoint/SlaveEndpointTest (257 ms total)

[----------] Global test environment tear-down
[==========] 1578 tests from 177 test cases ran. (575940 ms total)
[  PASSED  ] 1577 tests.
[  FAILED  ] 1 test, listed below:
[  FAILED  ] RegisterSlaveValidationTest.DropInvalidRegistration

 1 FAILED TEST
  YOU HAVE 22 DISABLED TESTS

E0729 01:35:50.785475 16341 process.cpp:956] Failed to accept socket: future discarded
make[4]: *** [check-local] Error 1
make[4]: Leaving directory `/mesos/mesos-1.3.1/_build/src'
make[3]: *** [check-am] Error 2
make[3]: Leaving directory `/mesos/mesos-1.3.1/_build/src'
make[2]: *** [check] Error 2
make[2]: Leaving directory `/mesos/mesos-1.3.1/_build/src'
make[1]: *** [check-recursive] Error 1
make[1]: Leaving directory `/mesos/mesos-1.3.1/_build'
make: *** [distcheck] Error 1
+ docker rmi mesos-1501289040-15619
Untagged: mesos-1501289040-15619:latest
Deleted: sha256:c89b4198c6cca77f1a7e7e768ebe3b8a8593900cefddd76f9006a7d0a3d2f905
Deleted: sha256:b2058e887796eee5e2bdaf4357f9272ff12cce3f373fea6877bf9f56d3d67c21
Deleted: sha256:89a4be4b3ecc9c71a9be9666a7171596a467b3fc684ab39b11aad9d605277367
Deleted: sha256:ae3e578a70cb92898f7ef5fd09f86c3b91bc2f5ed879710b150445a5c0999267
Deleted: sha256:c05a682f3ad493cf70994210a06237ac8910be505d2a8db583168766203fd45c
Deleted: sha256:4cd6dc60411cb07a764c298b02167773b406a056e67e6b2711caf4c6f0471eac
Deleted: sha256:e0034b34b43de738149ef8a20cdbd1a962fd8e218456579e7c9aeb35c2cacd28
Deleted: sha256:d3b888d235c77214af7a59b65efae489f55356329c1116d9027f3990d046dd20
Deleted: sha256:6b45ca52c660314c701fa96f23c78b47a6ffaa29aae69145e275da9d7e715066
Deleted: sha256:84301177f2cff8063f68f2ed60b823cc8e6a79c0531d40afab683a730ca52338
Deleted: sha256:379d83505417ae008f909989d0938489b119873127782bfa0eee4407819d043c
Deleted: sha256:6108483029ecb980e519dcc4da1b287a996da7f44f12601c43c16b49fe276da4
Deleted: sha256:a8ba9ed02b8971472edaa77069d062a3fd07f2a38e91242287a8fb80c451459f
Deleted: sha256:56f5ddb3f3018256ffea3fd0bba76366c92ea0b6b15d32b1416b6fff270beb1b
Deleted: sha256:35cde986d5d5221f225396eed299d00ac4847ddfbb8ea5425ad88b5528e373cb
Deleted: sha256:7a1e58828bdf166dfbb76707900acb2f25b0d01e4aad213a60b3f2f371255d69
Deleted: sha256:0d7c0c30b1b05ac214221829d22fd33e31077d41e602e02c081ee97119faac0f
Deleted: sha256:ceb9cd4571ed755f3b6d4d32cafce6a59df91884663aaecc6c269270c8f90ee6
Deleted: sha256:dcd7aefbfe74d1d311f42da4337254468d7a56c11895128842bd1ecf218ac26d
Deleted: sha256:f48f48f876aeadaf030277cd1c82fc5955325d011fd27cba0f4f5a7395cd3a3d
Deleted: sha256:d587c7a5e0e0fb5feeb2171360c6d141ec00081a1fa0199124b400f044eea7d0
Deleted: sha256:c92ba2fff37f6976373827ec723b1b0f5b99740ff8fa8d4459ac5c3468caee1e
Deleted: sha256:ad0c10e75edbd7b758aa1e9f76a8ea3f9474deb06b5e467cf39c599171d6fc9f
Deleted: sha256:5905801657c59423dc02b3ed9c7cb42edc76b7115668570d83bf87aa3d3cbb28
Build step 'Execute shell' marked build as failure
Not sending mail to unregistered user songzihao1990@gmail.com

Mime
View raw message