mesos-builds mailing list archives

Site index · List index
Message view « Date » · « Thread »
Top « Date » · « Thread »
From Apache Jenkins Server <jenk...@builds.apache.org>
Subject Build failed in Jenkins: Mesos-Buildbot » cmake,clang,--verbose,GLOG_v=1 MESOS_VERBOSE=1,ubuntu:14.04,(ubuntu)&&(!ubuntu-us1)&&(!ubuntu-eu2) #3870
Date Thu, 06 Jul 2017 18:51:10 GMT
See <https://builds.apache.org/job/Mesos-Buildbot/BUILDTOOL=cmake,COMPILER=clang,CONFIGURATION=--verbose,ENVIRONMENT=GLOG_v=1%20MESOS_VERBOSE=1,OS=ubuntu%3A14.04,label_exp=(ubuntu)&&(!ubuntu-us1)&&(!ubuntu-eu2)/3870/display/redirect?page=changes>

Changes:

[kapil] Fixed windows failure due to new `net::IP::Network` class.

[kapil] Fixed compilation failure in port-mapping network isolator.

------------------------------------------
[...truncated 28.15 MB...]
I0706 18:50:23.410588 30751 slave.cpp:839] Agent terminating
[       OK ] Endpoint/SlaveEndpointTest.AuthorizedRequest/2 (30 ms)
[ RUN      ] Endpoint/SlaveEndpointTest.UnauthorizedRequest/0
I0706 18:50:23.423020 30744 containerizer.cpp:230] Using isolation: posix/cpu,posix/mem,filesystem/posix,network/cni,environment_secret
W0706 18:50:23.423616 30744 backend.cpp:76] Failed to create 'aufs' backend: AufsBackend requires
root privileges
W0706 18:50:23.423722 30744 backend.cpp:76] Failed to create 'bind' backend: BindBackend requires
root privileges
I0706 18:50:23.423755 30744 provisioner.cpp:255] Using default backend 'copy'
I0706 18:50:23.427274 30745 slave.cpp:250] Mesos agent started on (776)@127.0.0.1:45418
I0706 18:50:23.427302 30745 slave.cpp:251] Flags at startup: --acls="" --appc_simple_discovery_uri_prefix="http://"
--appc_store_dir="/tmp/Endpoint_SlaveEndpointTest_UnauthorizedRequest_0_uTsW0o/store/appc"
--authenticate_http_readonly="true" --authenticate_http_readwrite="true" --authenticatee="crammd5"
--authentication_backoff_factor="1secs" --authorizer="local" --cgroups_cpu_enable_pids_and_tids_count="false"
--cgroups_enable_cfs="false" --cgroups_hierarchy="/sys/fs/cgroup" --cgroups_limit_swap="false"
--cgroups_root="mesos" --container_disk_watch_interval="15secs" --containerizers="mesos" --credential="/tmp/Endpoint_SlaveEndpointTest_UnauthorizedRequest_0_uTsW0o/credential"
--default_role="*" --disk_watch_interval="1mins" --docker="docker" --docker_kill_orphans="true"
--docker_registry="https://registry-1.docker.io" --docker_remove_delay="6hrs" --docker_socket="/var/run/docker.sock"
--docker_stop_timeout="0ns" --docker_store_dir="/tmp/Endpoint_SlaveEndpointTest_UnauthorizedRequest_0_uTsW0o/store/docker"
--docker_volume_checkpoint_dir="/var/run/mesos/isolators/docker/volume" --enforce_container_disk_quota="false"
--executor_registration_timeout="1mins" --executor_reregistration_timeout="2secs" --executor_shutdown_grace_period="5secs"
--fetcher_cache_dir="/tmp/Endpoint_SlaveEndpointTest_UnauthorizedRequest_0_uTsW0o/fetch" --fetcher_cache_size="2GB"
--frameworks_home="" --gc_delay="1weeks" --gc_disk_headroom="0.1" --hadoop_home="" --help="false"
--hostname_lookup="true" --http_command_executor="false" --http_credentials="/tmp/Endpoint_SlaveEndpointTest_UnauthorizedRequest_0_uTsW0o/http_credentials"
--http_heartbeat_interval="30secs" --initialize_driver_logging="true" --isolation="posix/cpu,posix/mem"
--launcher="posix" --launcher_dir="/mesos/build/src" --logbufsecs="0" --logging_level="INFO"
--max_completed_executors_per_framework="150" --oversubscribed_resources_interval="15secs"
--perf_duration="10secs" --perf_interval="1mins" --port="5051" --qos_correction_interval_min="0ns"
--quiet="false" --recover="reconnect" --recovery_timeout="15mins" --registration_backoff_factor="10ms"
--resources="cpus:2;gpus:0;mem:1024;disk:1024;ports:[31000-32000]" --revocable_cpu_low_priority="true"
--runtime_dir="/tmp/Endpoint_SlaveEndpointTest_UnauthorizedRequest_0_uTsW0o" --sandbox_directory="/mnt/mesos/sandbox"
--strict="true" --switch_user="true" --systemd_enable_support="true" --systemd_runtime_directory="/run/systemd/system"
--version="false" --work_dir="/tmp/Endpoint_SlaveEndpointTest_UnauthorizedRequest_0_2tNajG"
W0706 18:50:23.427673 30745 slave.cpp:254] 
**************************************************
Agent bound to loopback interface! Cannot communicate with remote master(s). You might want
to set '--ip' flag to a routable IP address.
**************************************************
I0706 18:50:23.427687 30745 credentials.hpp:86] Loading credential for authentication from
'/tmp/Endpoint_SlaveEndpointTest_UnauthorizedRequest_0_uTsW0o/credential'
I0706 18:50:23.427809 30745 slave.cpp:283] Agent using credential for: test-principal
I0706 18:50:23.427825 30745 credentials.hpp:37] Loading credentials for authentication from
'/tmp/Endpoint_SlaveEndpointTest_UnauthorizedRequest_0_uTsW0o/http_credentials'
I0706 18:50:23.428110 30745 http.cpp:976] Creating default 'basic' HTTP authenticator for
realm 'mesos-agent-readonly'
I0706 18:50:23.428228 30745 http.cpp:976] Creating default 'basic' HTTP authenticator for
realm 'mesos-agent-readwrite'
I0706 18:50:23.429401 30745 slave.cpp:565] Agent resources: [{"name":"cpus","scalar":{"value":2.0},"type":"SCALAR"},{"name":"mem","scalar":{"value":1024.0},"type":"SCALAR"},{"name":"disk","scalar":{"value":1024.0},"type":"SCALAR"},{"name":"ports","ranges":{"range":[{"begin":31000,"end":32000}]},"type":"RANGES"}]
I0706 18:50:23.429574 30745 slave.cpp:573] Agent attributes: [  ]
I0706 18:50:23.429584 30745 slave.cpp:578] Agent hostname: localhost
I0706 18:50:23.429751 30759 status_update_manager.cpp:177] Pausing sending status updates
I0706 18:50:23.430804 30756 state.cpp:64] Recovering state from '/tmp/Endpoint_SlaveEndpointTest_UnauthorizedRequest_0_2tNajG/meta'
I0706 18:50:23.431135 30745 status_update_manager.cpp:203] Recovering status update manager
I0706 18:50:23.431291 30751 containerizer.cpp:582] Recovering containerizer
I0706 18:50:23.432528 30746 provisioner.cpp:416] Provisioner recovery complete
I0706 18:50:23.432891 30748 slave.cpp:6189] Finished recovery
I0706 18:50:23.433357 30748 slave.cpp:6371] Querying resource estimator for oversubscribable
resources
I0706 18:50:23.433594 30750 slave.cpp:6385] Received oversubscribable resources {} from the
resource estimator
I0706 18:50:23.435636 30745 process.cpp:3779] Handling HTTP event for process 'slave(776)'
with path: '/slave(776)/monitor/statistics'
I0706 18:50:23.436661 30753 http.cpp:1116] HTTP GET for /slave(776)/monitor/statistics from
127.0.0.1:53565
I0706 18:50:23.436724 30753 http.cpp:937] Authorizing principal 'test-principal' to GET the
'/monitor/statistics' endpoint
I0706 18:50:23.438674 30753 slave.cpp:839] Agent terminating
[       OK ] Endpoint/SlaveEndpointTest.UnauthorizedRequest/0 (26 ms)
[ RUN      ] Endpoint/SlaveEndpointTest.UnauthorizedRequest/1
I0706 18:50:23.449065 30744 containerizer.cpp:230] Using isolation: posix/cpu,posix/mem,filesystem/posix,network/cni,environment_secret
W0706 18:50:23.449553 30744 backend.cpp:76] Failed to create 'aufs' backend: AufsBackend requires
root privileges
W0706 18:50:23.449656 30744 backend.cpp:76] Failed to create 'bind' backend: BindBackend requires
root privileges
I0706 18:50:23.449690 30744 provisioner.cpp:255] Using default backend 'copy'
I0706 18:50:23.452744 30749 slave.cpp:250] Mesos agent started on (777)@127.0.0.1:45418
I0706 18:50:23.452776 30749 slave.cpp:251] Flags at startup: --acls="" --appc_simple_discovery_uri_prefix="http://"
--appc_store_dir="/tmp/Endpoint_SlaveEndpointTest_UnauthorizedRequest_1_MK8P4h/store/appc"
--authenticate_http_readonly="true" --authenticate_http_readwrite="true" --authenticatee="crammd5"
--authentication_backoff_factor="1secs" --authorizer="local" --cgroups_cpu_enable_pids_and_tids_count="false"
--cgroups_enable_cfs="false" --cgroups_hierarchy="/sys/fs/cgroup" --cgroups_limit_swap="false"
--cgroups_root="mesos" --container_disk_watch_interval="15secs" --containerizers="mesos" --credential="/tmp/Endpoint_SlaveEndpointTest_UnauthorizedRequest_1_MK8P4h/credential"
--default_role="*" --disk_watch_interval="1mins" --docker="docker" --docker_kill_orphans="true"
--docker_registry="https://registry-1.docker.io" --docker_remove_delay="6hrs" --docker_socket="/var/run/docker.sock"
--docker_stop_timeout="0ns" --docker_store_dir="/tmp/Endpoint_SlaveEndpointTest_UnauthorizedRequest_1_MK8P4h/store/docker"
--docker_volume_checkpoint_dir="/var/run/mesos/isolators/docker/volume" --enforce_container_disk_quota="false"
--executor_registration_timeout="1mins" --executor_reregistration_timeout="2secs" --executor_shutdown_grace_period="5secs"
--fetcher_cache_dir="/tmp/Endpoint_SlaveEndpointTest_UnauthorizedRequest_1_MK8P4h/fetch" --fetcher_cache_size="2GB"
--frameworks_home="" --gc_delay="1weeks" --gc_disk_headroom="0.1" --hadoop_home="" --help="false"
--hostname_lookup="true" --http_command_executor="false" --http_credentials="/tmp/Endpoint_SlaveEndpointTest_UnauthorizedRequest_1_MK8P4h/http_credentials"
--http_heartbeat_interval="30secs" --initialize_driver_logging="true" --isolation="posix/cpu,posix/mem"
--launcher="posix" --launcher_dir="/mesos/build/src" --logbufsecs="0" --logging_level="INFO"
--max_completed_executors_per_framework="150" --oversubscribed_resources_interval="15secs"
--perf_duration="10secs" --perf_interval="1mins" --port="5051" --qos_correction_interval_min="0ns"
--quiet="false" --recover="reconnect" --recovery_timeout="15mins" --registration_backoff_factor="10ms"
--resources="cpus:2;gpus:0;mem:1024;disk:1024;ports:[31000-32000]" --revocable_cpu_low_priority="true"
--runtime_dir="/tmp/Endpoint_SlaveEndpointTest_UnauthorizedRequest_1_MK8P4h" --sandbox_directory="/mnt/mesos/sandbox"
--strict="true" --switch_user="true" --systemd_enable_support="true" --systemd_runtime_directory="/run/systemd/system"
--version="false" --work_dir="/tmp/Endpoint_SlaveEndpointTest_UnauthorizedRequest_1_MfsKiz"
W0706 18:50:23.453137 30749 slave.cpp:254] 
**************************************************
Agent bound to loopback interface! Cannot communicate with remote master(s). You might want
to set '--ip' flag to a routable IP address.
**************************************************
I0706 18:50:23.453147 30749 credentials.hpp:86] Loading credential for authentication from
'/tmp/Endpoint_SlaveEndpointTest_UnauthorizedRequest_1_MK8P4h/credential'
I0706 18:50:23.453260 30749 slave.cpp:283] Agent using credential for: test-principal
I0706 18:50:23.453277 30749 credentials.hpp:37] Loading credentials for authentication from
'/tmp/Endpoint_SlaveEndpointTest_UnauthorizedRequest_1_MK8P4h/http_credentials'
I0706 18:50:23.453476 30749 http.cpp:976] Creating default 'basic' HTTP authenticator for
realm 'mesos-agent-readonly'
I0706 18:50:23.453610 30749 http.cpp:976] Creating default 'basic' HTTP authenticator for
realm 'mesos-agent-readwrite'
I0706 18:50:23.454869 30749 slave.cpp:565] Agent resources: [{"name":"cpus","scalar":{"value":2.0},"type":"SCALAR"},{"name":"mem","scalar":{"value":1024.0},"type":"SCALAR"},{"name":"disk","scalar":{"value":1024.0},"type":"SCALAR"},{"name":"ports","ranges":{"range":[{"begin":31000,"end":32000}]},"type":"RANGES"}]
I0706 18:50:23.455040 30749 slave.cpp:573] Agent attributes: [  ]
I0706 18:50:23.455049 30749 slave.cpp:578] Agent hostname: localhost
I0706 18:50:23.455178 30745 status_update_manager.cpp:177] Pausing sending status updates
I0706 18:50:23.456532 30751 state.cpp:64] Recovering state from '/tmp/Endpoint_SlaveEndpointTest_UnauthorizedRequest_1_MfsKiz/meta'
I0706 18:50:23.456883 30760 status_update_manager.cpp:203] Recovering status update manager
I0706 18:50:23.457078 30747 containerizer.cpp:582] Recovering containerizer
I0706 18:50:23.458397 30752 provisioner.cpp:416] Provisioner recovery complete
I0706 18:50:23.458763 30757 slave.cpp:6189] Finished recovery
I0706 18:50:23.459241 30757 slave.cpp:6371] Querying resource estimator for oversubscribable
resources
I0706 18:50:23.459435 30749 slave.cpp:6385] Received oversubscribable resources {} from the
resource estimator
I0706 18:50:23.461869 30748 process.cpp:3779] Handling HTTP event for process 'slave(777)'
with path: '/slave(777)/monitor/statistics.json'
I0706 18:50:23.463143 30749 http.cpp:1116] HTTP GET for /slave(777)/monitor/statistics.json
from 127.0.0.1:53566
I0706 18:50:23.463235 30749 http.cpp:937] Authorizing principal 'test-principal' to GET the
'/monitor/statistics.json' endpoint
I0706 18:50:23.465507 30746 slave.cpp:839] Agent terminating
[       OK ] Endpoint/SlaveEndpointTest.UnauthorizedRequest/1 (28 ms)
[ RUN      ] Endpoint/SlaveEndpointTest.UnauthorizedRequest/2
I0706 18:50:23.478898 30744 containerizer.cpp:230] Using isolation: posix/cpu,posix/mem,filesystem/posix,network/cni,environment_secret
W0706 18:50:23.479490 30744 backend.cpp:76] Failed to create 'aufs' backend: AufsBackend requires
root privileges
W0706 18:50:23.479596 30744 backend.cpp:76] Failed to create 'bind' backend: BindBackend requires
root privileges
I0706 18:50:23.479637 30744 provisioner.cpp:255] Using default backend 'copy'
I0706 18:50:23.484181 30746 slave.cpp:250] Mesos agent started on (778)@127.0.0.1:45418
I0706 18:50:23.484309 30746 slave.cpp:251] Flags at startup: --acls="" --appc_simple_discovery_uri_prefix="http://"
--appc_store_dir="/tmp/Endpoint_SlaveEndpointTest_UnauthorizedRequest_2_MEp1qb/store/appc"
--authenticate_http_readonly="true" --authenticate_http_readwrite="true" --authenticatee="crammd5"
--authentication_backoff_factor="1secs" --authorizer="local" --cgroups_cpu_enable_pids_and_tids_count="false"
--cgroups_enable_cfs="false" --cgroups_hierarchy="/sys/fs/cgroup" --cgroups_limit_swap="false"
--cgroups_root="mesos" --container_disk_watch_interval="15secs" --containerizers="mesos" --credential="/tmp/Endpoint_SlaveEndpointTest_UnauthorizedRequest_2_MEp1qb/credential"
--default_role="*" --disk_watch_interval="1mins" --docker="docker" --docker_kill_orphans="true"
--docker_registry="https://registry-1.docker.io" --docker_remove_delay="6hrs" --docker_socket="/var/run/docker.sock"
--docker_stop_timeout="0ns" --docker_store_dir="/tmp/Endpoint_SlaveEndpointTest_UnauthorizedRequest_2_MEp1qb/store/docker"
--docker_volume_checkpoint_dir="/var/run/mesos/isolators/docker/volume" --enforce_container_disk_quota="false"
--executor_registration_timeout="1mins" --executor_reregistration_timeout="2secs" --executor_shutdown_grace_period="5secs"
--fetcher_cache_dir="/tmp/Endpoint_SlaveEndpointTest_UnauthorizedRequest_2_MEp1qb/fetch" --fetcher_cache_size="2GB"
--frameworks_home="" --gc_delay="1weeks" --gc_disk_headroom="0.1" --hadoop_home="" --help="false"
--hostname_lookup="true" --http_command_executor="false" --http_credentials="/tmp/Endpoint_SlaveEndpointTest_UnauthorizedRequest_2_MEp1qb/http_credentials"
--http_heartbeat_interval="30secs" --initialize_driver_logging="true" --isolation="posix/cpu,posix/mem"
--launcher="posix" --launcher_dir="/mesos/build/src" --logbufsecs="0" --logging_level="INFO"
--max_completed_executors_per_framework="150" --oversubscribed_resources_interval="15secs"
--perf_duration="10secs" --perf_interval="1mins" --port="5051" --qos_correction_interval_min="0ns"
--quiet="false" --recover="reconnect" --recovery_timeout="15mins" --registration_backoff_factor="10ms"
--resources="cpus:2;gpus:0;mem:1024;disk:1024;ports:[31000-32000]" --revocable_cpu_low_priority="true"
--runtime_dir="/tmp/Endpoint_SlaveEndpointTest_UnauthorizedRequest_2_MEp1qb" --sandbox_directory="/mnt/mesos/sandbox"
--strict="true" --switch_user="true" --systemd_enable_support="true" --systemd_runtime_directory="/run/systemd/system"
--version="false" --work_dir="/tmp/Endpoint_SlaveEndpointTest_UnauthorizedRequest_2_ARLcAs"
W0706 18:50:23.484681 30746 slave.cpp:254] 
**************************************************
Agent bound to loopback interface! Cannot communicate with remote master(s). You might want
to set '--ip' flag to a routable IP address.
**************************************************
I0706 18:50:23.484691 30746 credentials.hpp:86] Loading credential for authentication from
'/tmp/Endpoint_SlaveEndpointTest_UnauthorizedRequest_2_MEp1qb/credential'
I0706 18:50:23.484799 30746 slave.cpp:283] Agent using credential for: test-principal
I0706 18:50:23.484815 30746 credentials.hpp:37] Loading credentials for authentication from
'/tmp/Endpoint_SlaveEndpointTest_UnauthorizedRequest_2_MEp1qb/http_credentials'
I0706 18:50:23.485013 30746 http.cpp:976] Creating default 'basic' HTTP authenticator for
realm 'mesos-agent-readonly'
I0706 18:50:23.485123 30746 http.cpp:976] Creating default 'basic' HTTP authenticator for
realm 'mesos-agent-readwrite'
I0706 18:50:23.486243 30746 slave.cpp:565] Agent resources: [{"name":"cpus","scalar":{"value":2.0},"type":"SCALAR"},{"name":"mem","scalar":{"value":1024.0},"type":"SCALAR"},{"name":"disk","scalar":{"value":1024.0},"type":"SCALAR"},{"name":"ports","ranges":{"range":[{"begin":31000,"end":32000}]},"type":"RANGES"}]
I0706 18:50:23.486398 30746 slave.cpp:573] Agent attributes: [  ]
I0706 18:50:23.486407 30746 slave.cpp:578] Agent hostname: localhost
I0706 18:50:23.486503 30748 status_update_manager.cpp:177] Pausing sending status updates
I0706 18:50:23.487591 30753 state.cpp:64] Recovering state from '/tmp/Endpoint_SlaveEndpointTest_UnauthorizedRequest_2_ARLcAs/meta'
I0706 18:50:23.487800 30745 status_update_manager.cpp:203] Recovering status update manager
I0706 18:50:23.488042 30754 containerizer.cpp:582] Recovering containerizer
I0706 18:50:23.489151 30750 provisioner.cpp:416] Provisioner recovery complete
I0706 18:50:23.489523 30757 slave.cpp:6189] Finished recovery
I0706 18:50:23.490041 30757 slave.cpp:6371] Querying resource estimator for oversubscribable
resources
I0706 18:50:23.490279 30752 slave.cpp:6385] Received oversubscribable resources {} from the
resource estimator
I0706 18:50:23.492458 30749 process.cpp:3779] Handling HTTP event for process 'slave(778)'
with path: '/slave(778)/containers'
I0706 18:50:23.493476 30754 http.cpp:1116] HTTP GET for /slave(778)/containers from 127.0.0.1:53567
I0706 18:50:23.493541 30754 http.cpp:937] Authorizing principal 'test-principal' to GET the
'/containers' endpoint
I0706 18:50:23.495774 30752 slave.cpp:839] Agent terminating
[       OK ] Endpoint/SlaveEndpointTest.UnauthorizedRequest/2 (28 ms)
[ RUN      ] Endpoint/SlaveEndpointTest.NoAuthorizer/0
I0706 18:50:23.506482 30744 containerizer.cpp:230] Using isolation: posix/cpu,posix/mem,filesystem/posix,network/cni,environment_secret
W0706 18:50:23.507062 30744 backend.cpp:76] Failed to create 'aufs' backend: AufsBackend requires
root privileges
W0706 18:50:23.507167 30744 backend.cpp:76] Failed to create 'bind' backend: BindBackend requires
root privileges
I0706 18:50:23.507200 30744 provisioner.cpp:255] Using default backend 'copy'
I0706 18:50:23.508802 30744 cluster.cpp:448] Creating default 'local' authorizer
I0706 18:50:23.510128 30760 slave.cpp:250] Mesos agent started on (779)@127.0.0.1:45418
I0706 18:50:23.510155 30760 slave.cpp:251] Flags at startup: --acls="" --appc_simple_discovery_uri_prefix="http://"
--appc_store_dir="/tmp/Endpoint_SlaveEndpointTest_NoAuthorizer_0_825A54/store/appc" --authenticate_http_readonly="true"
--authenticate_http_readwrite="true" --authenticatee="crammd5" --authentication_backoff_factor="1secs"
--authorizer="local" --cgroups_cpu_enable_pids_and_tids_count="false" --cgroups_enable_cfs="false"
--cgroups_hierarchy="/sys/fs/cgroup" --cgroups_limit_swap="false" --cgroups_root="mesos" --container_disk_watch_interval="15secs"
--containerizers="mesos" --credential="/tmp/Endpoint_SlaveEndpointTest_NoAuthorizer_0_825A54/credential"
--default_role="*" --disk_watch_interval="1mins" --docker="docker" --docker_kill_orphans="true"
--docker_registry="https://registry-1.docker.io" --docker_remove_delay="6hrs" --docker_socket="/var/run/docker.sock"
--docker_stop_timeout="0ns" --docker_store_dir="/tmp/Endpoint_SlaveEndpointTest_NoAuthorizer_0_825A54/store/docker"
--docker_volume_checkpoint_dir="/var/run/mesos/isolators/docker/volume" --enforce_container_disk_quota="false"
--executor_registration_timeout="1mins" --executor_reregistration_timeout="2secs" --executor_shutdown_grace_period="5secs"
--fetcher_cache_dir="/tmp/Endpoint_SlaveEndpointTest_NoAuthorizer_0_825A54/fetch" --fetcher_cache_size="2GB"
--frameworks_home="" --gc_delay="1weeks" --gc_disk_headroom="0.1" --hadoop_home="" --help="false"
--hostname_lookup="true" --http_command_executor="false" --http_credentials="/tmp/Endpoint_SlaveEndpointTest_NoAuthorizer_0_825A54/http_credentials"
--http_heartbeat_interval="30secs" --initialize_driver_logging="true" --isolation="posix/cpu,posix/mem"
--launcher="posix" --launcher_dir="/mesos/build/src" --logbufsecs="0" --logging_level="INFO"
--max_completed_executors_per_framework="150" --oversubscribed_resources_interval="15secs"
--perf_duration="10secs" --perf_interval="1mins" --port="5051" --qos_correction_interval_min="0ns"
--quiet="false" --recover="reconnect" --recovery_timeout="15mins" --registration_backoff_factor="10ms"
--resources="cpus:2;gpus:0;mem:1024;disk:1024;ports:[31000-32000]" --revocable_cpu_low_priority="true"
--runtime_dir="/tmp/Endpoint_SlaveEndpointTest_NoAuthorizer_0_825A54" --sandbox_directory="/mnt/mesos/sandbox"
--strict="true" --switch_user="true" --systemd_enable_support="true" --systemd_runtime_directory="/run/systemd/system"
--version="false" --work_dir="/tmp/Endpoint_SlaveEndpointTest_NoAuthorizer_0_MCXkam"
W0706 18:50:23.510615 30760 slave.cpp:254] 
**************************************************
Agent bound to loopback interface! Cannot communicate with remote master(s). You might want
to set '--ip' flag to a routable IP address.
**************************************************
I0706 18:50:23.510643 30760 credentials.hpp:86] Loading credential for authentication from
'/tmp/Endpoint_SlaveEndpointTest_NoAuthorizer_0_825A54/credential'
I0706 18:50:23.510767 30760 slave.cpp:283] Agent using credential for: test-principal
I0706 18:50:23.510805 30760 credentials.hpp:37] Loading credentials for authentication from
'/tmp/Endpoint_SlaveEndpointTest_NoAuthorizer_0_825A54/http_credentials'
I0706 18:50:23.511024 30760 http.cpp:976] Creating default 'basic' HTTP authenticator for
realm 'mesos-agent-readonly'
I0706 18:50:23.511152 30760 http.cpp:976] Creating default 'basic' HTTP authenticator for
realm 'mesos-agent-readwrite'
I0706 18:50:23.512616 30760 slave.cpp:565] Agent resources: [{"name":"cpus","scalar":{"value":2.0},"type":"SCALAR"},{"name":"mem","scalar":{"value":1024.0},"type":"SCALAR"},{"name":"disk","scalar":{"value":1024.0},"type":"SCALAR"},{"name":"ports","ranges":{"range":[{"begin":31000,"end":32000}]},"type":"RANGES"}]
I0706 18:50:23.512814 30760 slave.cpp:573] Agent attributes: [  ]
I0706 18:50:23.512825 30760 slave.cpp:578] Agent hostname: localhost
I0706 18:50:23.512969 30758 status_update_manager.cpp:177] Pausing sending status updates
I0706 18:50:23.514130 30752 state.cpp:64] Recovering state from '/tmp/Endpoint_SlaveEndpointTest_NoAuthorizer_0_MCXkam/meta'
I0706 18:50:23.514428 30747 status_update_manager.cpp:203] Recovering status update manager
I0706 18:50:23.514616 30758 containerizer.cpp:582] Recovering containerizer
I0706 18:50:23.515787 30760 provisioner.cpp:416] Provisioner recovery complete
I0706 18:50:23.516156 30756 slave.cpp:6189] Finished recovery
I0706 18:50:23.516593 30756 slave.cpp:6371] Querying resource estimator for oversubscribable
resources
I0706 18:50:23.516782 30759 slave.cpp:6385] Received oversubscribable resources {} from the
resource estimator
I0706 18:50:23.518576 30746 process.cpp:3779] Handling HTTP event for process 'slave(779)'
with path: '/slave(779)/monitor/statistics'
I0706 18:50:23.519521 30759 http.cpp:1116] HTTP GET for /slave(779)/monitor/statistics from
127.0.0.1:53568
I0706 18:50:23.519589 30759 http.cpp:937] Authorizing principal 'test-principal' to GET the
'/monitor/statistics' endpoint
I0706 18:50:23.522210 30758 slave.cpp:839] Agent terminating
[       OK ] Endpoint/SlaveEndpointTest.NoAuthorizer/0 (26 ms)
[ RUN      ] Endpoint/SlaveEndpointTest.NoAuthorizer/1
I0706 18:50:23.531976 30744 containerizer.cpp:230] Using isolation: posix/cpu,posix/mem,filesystem/posix,network/cni,environment_secret
W0706 18:50:23.532397 30744 backend.cpp:76] Failed to create 'aufs' backend: AufsBackend requires
root privileges
W0706 18:50:23.532476 30744 backend.cpp:76] Failed to create 'bind' backend: BindBackend requires
root privileges
I0706 18:50:23.532506 30744 provisioner.cpp:255] Using default backend 'copy'
I0706 18:50:23.534128 30744 cluster.cpp:448] Creating default 'local' authorizer
I0706 18:50:23.535476 30753 slave.cpp:250] Mesos agent started on (780)@127.0.0.1:45418
I0706 18:50:23.535509 30753 slave.cpp:251] Flags at startup: --acls="" --appc_simple_discovery_uri_prefix="http://"
--appc_store_dir="/tmp/Endpoint_SlaveEndpointTest_NoAuthorizer_1_szqr1Y/store/appc" --authenticate_http_readonly="true"
--authenticate_http_readwrite="true" --authenticatee="crammd5" --authentication_backoff_factor="1secs"
--authorizer="local" --cgroups_cpu_enable_pids_and_tids_count="false" --cgroups_enable_cfs="false"
--cgroups_hierarchy="/sys/fs/cgroup" --cgroups_limit_swap="false" --cgroups_root="mesos" --container_disk_watch_interval="15secs"
--containerizers="mesos" --credential="/tmp/Endpoint_SlaveEndpointTest_NoAuthorizer_1_szqr1Y/credential"
--default_role="*" --disk_watch_interval="1mins" --docker="docker" --docker_kill_orphans="true"
--docker_registry="https://registry-1.docker.io" --docker_remove_delay="6hrs" --docker_socket="/var/run/docker.sock"
--docker_stop_timeout="0ns" --docker_store_dir="/tmp/Endpoint_SlaveEndpointTest_NoAuthorizer_1_szqr1Y/store/docker"
--docker_volume_checkpoint_dir="/var/run/mesos/isolators/docker/volume" --enforce_container_disk_quota="false"
--executor_registration_timeout="1mins" --executor_reregistration_timeout="2secs" --executor_shutdown_grace_period="5secs"
--fetcher_cache_dir="/tmp/Endpoint_SlaveEndpointTest_NoAuthorizer_1_szqr1Y/fetch" --fetcher_cache_size="2GB"
--frameworks_home="" --gc_delay="1weeks" --gc_disk_headroom="0.1" --hadoop_home="" --help="false"
--hostname_lookup="true" --http_command_executor="false" --http_credentials="/tmp/Endpoint_SlaveEndpointTest_NoAuthorizer_1_szqr1Y/http_credentials"
--http_heartbeat_interval="30secs" --initialize_driver_logging="true" --isolation="posix/cpu,posix/mem"
--launcher="posix" --launcher_dir="/mesos/build/src" --logbufsecs="0" --logging_level="INFO"
--max_completed_executors_per_framework="150" --oversubscribed_resources_interval="15secs"
--perf_duration="10secs" --perf_interval="1mins" --port="5051" --qos_correction_interval_min="0ns"
--quiet="false" --recover="reconnect" --recovery_timeout="15mins" --registration_backoff_factor="10ms"
--resources="cpus:2;gpus:0;mem:1024;disk:1024;ports:[31000-32000]" --revocable_cpu_low_priority="true"
--runtime_dir="/tmp/Endpoint_SlaveEndpointTest_NoAuthorizer_1_szqr1Y" --sandbox_directory="/mnt/mesos/sandbox"
--strict="true" --switch_user="true" --systemd_enable_support="true" --systemd_runtime_directory="/run/systemd/system"
--version="false" --work_dir="/tmp/Endpoint_SlaveEndpointTest_NoAuthorizer_1_seSS1f"
W0706 18:50:23.535926 30753 slave.cpp:254] 
**************************************************
Agent bound to loopback interface! Cannot communicate with remote master(s). You might want
to set '--ip' flag to a routable IP address.
**************************************************
I0706 18:50:23.535939 30753 credentials.hpp:86] Loading credential for authentication from
'/tmp/Endpoint_SlaveEndpointTest_NoAuthorizer_1_szqr1Y/credential'
I0706 18:50:23.536051 30753 slave.cpp:283] Agent using credential for: test-principal
I0706 18:50:23.536068 30753 credentials.hpp:37] Loading credentials for authentication from
'/tmp/Endpoint_SlaveEndpointTest_NoAuthorizer_1_szqr1Y/http_credentials'
I0706 18:50:23.536278 30753 http.cpp:976] Creating default 'basic' HTTP authenticator for
realm 'mesos-agent-readonly'
I0706 18:50:23.536471 30753 http.cpp:976] Creating default 'basic' HTTP authenticator for
realm 'mesos-agent-readwrite'
I0706 18:50:23.537590 30753 slave.cpp:565] Agent resources: [{"name":"cpus","scalar":{"value":2.0},"type":"SCALAR"},{"name":"mem","scalar":{"value":1024.0},"type":"SCALAR"},{"name":"disk","scalar":{"value":1024.0},"type":"SCALAR"},{"name":"ports","ranges":{"range":[{"begin":31000,"end":32000}]},"type":"RANGES"}]
I0706 18:50:23.537744 30753 slave.cpp:573] Agent attributes: [  ]
I0706 18:50:23.537752 30753 slave.cpp:578] Agent hostname: localhost
I0706 18:50:23.537880 30752 status_update_manager.cpp:177] Pausing sending status updates
I0706 18:50:23.539047 30755 state.cpp:64] Recovering state from '/tmp/Endpoint_SlaveEndpointTest_NoAuthorizer_1_seSS1f/meta'
I0706 18:50:23.539249 30760 status_update_manager.cpp:203] Recovering status update manager
I0706 18:50:23.539448 30758 containerizer.cpp:582] Recovering containerizer
I0706 18:50:23.540571 30758 provisioner.cpp:416] Provisioner recovery complete
I0706 18:50:23.540890 30746 slave.cpp:6189] Finished recovery
I0706 18:50:23.541358 30746 slave.cpp:6371] Querying resource estimator for oversubscribable
resources
I0706 18:50:23.541579 30760 slave.cpp:6385] Received oversubscribable resources {} from the
resource estimator
I0706 18:50:23.543253 30752 process.cpp:3779] Handling HTTP event for process 'slave(780)'
with path: '/slave(780)/monitor/statistics.json'
I0706 18:50:23.544359 30745 http.cpp:1116] HTTP GET for /slave(780)/monitor/statistics.json
from 127.0.0.1:53569
I0706 18:50:23.544414 30745 http.cpp:937] Authorizing principal 'test-principal' to GET the
'/monitor/statistics.json' endpoint
I0706 18:50:23.547132 30754 slave.cpp:839] Agent terminating
[       OK ] Endpoint/SlaveEndpointTest.NoAuthorizer/1 (25 ms)
[ RUN      ] Endpoint/SlaveEndpointTest.NoAuthorizer/2
I0706 18:50:23.556893 30744 containerizer.cpp:230] Using isolation: posix/cpu,posix/mem,filesystem/posix,network/cni,environment_secret
W0706 18:50:23.557313 30744 backend.cpp:76] Failed to create 'aufs' backend: AufsBackend requires
root privileges
W0706 18:50:23.557397 30744 backend.cpp:76] Failed to create 'bind' backend: BindBackend requires
root privileges
I0706 18:50:23.557423 30744 provisioner.cpp:255] Using default backend 'copy'
I0706 18:50:23.559388 30744 cluster.cpp:448] Creating default 'local' authorizer
I0706 18:50:23.561702 30760 slave.cpp:250] Mesos agent started on (781)@127.0.0.1:45418
I0706 18:50:23.561873 30760 slave.cpp:251] Flags at startup: --acls="" --appc_simple_discovery_uri_prefix="http://"
--appc_store_dir="/tmp/Endpoint_SlaveEndpointTest_NoAuthorizer_2_Ss6vdT/store/appc" --authenticate_http_readonly="true"
--authenticate_http_readwrite="true" --authenticatee="crammd5" --authentication_backoff_factor="1secs"
--authorizer="local" --cgroups_cpu_enable_pids_and_tids_count="false" --cgroups_enable_cfs="false"
--cgroups_hierarchy="/sys/fs/cgroup" --cgroups_limit_swap="false" --cgroups_root="mesos" --container_disk_watch_interval="15secs"
--containerizers="mesos" --credential="/tmp/Endpoint_SlaveEndpointTest_NoAuthorizer_2_Ss6vdT/credential"
--default_role="*" --disk_watch_interval="1mins" --docker="docker" --docker_kill_orphans="true"
--docker_registry="https://registry-1.docker.io" --docker_remove_delay="6hrs" --docker_socket="/var/run/docker.sock"
--docker_stop_timeout="0ns" --docker_store_dir="/tmp/Endpoint_SlaveEndpointTest_NoAuthorizer_2_Ss6vdT/store/docker"
--docker_volume_checkpoint_dir="/var/run/mesos/isolators/docker/volume" --enforce_container_disk_quota="false"
--executor_registration_timeout="1mins" --executor_reregistration_timeout="2secs" --executor_shutdown_grace_period="5secs"
--fetcher_cache_dir="/tmp/Endpoint_SlaveEndpointTest_NoAuthorizer_2_Ss6vdT/fetch" --fetcher_cache_size="2GB"
--frameworks_home="" --gc_delay="1weeks" --gc_disk_headroom="0.1" --hadoop_home="" --help="false"
--hostname_lookup="true" --http_command_executor="false" --http_credentials="/tmp/Endpoint_SlaveEndpointTest_NoAuthorizer_2_Ss6vdT/http_credentials"
--http_heartbeat_interval="30secs" --initialize_driver_logging="true" --isolation="posix/cpu,posix/mem"
--launcher="posix" --launcher_dir="/mesos/build/src" --logbufsecs="0" --logging_level="INFO"
--max_completed_executors_per_framework="150" --oversubscribed_resources_interval="15secs"
--perf_duration="10secs" --perf_interval="1mins" --port="5051" --qos_correction_interval_min="0ns"
--quiet="false" --recover="reconnect" --recovery_timeout="15mins" --registration_backoff_factor="10ms"
--resources="cpus:2;gpus:0;mem:1024;disk:1024;ports:[31000-32000]" --revocable_cpu_low_priority="true"
--runtime_dir="/tmp/Endpoint_SlaveEndpointTest_NoAuthorizer_2_Ss6vdT" --sandbox_directory="/mnt/mesos/sandbox"
--strict="true" --switch_user="true" --systemd_enable_support="true" --systemd_runtime_directory="/run/systemd/system"
--version="false" --work_dir="/tmp/Endpoint_SlaveEndpointTest_NoAuthorizer_2_yvJT99"
W0706 18:50:23.562537 30760 slave.cpp:254] 
**************************************************
Agent bound to loopback interface! Cannot communicate with remote master(s). You might want
to set '--ip' flag to a routable IP address.
**************************************************
I0706 18:50:23.562710 30760 credentials.hpp:86] Loading credential for authentication from
'/tmp/Endpoint_SlaveEndpointTest_NoAuthorizer_2_Ss6vdT/credential'
I0706 18:50:23.563030 30760 slave.cpp:283] Agent using credential for: test-principal
I0706 18:50:23.563190 30760 credentials.hpp:37] Loading credentials for authentication from
'/tmp/Endpoint_SlaveEndpointTest_NoAuthorizer_2_Ss6vdT/http_credentials'
I0706 18:50:23.563591 30760 http.cpp:976] Creating default 'basic' HTTP authenticator for
realm 'mesos-agent-readonly'
I0706 18:50:23.564059 30760 http.cpp:976] Creating default 'basic' HTTP authenticator for
realm 'mesos-agent-readwrite'
I0706 18:50:23.565744 30760 slave.cpp:565] Agent resources: [{"name":"cpus","scalar":{"value":2.0},"type":"SCALAR"},{"name":"mem","scalar":{"value":1024.0},"type":"SCALAR"},{"name":"disk","scalar":{"value":1024.0},"type":"SCALAR"},{"name":"ports","ranges":{"range":[{"begin":31000,"end":32000}]},"type":"RANGES"}]
I0706 18:50:23.566172 30760 slave.cpp:573] Agent attributes: [  ]
I0706 18:50:23.566326 30760 slave.cpp:578] Agent hostname: localhost
I0706 18:50:23.566697 30752 status_update_manager.cpp:177] Pausing sending status updates
I0706 18:50:23.568552 30756 state.cpp:64] Recovering state from '/tmp/Endpoint_SlaveEndpointTest_NoAuthorizer_2_yvJT99/meta'
I0706 18:50:23.569133 30753 status_update_manager.cpp:203] Recovering status update manager
I0706 18:50:23.569396 30749 containerizer.cpp:582] Recovering containerizer
I0706 18:50:23.571316 30756 provisioner.cpp:416] Provisioner recovery complete
I0706 18:50:23.571912 30759 slave.cpp:6189] Finished recovery
I0706 18:50:23.572728 30759 slave.cpp:6371] Querying resource estimator for oversubscribable
resources
I0706 18:50:23.576014 30759 slave.cpp:6385] Received oversubscribable resources {} from the
resource estimator
I0706 18:50:23.580160 30750 process.cpp:3779] Handling HTTP event for process 'slave(781)'
with path: '/slave(781)/containers'
I0706 18:50:23.582031 30752 http.cpp:1116] HTTP GET for /slave(781)/containers from 127.0.0.1:53571
I0706 18:50:23.582262 30752 http.cpp:937] Authorizing principal 'test-principal' to GET the
'/containers' endpoint
I0706 18:50:23.586308 30749 slave.cpp:839] Agent terminating
[       OK ] Endpoint/SlaveEndpointTest.NoAuthorizer/2 (39 ms)
[----------] 9 tests from Endpoint/SlaveEndpointTest (267 ms total)

[----------] Global test environment tear-down
[==========] 1579 tests from 172 test cases ran. (327223 ms total)
[  PASSED  ] 1576 tests.
[  FAILED  ] 3 tests, listed below:
[  FAILED  ] SlaveTest.HTTPScheduler
[  FAILED  ] SlaveTest.HTTPSchedulerLiveUpgrade
[  FAILED  ] SlaveTest.HTTPSchedulerSlaveRestart

 3 FAILED TESTS
  YOU HAVE 20 DISABLED TESTS

I0706 18:50:23.647840 30761 process.cpp:968] Failed to accept socket: future discarded
make[3]: Leaving directory `/mesos/build'
make[3]: *** [CMakeFiles/check] Error 1
make[2]: *** [CMakeFiles/check.dir/all] Error 2
make[2]: Leaving directory `/mesos/build'
make[1]: *** [CMakeFiles/check.dir/rule] Error 2
make[1]: Leaving directory `/mesos/build'
make: *** [check] Error 2
+ docker rmi mesos-1499364743-20716
Untagged: mesos-1499364743-20716:latest
Deleted: sha256:86376b8c1b1ebbb127fad0b3c41c524ee9dda32dccd2ab64a519a85f132aeee7
Deleted: sha256:fcc87ea945592940851057fd8bfa202c87daef7daa84aacd4e5a477842610229
Deleted: sha256:3b1c22087df5660574ef3922c8f4c30d59ac0f3fd75d9e690270945909cba4d7
Deleted: sha256:5525509ad621fef6641366f682f5dac5664a2141184c2fb98d3d4b6b5e4f4d1c
Deleted: sha256:81c668c043d9037c829c7791f604aad3c5eb42c9dceac6666795a2284805ab6c
Deleted: sha256:360966fe11e94831453d4778f9cfde96ca51f1d2a7410107f1ff9206f83c79da
Deleted: sha256:ce63126ba4b78986239945956dac372dc415912a8eaca7cc8829602fecde8412
Deleted: sha256:2b6c98450ee6d0c225004fab506b5f89207e565a4e88eb6b4b1c164bd506a25a
Deleted: sha256:03f437b6f9a473e14864d8b46686ad9394012915bd882fcab334650642de4df5
Deleted: sha256:aa7b72863db6dfce006e4a1c712248e37b1c7e83f503e5366832325874bacb01
Deleted: sha256:bced3774725efe2e11eb683990c7e743abc0c92c67d4cdfc5689c7be3ab8501c
Deleted: sha256:94fceb65dc93cbbad6f8b28241bcd34e53ad315c31b608ceceb49f1d78f485ee
Deleted: sha256:da516e1a73fded9da6eece935c55b64899dd632d7ca12bc241de19f33ffa2a35
Deleted: sha256:ad674408dc50a5e2756791e5de918d5c731dfa70b674d56eae008f221bed3d23
Deleted: sha256:062f148de89fdf0107fbf7c71c887d2f9656c6e0a72d5538a99036e21fcede1c
Deleted: sha256:eddba4b154e175a676655ab85df05f04901533c32009a0a997472399d7a4c5c8
Deleted: sha256:68df88150177fa532ad38792dd079a1015fae1897cfb9fd5f8270267fdcc7f39
Deleted: sha256:1469a80c5bafac398c2e9962ccc6e0d223b45d144a91213ef52549910e23988e
Deleted: sha256:01585620176408fa39b5238e45921e22651631cd70d8ce4e52ec883e0a569224
Deleted: sha256:bb15985bb4bf9ad1da0c6a2e71aff246d2d97261fd9a29e4e1a07012768afba9
Deleted: sha256:7aa9159614968dbd71f650043124f8e6abc3982821cfd2cc7ebdeb1c1fc1994f
Deleted: sha256:f7e873b2f856ab0e45ba80ea515ca328b6ad17c03637b8bb901bcce31d92a983
Deleted: sha256:ea509ee69a2f1c71c87411ce93fa21635eb95edbdd9086882dd0d14966ed06bc
Deleted: sha256:6fce5f9f5e1dee171b95e36cdea56dd0b0edd29ca25db9a3f136db0ad787faea
Build step 'Execute shell' marked build as failure
Not sending mail to unregistered user neil.conway@gmail.com
Not sending mail to unregistered user benjamin.hindman@gmail.com
Not sending mail to unregistered user yujie.jay@gmail.com
Not sending mail to unregistered user alexander@mesosphere.io

Mime
View raw message