mesos-builds mailing list archives

Site index · List index
Message view « Date » · « Thread »
Top « Date » · « Thread »
From Apache Jenkins Server <jenk...@builds.apache.org>
Subject Build failed in Jenkins: Mesos-Reviewbot #18618
Date Thu, 27 Jul 2017 22:12:11 GMT
See <https://builds.apache.org/job/Mesos-Reviewbot/18618/display/redirect>

------------------------------------------
[...truncated 30.26 MB...]
I0727 22:12:04.297391  5099 containerizer.cpp:230] Using isolation: posix/cpu,posix/mem,filesystem/posix,network/cni,environment_secret
W0727 22:12:04.298180  5099 backend.cpp:76] Failed to create 'overlay' backend: OverlayBackend
requires root privileges
W0727 22:12:04.298343  5099 backend.cpp:76] Failed to create 'bind' backend: BindBackend requires
root privileges
I0727 22:12:04.298388  5099 provisioner.cpp:255] Using default backend 'copy'
I0727 22:12:04.303730  5119 slave.cpp:250] Mesos agent started on (796)@172.17.0.3:39423
I0727 22:12:04.303773  5119 slave.cpp:251] Flags at startup: --acls="" --appc_simple_discovery_uri_prefix="http://"
--appc_store_dir="/tmp/Endpoint_SlaveEndpointTest_AuthorizedRequest_2_EGbkEH/store/appc" --authenticate_http_readonly="true"
--authenticate_http_readwrite="true" --authenticatee="crammd5" --authentication_backoff_factor="1secs"
--authorizer="local" --cgroups_cpu_enable_pids_and_tids_count="false" --cgroups_enable_cfs="false"
--cgroups_hierarchy="/sys/fs/cgroup" --cgroups_limit_swap="false" --cgroups_root="mesos" --container_disk_watch_interval="15secs"
--containerizers="mesos" --credential="/tmp/Endpoint_SlaveEndpointTest_AuthorizedRequest_2_EGbkEH/credential"
--default_role="*" --disk_watch_interval="1mins" --docker="docker" --docker_kill_orphans="true"
--docker_registry="https://registry-1.docker.io" --docker_remove_delay="6hrs" --docker_socket="/var/run/docker.sock"
--docker_stop_timeout="0ns" --docker_store_dir="/tmp/Endpoint_SlaveEndpointTest_AuthorizedRequest_2_EGbkEH/store/docker"
--docker_volume_checkpoint_dir="/var/run/mesos/isolators/docker/volume" --enforce_container_disk_quota="false"
--executor_registration_timeout="1mins" --executor_reregistration_timeout="2secs" --executor_shutdown_grace_period="5secs"
--fetcher_cache_dir="/tmp/Endpoint_SlaveEndpointTest_AuthorizedRequest_2_EGbkEH/fetch" --fetcher_cache_size="2GB"
--frameworks_home="" --gc_delay="1weeks" --gc_disk_headroom="0.1" --hadoop_home="" --help="false"
--hostname_lookup="true" --http_command_executor="false" --http_credentials="/tmp/Endpoint_SlaveEndpointTest_AuthorizedRequest_2_EGbkEH/http_credentials"
--http_heartbeat_interval="30secs" --initialize_driver_logging="true" --isolation="posix/cpu,posix/mem"
--launcher="posix" --launcher_dir="/mesos/mesos-1.4.0/_build/src" --logbufsecs="0" --logging_level="INFO"
--max_completed_executors_per_framework="150" --oversubscribed_resources_interval="15secs"
--perf_duration="10secs" --perf_interval="1mins" --port="5051" --qos_correction_interval_min="0ns"
--quiet="false" --recover="reconnect" --recovery_timeout="15mins" --registration_backoff_factor="10ms"
--resources="cpus:2;gpus:0;mem:1024;disk:1024;ports:[31000-32000]" --revocable_cpu_low_priority="true"
--runtime_dir="/tmp/Endpoint_SlaveEndpointTest_AuthorizedRequest_2_EGbkEH" --sandbox_directory="/mnt/mesos/sandbox"
--strict="true" --switch_user="true" --systemd_enable_support="true" --systemd_runtime_directory="/run/systemd/system"
--version="false" --work_dir="/tmp/Endpoint_SlaveEndpointTest_AuthorizedRequest_2_x4Gltk"
I0727 22:12:04.304522  5119 credentials.hpp:86] Loading credential for authentication from
'/tmp/Endpoint_SlaveEndpointTest_AuthorizedRequest_2_EGbkEH/credential'
I0727 22:12:04.304780  5119 slave.cpp:283] Agent using credential for: test-principal
I0727 22:12:04.304801  5119 credentials.hpp:37] Loading credentials for authentication from
'/tmp/Endpoint_SlaveEndpointTest_AuthorizedRequest_2_EGbkEH/http_credentials'
I0727 22:12:04.305146  5119 http.cpp:993] Creating default 'basic' HTTP authenticator for
realm 'mesos-agent-readonly'
I0727 22:12:04.305362  5119 http.cpp:993] Creating default 'basic' HTTP authenticator for
realm 'mesos-agent-readwrite'
I0727 22:12:04.307499  5119 slave.cpp:565] Agent resources: [{"name":"cpus","scalar":{"value":2.0},"type":"SCALAR"},{"name":"mem","scalar":{"value":1024.0},"type":"SCALAR"},{"name":"disk","scalar":{"value":1024.0},"type":"SCALAR"},{"name":"ports","ranges":{"range":[{"begin":31000,"end":32000}]},"type":"RANGES"}]
I0727 22:12:04.307925  5119 slave.cpp:573] Agent attributes: [  ]
I0727 22:12:04.307947  5119 slave.cpp:582] Agent hostname: bd1220ddd4f1
I0727 22:12:04.308176  5120 status_update_manager.cpp:177] Pausing sending status updates
I0727 22:12:04.310125  5118 state.cpp:64] Recovering state from '/tmp/Endpoint_SlaveEndpointTest_AuthorizedRequest_2_x4Gltk/meta'
I0727 22:12:04.310832  5121 status_update_manager.cpp:203] Recovering status update manager
I0727 22:12:04.311306  5124 containerizer.cpp:582] Recovering containerizer
I0727 22:12:04.313789  5119 provisioner.cpp:416] Provisioner recovery complete
I0727 22:12:04.314507  5123 slave.cpp:6207] Finished recovery
I0727 22:12:04.315095  5123 slave.cpp:6389] Querying resource estimator for oversubscribable
resources
I0727 22:12:04.315742  5124 slave.cpp:6403] Received oversubscribable resources {} from the
resource estimator
I0727 22:12:04.320287  5124 process.cpp:3837] Handling HTTP event for process 'slave(796)'
with path: '/slave(796)/containers'
I0727 22:12:04.322950  5118 http.cpp:1133] HTTP GET for /slave(796)/containers from 172.17.0.3:44608
I0727 22:12:04.323292  5118 http.cpp:957] Authorizing principal 'test-principal' to GET the
'/containers' endpoint
I0727 22:12:04.329691  5099 slave.cpp:843] Agent terminating
[       OK ] Endpoint/SlaveEndpointTest.AuthorizedRequest/2 (69 ms)
[ RUN      ] Endpoint/SlaveEndpointTest.UnauthorizedRequest/0
I0727 22:12:04.367290  5099 containerizer.cpp:230] Using isolation: posix/cpu,posix/mem,filesystem/posix,network/cni,environment_secret
W0727 22:12:04.368062  5099 backend.cpp:76] Failed to create 'overlay' backend: OverlayBackend
requires root privileges
W0727 22:12:04.368222  5099 backend.cpp:76] Failed to create 'bind' backend: BindBackend requires
root privileges
I0727 22:12:04.368265  5099 provisioner.cpp:255] Using default backend 'copy'
I0727 22:12:04.374074  5122 slave.cpp:250] Mesos agent started on (797)@172.17.0.3:39423
I0727 22:12:04.374117  5122 slave.cpp:251] Flags at startup: --acls="" --appc_simple_discovery_uri_prefix="http://"
--appc_store_dir="/tmp/Endpoint_SlaveEndpointTest_UnauthorizedRequest_0_AQocXc/store/appc"
--authenticate_http_readonly="true" --authenticate_http_readwrite="true" --authenticatee="crammd5"
--authentication_backoff_factor="1secs" --authorizer="local" --cgroups_cpu_enable_pids_and_tids_count="false"
--cgroups_enable_cfs="false" --cgroups_hierarchy="/sys/fs/cgroup" --cgroups_limit_swap="false"
--cgroups_root="mesos" --container_disk_watch_interval="15secs" --containerizers="mesos" --credential="/tmp/Endpoint_SlaveEndpointTest_UnauthorizedRequest_0_AQocXc/credential"
--default_role="*" --disk_watch_interval="1mins" --docker="docker" --docker_kill_orphans="true"
--docker_registry="https://registry-1.docker.io" --docker_remove_delay="6hrs" --docker_socket="/var/run/docker.sock"
--docker_stop_timeout="0ns" --docker_store_dir="/tmp/Endpoint_SlaveEndpointTest_UnauthorizedRequest_0_AQocXc/store/docker"
--docker_volume_checkpoint_dir="/var/run/mesos/isolators/docker/volume" --enforce_container_disk_quota="false"
--executor_registration_timeout="1mins" --executor_reregistration_timeout="2secs" --executor_shutdown_grace_period="5secs"
--fetcher_cache_dir="/tmp/Endpoint_SlaveEndpointTest_UnauthorizedRequest_0_AQocXc/fetch" --fetcher_cache_size="2GB"
--frameworks_home="" --gc_delay="1weeks" --gc_disk_headroom="0.1" --hadoop_home="" --help="false"
--hostname_lookup="true" --http_command_executor="false" --http_credentials="/tmp/Endpoint_SlaveEndpointTest_UnauthorizedRequest_0_AQocXc/http_credentials"
--http_heartbeat_interval="30secs" --initialize_driver_logging="true" --isolation="posix/cpu,posix/mem"
--launcher="posix" --launcher_dir="/mesos/mesos-1.4.0/_build/src" --logbufsecs="0" --logging_level="INFO"
--max_completed_executors_per_framework="150" --oversubscribed_resources_interval="15secs"
--perf_duration="10secs" --perf_interval="1mins" --port="5051" --qos_correction_interval_min="0ns"
--quiet="false" --recover="reconnect" --recovery_timeout="15mins" --registration_backoff_factor="10ms"
--resources="cpus:2;gpus:0;mem:1024;disk:1024;ports:[31000-32000]" --revocable_cpu_low_priority="true"
--runtime_dir="/tmp/Endpoint_SlaveEndpointTest_UnauthorizedRequest_0_AQocXc" --sandbox_directory="/mnt/mesos/sandbox"
--strict="true" --switch_user="true" --systemd_enable_support="true" --systemd_runtime_directory="/run/systemd/system"
--version="false" --work_dir="/tmp/Endpoint_SlaveEndpointTest_UnauthorizedRequest_0_b3KUAP"
I0727 22:12:04.374810  5122 credentials.hpp:86] Loading credential for authentication from
'/tmp/Endpoint_SlaveEndpointTest_UnauthorizedRequest_0_AQocXc/credential'
I0727 22:12:04.375067  5122 slave.cpp:283] Agent using credential for: test-principal
I0727 22:12:04.375098  5122 credentials.hpp:37] Loading credentials for authentication from
'/tmp/Endpoint_SlaveEndpointTest_UnauthorizedRequest_0_AQocXc/http_credentials'
I0727 22:12:04.375473  5122 http.cpp:993] Creating default 'basic' HTTP authenticator for
realm 'mesos-agent-readonly'
I0727 22:12:04.375681  5122 http.cpp:993] Creating default 'basic' HTTP authenticator for
realm 'mesos-agent-readwrite'
I0727 22:12:04.377775  5122 slave.cpp:565] Agent resources: [{"name":"cpus","scalar":{"value":2.0},"type":"SCALAR"},{"name":"mem","scalar":{"value":1024.0},"type":"SCALAR"},{"name":"disk","scalar":{"value":1024.0},"type":"SCALAR"},{"name":"ports","ranges":{"range":[{"begin":31000,"end":32000}]},"type":"RANGES"}]
I0727 22:12:04.378203  5122 slave.cpp:573] Agent attributes: [  ]
I0727 22:12:04.378224  5122 slave.cpp:582] Agent hostname: bd1220ddd4f1
I0727 22:12:04.378466  5119 status_update_manager.cpp:177] Pausing sending status updates
I0727 22:12:04.380486  5125 state.cpp:64] Recovering state from '/tmp/Endpoint_SlaveEndpointTest_UnauthorizedRequest_0_b3KUAP/meta'
I0727 22:12:04.381042  5125 status_update_manager.cpp:203] Recovering status update manager
I0727 22:12:04.381410  5125 containerizer.cpp:582] Recovering containerizer
I0727 22:12:04.383718  5118 provisioner.cpp:416] Provisioner recovery complete
I0727 22:12:04.384533  5124 slave.cpp:6207] Finished recovery
I0727 22:12:04.385409  5124 slave.cpp:6389] Querying resource estimator for oversubscribable
resources
I0727 22:12:04.386013  5121 slave.cpp:6403] Received oversubscribable resources {} from the
resource estimator
I0727 22:12:04.390198  5121 process.cpp:3837] Handling HTTP event for process 'slave(797)'
with path: '/slave(797)/monitor/statistics'
I0727 22:12:04.392472  5119 http.cpp:1133] HTTP GET for /slave(797)/monitor/statistics from
172.17.0.3:44614
I0727 22:12:04.392601  5119 http.cpp:957] Authorizing principal 'test-principal' to GET the
'/monitor/statistics' endpoint
I0727 22:12:04.397491  5099 slave.cpp:843] Agent terminating
[       OK ] Endpoint/SlaveEndpointTest.UnauthorizedRequest/0 (78 ms)
[ RUN      ] Endpoint/SlaveEndpointTest.UnauthorizedRequest/1
I0727 22:12:04.446019  5099 containerizer.cpp:230] Using isolation: posix/cpu,posix/mem,filesystem/posix,network/cni,environment_secret
W0727 22:12:04.446791  5099 backend.cpp:76] Failed to create 'overlay' backend: OverlayBackend
requires root privileges
W0727 22:12:04.446992  5099 backend.cpp:76] Failed to create 'bind' backend: BindBackend requires
root privileges
I0727 22:12:04.447036  5099 provisioner.cpp:255] Using default backend 'copy'
I0727 22:12:04.452812  5124 slave.cpp:250] Mesos agent started on (798)@172.17.0.3:39423
I0727 22:12:04.452854  5124 slave.cpp:251] Flags at startup: --acls="" --appc_simple_discovery_uri_prefix="http://"
--appc_store_dir="/tmp/Endpoint_SlaveEndpointTest_UnauthorizedRequest_1_K3zL3I/store/appc"
--authenticate_http_readonly="true" --authenticate_http_readwrite="true" --authenticatee="crammd5"
--authentication_backoff_factor="1secs" --authorizer="local" --cgroups_cpu_enable_pids_and_tids_count="false"
--cgroups_enable_cfs="false" --cgroups_hierarchy="/sys/fs/cgroup" --cgroups_limit_swap="false"
--cgroups_root="mesos" --container_disk_watch_interval="15secs" --containerizers="mesos" --credential="/tmp/Endpoint_SlaveEndpointTest_UnauthorizedRequest_1_K3zL3I/credential"
--default_role="*" --disk_watch_interval="1mins" --docker="docker" --docker_kill_orphans="true"
--docker_registry="https://registry-1.docker.io" --docker_remove_delay="6hrs" --docker_socket="/var/run/docker.sock"
--docker_stop_timeout="0ns" --docker_store_dir="/tmp/Endpoint_SlaveEndpointTest_UnauthorizedRequest_1_K3zL3I/store/docker"
--docker_volume_checkpoint_dir="/var/run/mesos/isolators/docker/volume" --enforce_container_disk_quota="false"
--executor_registration_timeout="1mins" --executor_reregistration_timeout="2secs" --executor_shutdown_grace_period="5secs"
--fetcher_cache_dir="/tmp/Endpoint_SlaveEndpointTest_UnauthorizedRequest_1_K3zL3I/fetch" --fetcher_cache_size="2GB"
--frameworks_home="" --gc_delay="1weeks" --gc_disk_headroom="0.1" --hadoop_home="" --help="false"
--hostname_lookup="true" --http_command_executor="false" --http_credentials="/tmp/Endpoint_SlaveEndpointTest_UnauthorizedRequest_1_K3zL3I/http_credentials"
--http_heartbeat_interval="30secs" --initialize_driver_logging="true" --isolation="posix/cpu,posix/mem"
--launcher="posix" --launcher_dir="/mesos/mesos-1.4.0/_build/src" --logbufsecs="0" --logging_level="INFO"
--max_completed_executors_per_framework="150" --oversubscribed_resources_interval="15secs"
--perf_duration="10secs" --perf_interval="1mins" --port="5051" --qos_correction_interval_min="0ns"
--quiet="false" --recover="reconnect" --recovery_timeout="15mins" --registration_backoff_factor="10ms"
--resources="cpus:2;gpus:0;mem:1024;disk:1024;ports:[31000-32000]" --revocable_cpu_low_priority="true"
--runtime_dir="/tmp/Endpoint_SlaveEndpointTest_UnauthorizedRequest_1_K3zL3I" --sandbox_directory="/mnt/mesos/sandbox"
--strict="true" --switch_user="true" --systemd_enable_support="true" --systemd_runtime_directory="/run/systemd/system"
--version="false" --work_dir="/tmp/Endpoint_SlaveEndpointTest_UnauthorizedRequest_1_dceIul"
I0727 22:12:04.454280  5124 credentials.hpp:86] Loading credential for authentication from
'/tmp/Endpoint_SlaveEndpointTest_UnauthorizedRequest_1_K3zL3I/credential'
I0727 22:12:04.454871  5124 slave.cpp:283] Agent using credential for: test-principal
I0727 22:12:04.454905  5124 credentials.hpp:37] Loading credentials for authentication from
'/tmp/Endpoint_SlaveEndpointTest_UnauthorizedRequest_1_K3zL3I/http_credentials'
I0727 22:12:04.455648  5124 http.cpp:993] Creating default 'basic' HTTP authenticator for
realm 'mesos-agent-readonly'
I0727 22:12:04.456117  5124 http.cpp:993] Creating default 'basic' HTTP authenticator for
realm 'mesos-agent-readwrite'
I0727 22:12:04.458469  5124 slave.cpp:565] Agent resources: [{"name":"cpus","scalar":{"value":2.0},"type":"SCALAR"},{"name":"mem","scalar":{"value":1024.0},"type":"SCALAR"},{"name":"disk","scalar":{"value":1024.0},"type":"SCALAR"},{"name":"ports","ranges":{"range":[{"begin":31000,"end":32000}]},"type":"RANGES"}]
I0727 22:12:04.458906  5124 slave.cpp:573] Agent attributes: [  ]
I0727 22:12:04.459059  5124 slave.cpp:582] Agent hostname: bd1220ddd4f1
I0727 22:12:04.459599  5121 status_update_manager.cpp:177] Pausing sending status updates
I0727 22:12:04.461774  5123 state.cpp:64] Recovering state from '/tmp/Endpoint_SlaveEndpointTest_UnauthorizedRequest_1_dceIul/meta'
I0727 22:12:04.462257  5118 status_update_manager.cpp:203] Recovering status update manager
I0727 22:12:04.462671  5120 containerizer.cpp:582] Recovering containerizer
I0727 22:12:04.464836  5125 provisioner.cpp:416] Provisioner recovery complete
I0727 22:12:04.465517  5125 slave.cpp:6207] Finished recovery
I0727 22:12:04.466162  5125 slave.cpp:6389] Querying resource estimator for oversubscribable
resources
I0727 22:12:04.466745  5122 slave.cpp:6403] Received oversubscribable resources {} from the
resource estimator
I0727 22:12:04.470800  5122 process.cpp:3837] Handling HTTP event for process 'slave(798)'
with path: '/slave(798)/monitor/statistics.json'
I0727 22:12:04.473382  5118 http.cpp:1133] HTTP GET for /slave(798)/monitor/statistics.json
from 172.17.0.3:44616
I0727 22:12:04.473721  5118 http.cpp:957] Authorizing principal 'test-principal' to GET the
'/monitor/statistics.json' endpoint
I0727 22:12:04.504142  5099 slave.cpp:843] Agent terminating
[       OK ] Endpoint/SlaveEndpointTest.UnauthorizedRequest/1 (85 ms)
[ RUN      ] Endpoint/SlaveEndpointTest.UnauthorizedRequest/2
I0727 22:12:04.533156  5099 containerizer.cpp:230] Using isolation: posix/cpu,posix/mem,filesystem/posix,network/cni,environment_secret
W0727 22:12:04.534247  5099 backend.cpp:76] Failed to create 'overlay' backend: OverlayBackend
requires root privileges
W0727 22:12:04.534649  5099 backend.cpp:76] Failed to create 'bind' backend: BindBackend requires
root privileges
I0727 22:12:04.534870  5099 provisioner.cpp:255] Using default backend 'copy'
I0727 22:12:04.541640  5125 slave.cpp:250] Mesos agent started on (799)@172.17.0.3:39423
I0727 22:12:04.541682  5125 slave.cpp:251] Flags at startup: --acls="" --appc_simple_discovery_uri_prefix="http://"
--appc_store_dir="/tmp/Endpoint_SlaveEndpointTest_UnauthorizedRequest_2_OBdm3f/store/appc"
--authenticate_http_readonly="true" --authenticate_http_readwrite="true" --authenticatee="crammd5"
--authentication_backoff_factor="1secs" --authorizer="local" --cgroups_cpu_enable_pids_and_tids_count="false"
--cgroups_enable_cfs="false" --cgroups_hierarchy="/sys/fs/cgroup" --cgroups_limit_swap="false"
--cgroups_root="mesos" --container_disk_watch_interval="15secs" --containerizers="mesos" --credential="/tmp/Endpoint_SlaveEndpointTest_UnauthorizedRequest_2_OBdm3f/credential"
--default_role="*" --disk_watch_interval="1mins" --docker="docker" --docker_kill_orphans="true"
--docker_registry="https://registry-1.docker.io" --docker_remove_delay="6hrs" --docker_socket="/var/run/docker.sock"
--docker_stop_timeout="0ns" --docker_store_dir="/tmp/Endpoint_SlaveEndpointTest_UnauthorizedRequest_2_OBdm3f/store/docker"
--docker_volume_checkpoint_dir="/var/run/mesos/isolators/docker/volume" --enforce_container_disk_quota="false"
--executor_registration_timeout="1mins" --executor_reregistration_timeout="2secs" --executor_shutdown_grace_period="5secs"
--fetcher_cache_dir="/tmp/Endpoint_SlaveEndpointTest_UnauthorizedRequest_2_OBdm3f/fetch" --fetcher_cache_size="2GB"
--frameworks_home="" --gc_delay="1weeks" --gc_disk_headroom="0.1" --hadoop_home="" --help="false"
--hostname_lookup="true" --http_command_executor="false" --http_credentials="/tmp/Endpoint_SlaveEndpointTest_UnauthorizedRequest_2_OBdm3f/http_credentials"
--http_heartbeat_interval="30secs" --initialize_driver_logging="true" --isolation="posix/cpu,posix/mem"
--launcher="posix" --launcher_dir="/mesos/mesos-1.4.0/_build/src" --logbufsecs="0" --logging_level="INFO"
--max_completed_executors_per_framework="150" --oversubscribed_resources_interval="15secs"
--perf_duration="10secs" --perf_interval="1mins" --port="5051" --qos_correction_interval_min="0ns"
--quiet="false" --recover="reconnect" --recovery_timeout="15mins" --registration_backoff_factor="10ms"
--resources="cpus:2;gpus:0;mem:1024;disk:1024;ports:[31000-32000]" --revocable_cpu_low_priority="true"
--runtime_dir="/tmp/Endpoint_SlaveEndpointTest_UnauthorizedRequest_2_OBdm3f" --sandbox_directory="/mnt/mesos/sandbox"
--strict="true" --switch_user="true" --systemd_enable_support="true" --systemd_runtime_directory="/run/systemd/system"
--version="false" --work_dir="/tmp/Endpoint_SlaveEndpointTest_UnauthorizedRequest_2_PDzigS"
I0727 22:12:04.542414  5125 credentials.hpp:86] Loading credential for authentication from
'/tmp/Endpoint_SlaveEndpointTest_UnauthorizedRequest_2_OBdm3f/credential'
I0727 22:12:04.542665  5125 slave.cpp:283] Agent using credential for: test-principal
I0727 22:12:04.542688  5125 credentials.hpp:37] Loading credentials for authentication from
'/tmp/Endpoint_SlaveEndpointTest_UnauthorizedRequest_2_OBdm3f/http_credentials'
I0727 22:12:04.543046  5125 http.cpp:993] Creating default 'basic' HTTP authenticator for
realm 'mesos-agent-readonly'
I0727 22:12:04.543267  5125 http.cpp:993] Creating default 'basic' HTTP authenticator for
realm 'mesos-agent-readwrite'
I0727 22:12:04.545400  5125 slave.cpp:565] Agent resources: [{"name":"cpus","scalar":{"value":2.0},"type":"SCALAR"},{"name":"mem","scalar":{"value":1024.0},"type":"SCALAR"},{"name":"disk","scalar":{"value":1024.0},"type":"SCALAR"},{"name":"ports","ranges":{"range":[{"begin":31000,"end":32000}]},"type":"RANGES"}]
I0727 22:12:04.545827  5125 slave.cpp:573] Agent attributes: [  ]
I0727 22:12:04.545858  5125 slave.cpp:582] Agent hostname: bd1220ddd4f1
I0727 22:12:04.546119  5119 status_update_manager.cpp:177] Pausing sending status updates
I0727 22:12:04.547966  5123 state.cpp:64] Recovering state from '/tmp/Endpoint_SlaveEndpointTest_UnauthorizedRequest_2_PDzigS/meta'
I0727 22:12:04.548573  5124 status_update_manager.cpp:203] Recovering status update manager
I0727 22:12:04.549036  5125 containerizer.cpp:582] Recovering containerizer
I0727 22:12:04.551316  5122 provisioner.cpp:416] Provisioner recovery complete
I0727 22:12:04.552036  5121 slave.cpp:6207] Finished recovery
I0727 22:12:04.552775  5121 slave.cpp:6389] Querying resource estimator for oversubscribable
resources
I0727 22:12:04.553246  5123 slave.cpp:6403] Received oversubscribable resources {} from the
resource estimator
I0727 22:12:04.557700  5123 process.cpp:3837] Handling HTTP event for process 'slave(799)'
with path: '/slave(799)/containers'
I0727 22:12:04.560076  5121 http.cpp:1133] HTTP GET for /slave(799)/containers from 172.17.0.3:44618
I0727 22:12:04.560211  5121 http.cpp:957] Authorizing principal 'test-principal' to GET the
'/containers' endpoint
I0727 22:12:04.563844  5122 slave.cpp:843] Agent terminating
[       OK ] Endpoint/SlaveEndpointTest.UnauthorizedRequest/2 (67 ms)
[ RUN      ] Endpoint/SlaveEndpointTest.NoAuthorizer/0
I0727 22:12:04.602701  5099 containerizer.cpp:230] Using isolation: posix/cpu,posix/mem,filesystem/posix,network/cni,environment_secret
W0727 22:12:04.603761  5099 backend.cpp:76] Failed to create 'overlay' backend: OverlayBackend
requires root privileges
W0727 22:12:04.604174  5099 backend.cpp:76] Failed to create 'bind' backend: BindBackend requires
root privileges
I0727 22:12:04.604286  5099 provisioner.cpp:255] Using default backend 'copy'
I0727 22:12:04.607990  5099 cluster.cpp:448] Creating default 'local' authorizer
I0727 22:12:04.611333  5125 slave.cpp:250] Mesos agent started on (800)@172.17.0.3:39423
I0727 22:12:04.611376  5125 slave.cpp:251] Flags at startup: --acls="" --appc_simple_discovery_uri_prefix="http://"
--appc_store_dir="/tmp/Endpoint_SlaveEndpointTest_NoAuthorizer_0_mHshON/store/appc" --authenticate_http_readonly="true"
--authenticate_http_readwrite="true" --authenticatee="crammd5" --authentication_backoff_factor="1secs"
--authorizer="local" --cgroups_cpu_enable_pids_and_tids_count="false" --cgroups_enable_cfs="false"
--cgroups_hierarchy="/sys/fs/cgroup" --cgroups_limit_swap="false" --cgroups_root="mesos" --container_disk_watch_interval="15secs"
--containerizers="mesos" --credential="/tmp/Endpoint_SlaveEndpointTest_NoAuthorizer_0_mHshON/credential"
--default_role="*" --disk_watch_interval="1mins" --docker="docker" --docker_kill_orphans="true"
--docker_registry="https://registry-1.docker.io" --docker_remove_delay="6hrs" --docker_socket="/var/run/docker.sock"
--docker_stop_timeout="0ns" --docker_store_dir="/tmp/Endpoint_SlaveEndpointTest_NoAuthorizer_0_mHshON/store/docker"
--docker_volume_checkpoint_dir="/var/run/mesos/isolators/docker/volume" --enforce_container_disk_quota="false"
--executor_registration_timeout="1mins" --executor_reregistration_timeout="2secs" --executor_shutdown_grace_period="5secs"
--fetcher_cache_dir="/tmp/Endpoint_SlaveEndpointTest_NoAuthorizer_0_mHshON/fetch" --fetcher_cache_size="2GB"
--frameworks_home="" --gc_delay="1weeks" --gc_disk_headroom="0.1" --hadoop_home="" --help="false"
--hostname_lookup="true" --http_command_executor="false" --http_credentials="/tmp/Endpoint_SlaveEndpointTest_NoAuthorizer_0_mHshON/http_credentials"
--http_heartbeat_interval="30secs" --initialize_driver_logging="true" --isolation="posix/cpu,posix/mem"
--launcher="posix" --launcher_dir="/mesos/mesos-1.4.0/_build/src" --logbufsecs="0" --logging_level="INFO"
--max_completed_executors_per_framework="150" --oversubscribed_resources_interval="15secs"
--perf_duration="10secs" --perf_interval="1mins" --port="5051" --qos_correction_interval_min="0ns"
--quiet="false" --recover="reconnect" --recovery_timeout="15mins" --registration_backoff_factor="10ms"
--resources="cpus:2;gpus:0;mem:1024;disk:1024;ports:[31000-32000]" --revocable_cpu_low_priority="true"
--runtime_dir="/tmp/Endpoint_SlaveEndpointTest_NoAuthorizer_0_mHshON" --sandbox_directory="/mnt/mesos/sandbox"
--strict="true" --switch_user="true" --systemd_enable_support="true" --systemd_runtime_directory="/run/systemd/system"
--version="false" --work_dir="/tmp/Endpoint_SlaveEndpointTest_NoAuthorizer_0_v5J4Pp"
I0727 22:12:04.612082  5125 credentials.hpp:86] Loading credential for authentication from
'/tmp/Endpoint_SlaveEndpointTest_NoAuthorizer_0_mHshON/credential'
I0727 22:12:04.612330  5125 slave.cpp:283] Agent using credential for: test-principal
I0727 22:12:04.612354  5125 credentials.hpp:37] Loading credentials for authentication from
'/tmp/Endpoint_SlaveEndpointTest_NoAuthorizer_0_mHshON/http_credentials'
I0727 22:12:04.612716  5125 http.cpp:993] Creating default 'basic' HTTP authenticator for
realm 'mesos-agent-readonly'
I0727 22:12:04.613044  5125 http.cpp:993] Creating default 'basic' HTTP authenticator for
realm 'mesos-agent-readwrite'
I0727 22:12:04.615223  5125 slave.cpp:565] Agent resources: [{"name":"cpus","scalar":{"value":2.0},"type":"SCALAR"},{"name":"mem","scalar":{"value":1024.0},"type":"SCALAR"},{"name":"disk","scalar":{"value":1024.0},"type":"SCALAR"},{"name":"ports","ranges":{"range":[{"begin":31000,"end":32000}]},"type":"RANGES"}]
I0727 22:12:04.615660  5125 slave.cpp:573] Agent attributes: [  ]
I0727 22:12:04.615682  5125 slave.cpp:582] Agent hostname: bd1220ddd4f1
I0727 22:12:04.616078  5120 status_update_manager.cpp:177] Pausing sending status updates
I0727 22:12:04.617960  5121 state.cpp:64] Recovering state from '/tmp/Endpoint_SlaveEndpointTest_NoAuthorizer_0_v5J4Pp/meta'
I0727 22:12:04.618463  5122 status_update_manager.cpp:203] Recovering status update manager
I0727 22:12:04.618978  5125 containerizer.cpp:582] Recovering containerizer
I0727 22:12:04.621155  5123 provisioner.cpp:416] Provisioner recovery complete
I0727 22:12:04.621714  5120 slave.cpp:6207] Finished recovery
I0727 22:12:04.622469  5120 slave.cpp:6389] Querying resource estimator for oversubscribable
resources
I0727 22:12:04.622828  5120 slave.cpp:6403] Received oversubscribable resources {} from the
resource estimator
I0727 22:12:04.627137  5119 process.cpp:3837] Handling HTTP event for process 'slave(800)'
with path: '/slave(800)/monitor/statistics'
I0727 22:12:04.629330  5120 http.cpp:1133] HTTP GET for /slave(800)/monitor/statistics from
172.17.0.3:44620
I0727 22:12:04.629462  5120 http.cpp:957] Authorizing principal 'test-principal' to GET the
'/monitor/statistics' endpoint
I0727 22:12:04.635871  5118 slave.cpp:843] Agent terminating
[       OK ] Endpoint/SlaveEndpointTest.NoAuthorizer/0 (71 ms)
[ RUN      ] Endpoint/SlaveEndpointTest.NoAuthorizer/1
I0727 22:12:04.675187  5099 containerizer.cpp:230] Using isolation: posix/cpu,posix/mem,filesystem/posix,network/cni,environment_secret
W0727 22:12:04.676254  5099 backend.cpp:76] Failed to create 'overlay' backend: OverlayBackend
requires root privileges
W0727 22:12:04.676674  5099 backend.cpp:76] Failed to create 'bind' backend: BindBackend requires
root privileges
I0727 22:12:04.676858  5099 provisioner.cpp:255] Using default backend 'copy'
I0727 22:12:04.680413  5099 cluster.cpp:448] Creating default 'local' authorizer
I0727 22:12:04.683817  5124 slave.cpp:250] Mesos agent started on (801)@172.17.0.3:39423
I0727 22:12:04.683868  5124 slave.cpp:251] Flags at startup: --acls="" --appc_simple_discovery_uri_prefix="http://"
--appc_store_dir="/tmp/Endpoint_SlaveEndpointTest_NoAuthorizer_1_oEhzjm/store/appc" --authenticate_http_readonly="true"
--authenticate_http_readwrite="true" --authenticatee="crammd5" --authentication_backoff_factor="1secs"
--authorizer="local" --cgroups_cpu_enable_pids_and_tids_count="false" --cgroups_enable_cfs="false"
--cgroups_hierarchy="/sys/fs/cgroup" --cgroups_limit_swap="false" --cgroups_root="mesos" --container_disk_watch_interval="15secs"
--containerizers="mesos" --credential="/tmp/Endpoint_SlaveEndpointTest_NoAuthorizer_1_oEhzjm/credential"
--default_role="*" --disk_watch_interval="1mins" --docker="docker" --docker_kill_orphans="true"
--docker_registry="https://registry-1.docker.io" --docker_remove_delay="6hrs" --docker_socket="/var/run/docker.sock"
--docker_stop_timeout="0ns" --docker_store_dir="/tmp/Endpoint_SlaveEndpointTest_NoAuthorizer_1_oEhzjm/store/docker"
--docker_volume_checkpoint_dir="/var/run/mesos/isolators/docker/volume" --enforce_container_disk_quota="false"
--executor_registration_timeout="1mins" --executor_reregistration_timeout="2secs" --executor_shutdown_grace_period="5secs"
--fetcher_cache_dir="/tmp/Endpoint_SlaveEndpointTest_NoAuthorizer_1_oEhzjm/fetch" --fetcher_cache_size="2GB"
--frameworks_home="" --gc_delay="1weeks" --gc_disk_headroom="0.1" --hadoop_home="" --help="false"
--hostname_lookup="true" --http_command_executor="false" --http_credentials="/tmp/Endpoint_SlaveEndpointTest_NoAuthorizer_1_oEhzjm/http_credentials"
--http_heartbeat_interval="30secs" --initialize_driver_logging="true" --isolation="posix/cpu,posix/mem"
--launcher="posix" --launcher_dir="/mesos/mesos-1.4.0/_build/src" --logbufsecs="0" --logging_level="INFO"
--max_completed_executors_per_framework="150" --oversubscribed_resources_interval="15secs"
--perf_duration="10secs" --perf_interval="1mins" --port="5051" --qos_correction_interval_min="0ns"
--quiet="false" --recover="reconnect" --recovery_timeout="15mins" --registration_backoff_factor="10ms"
--resources="cpus:2;gpus:0;mem:1024;disk:1024;ports:[31000-32000]" --revocable_cpu_low_priority="true"
--runtime_dir="/tmp/Endpoint_SlaveEndpointTest_NoAuthorizer_1_oEhzjm" --sandbox_directory="/mnt/mesos/sandbox"
--strict="true" --switch_user="true" --systemd_enable_support="true" --systemd_runtime_directory="/run/systemd/system"
--version="false" --work_dir="/tmp/Endpoint_SlaveEndpointTest_NoAuthorizer_1_tgxF9X"
I0727 22:12:04.684940  5124 credentials.hpp:86] Loading credential for authentication from
'/tmp/Endpoint_SlaveEndpointTest_NoAuthorizer_1_oEhzjm/credential'
I0727 22:12:04.685477  5124 slave.cpp:283] Agent using credential for: test-principal
I0727 22:12:04.685510  5124 credentials.hpp:37] Loading credentials for authentication from
'/tmp/Endpoint_SlaveEndpointTest_NoAuthorizer_1_oEhzjm/http_credentials'
I0727 22:12:04.686105  5124 http.cpp:993] Creating default 'basic' HTTP authenticator for
realm 'mesos-agent-readonly'
I0727 22:12:04.686506  5124 http.cpp:993] Creating default 'basic' HTTP authenticator for
realm 'mesos-agent-readwrite'
I0727 22:12:04.688921  5124 slave.cpp:565] Agent resources: [{"name":"cpus","scalar":{"value":2.0},"type":"SCALAR"},{"name":"mem","scalar":{"value":1024.0},"type":"SCALAR"},{"name":"disk","scalar":{"value":1024.0},"type":"SCALAR"},{"name":"ports","ranges":{"range":[{"begin":31000,"end":32000}]},"type":"RANGES"}]
I0727 22:12:04.689352  5124 slave.cpp:573] Agent attributes: [  ]
I0727 22:12:04.689460  5124 slave.cpp:582] Agent hostname: bd1220ddd4f1
I0727 22:12:04.689913  5123 status_update_manager.cpp:177] Pausing sending status updates
I0727 22:12:04.692100  5122 state.cpp:64] Recovering state from '/tmp/Endpoint_SlaveEndpointTest_NoAuthorizer_1_tgxF9X/meta'
I0727 22:12:04.692595  5125 status_update_manager.cpp:203] Recovering status update manager
I0727 22:12:04.692989  5121 containerizer.cpp:582] Recovering containerizer
I0727 22:12:04.695461  5122 provisioner.cpp:416] Provisioner recovery complete
I0727 22:12:04.695966  5125 slave.cpp:6207] Finished recovery
I0727 22:12:04.696578  5125 slave.cpp:6389] Querying resource estimator for oversubscribable
resources
I0727 22:12:04.697090  5120 slave.cpp:6403] Received oversubscribable resources {} from the
resource estimator
I0727 22:12:04.701987  5124 process.cpp:3837] Handling HTTP event for process 'slave(801)'
with path: '/slave(801)/monitor/statistics.json'
I0727 22:12:04.704195  5120 http.cpp:1133] HTTP GET for /slave(801)/monitor/statistics.json
from 172.17.0.3:44622
I0727 22:12:04.704509  5120 http.cpp:957] Authorizing principal 'test-principal' to GET the
'/monitor/statistics.json' endpoint
I0727 22:12:04.710590  5124 slave.cpp:843] Agent terminating
[       OK ] Endpoint/SlaveEndpointTest.NoAuthorizer/1 (84 ms)
[ RUN      ] Endpoint/SlaveEndpointTest.NoAuthorizer/2
I0727 22:12:04.758468  5099 containerizer.cpp:230] Using isolation: posix/cpu,posix/mem,filesystem/posix,network/cni,environment_secret
W0727 22:12:04.759410  5099 backend.cpp:76] Failed to create 'overlay' backend: OverlayBackend
requires root privileges
W0727 22:12:04.759693  5099 backend.cpp:76] Failed to create 'bind' backend: BindBackend requires
root privileges
I0727 22:12:04.759757  5099 provisioner.cpp:255] Using default backend 'copy'
I0727 22:12:04.763178  5099 cluster.cpp:448] Creating default 'local' authorizer
I0727 22:12:04.766834  5124 slave.cpp:250] Mesos agent started on (802)@172.17.0.3:39423
I0727 22:12:04.766876  5124 slave.cpp:251] Flags at startup: --acls="" --appc_simple_discovery_uri_prefix="http://"
--appc_store_dir="/tmp/Endpoint_SlaveEndpointTest_NoAuthorizer_2_iFOHFV/store/appc" --authenticate_http_readonly="true"
--authenticate_http_readwrite="true" --authenticatee="crammd5" --authentication_backoff_factor="1secs"
--authorizer="local" --cgroups_cpu_enable_pids_and_tids_count="false" --cgroups_enable_cfs="false"
--cgroups_hierarchy="/sys/fs/cgroup" --cgroups_limit_swap="false" --cgroups_root="mesos" --container_disk_watch_interval="15secs"
--containerizers="mesos" --credential="/tmp/Endpoint_SlaveEndpointTest_NoAuthorizer_2_iFOHFV/credential"
--default_role="*" --disk_watch_interval="1mins" --docker="docker" --docker_kill_orphans="true"
--docker_registry="https://registry-1.docker.io" --docker_remove_delay="6hrs" --docker_socket="/var/run/docker.sock"
--docker_stop_timeout="0ns" --docker_store_dir="/tmp/Endpoint_SlaveEndpointTest_NoAuthorizer_2_iFOHFV/store/docker"
--docker_volume_checkpoint_dir="/var/run/mesos/isolators/docker/volume" --enforce_container_disk_quota="false"
--executor_registration_timeout="1mins" --executor_reregistration_timeout="2secs" --executor_shutdown_grace_period="5secs"
--fetcher_cache_dir="/tmp/Endpoint_SlaveEndpointTest_NoAuthorizer_2_iFOHFV/fetch" --fetcher_cache_size="2GB"
--frameworks_home="" --gc_delay="1weeks" --gc_disk_headroom="0.1" --hadoop_home="" --help="false"
--hostname_lookup="true" --http_command_executor="false" --http_credentials="/tmp/Endpoint_SlaveEndpointTest_NoAuthorizer_2_iFOHFV/http_credentials"
--http_heartbeat_interval="30secs" --initialize_driver_logging="true" --isolation="posix/cpu,posix/mem"
--launcher="posix" --launcher_dir="/mesos/mesos-1.4.0/_build/src" --logbufsecs="0" --logging_level="INFO"
--max_completed_executors_per_framework="150" --oversubscribed_resources_interval="15secs"
--perf_duration="10secs" --perf_interval="1mins" --port="5051" --qos_correction_interval_min="0ns"
--quiet="false" --recover="reconnect" --recovery_timeout="15mins" --registration_backoff_factor="10ms"
--resources="cpus:2;gpus:0;mem:1024;disk:1024;ports:[31000-32000]" --revocable_cpu_low_priority="true"
--runtime_dir="/tmp/Endpoint_SlaveEndpointTest_NoAuthorizer_2_iFOHFV" --sandbox_directory="/mnt/mesos/sandbox"
--strict="true" --switch_user="true" --systemd_enable_support="true" --systemd_runtime_directory="/run/systemd/system"
--version="false" --work_dir="/tmp/Endpoint_SlaveEndpointTest_NoAuthorizer_2_lKtfix"
I0727 22:12:04.767599  5124 credentials.hpp:86] Loading credential for authentication from
'/tmp/Endpoint_SlaveEndpointTest_NoAuthorizer_2_iFOHFV/credential'
I0727 22:12:04.767848  5124 slave.cpp:283] Agent using credential for: test-principal
I0727 22:12:04.767873  5124 credentials.hpp:37] Loading credentials for authentication from
'/tmp/Endpoint_SlaveEndpointTest_NoAuthorizer_2_iFOHFV/http_credentials'
I0727 22:12:04.768216  5124 http.cpp:993] Creating default 'basic' HTTP authenticator for
realm 'mesos-agent-readonly'
I0727 22:12:04.768438  5124 http.cpp:993] Creating default 'basic' HTTP authenticator for
realm 'mesos-agent-readwrite'
I0727 22:12:04.770526  5124 slave.cpp:565] Agent resources: [{"name":"cpus","scalar":{"value":2.0},"type":"SCALAR"},{"name":"mem","scalar":{"value":1024.0},"type":"SCALAR"},{"name":"disk","scalar":{"value":1024.0},"type":"SCALAR"},{"name":"ports","ranges":{"range":[{"begin":31000,"end":32000}]},"type":"RANGES"}]
I0727 22:12:04.770949  5124 slave.cpp:573] Agent attributes: [  ]
I0727 22:12:04.770970  5124 slave.cpp:582] Agent hostname: bd1220ddd4f1
I0727 22:12:04.771174  5121 status_update_manager.cpp:177] Pausing sending status updates
I0727 22:12:04.773198  5119 state.cpp:64] Recovering state from '/tmp/Endpoint_SlaveEndpointTest_NoAuthorizer_2_lKtfix/meta'
I0727 22:12:04.773697  5120 status_update_manager.cpp:203] Recovering status update manager
I0727 22:12:04.774241  5122 containerizer.cpp:582] Recovering containerizer
I0727 22:12:04.776638  5121 provisioner.cpp:416] Provisioner recovery complete
I0727 22:12:04.777302  5122 slave.cpp:6207] Finished recovery
I0727 22:12:04.777890  5122 slave.cpp:6389] Querying resource estimator for oversubscribable
resources
I0727 22:12:04.778602  5124 slave.cpp:6403] Received oversubscribable resources {} from the
resource estimator
I0727 22:12:04.783133  5120 process.cpp:3837] Handling HTTP event for process 'slave(802)'
with path: '/slave(802)/containers'
I0727 22:12:04.785276  5124 http.cpp:1133] HTTP GET for /slave(802)/containers from 172.17.0.3:44624
I0727 22:12:04.785645  5124 http.cpp:957] Authorizing principal 'test-principal' to GET the
'/containers' endpoint
I0727 22:12:04.795270  5121 slave.cpp:843] Agent terminating
[       OK ] Endpoint/SlaveEndpointTest.NoAuthorizer/2 (72 ms)
[----------] 9 tests from Endpoint/SlaveEndpointTest (658 ms total)

[----------] Global test environment tear-down
[==========] 1649 tests from 181 test cases ran. (749235 ms total)
[  PASSED  ] 1645 tests.
[  FAILED  ] 4 tests, listed below:
[  FAILED  ] DefaultExecutorCheckTest.CommandCheckDeliveredAndReconciled
[  FAILED  ] DefaultExecutorCheckTest.CommandCheckStatusChange
[  FAILED  ] DefaultExecutorCheckTest.CommandCheckSeesParentsEnv
[  FAILED  ] DefaultExecutorCheckTest.CommandCheckSharesWorkDirWithTask

 4 FAILED TESTS
  YOU HAVE 20 DISABLED TESTS

I0727 22:12:04.963557  5126 process.cpp:1006] Failed to accept socket: future discarded
make[4]: *** [check-local] Error 1
make[4]: Leaving directory `/mesos/mesos-1.4.0/_build/src'
make[3]: *** [check-am] Error 2
make[3]: Leaving directory `/mesos/mesos-1.4.0/_build/src'
make[2]: *** [check] Error 2
make[2]: Leaving directory `/mesos/mesos-1.4.0/_build/src'
make[1]: *** [check-recursive] Error 1
make[1]: Leaving directory `/mesos/mesos-1.4.0/_build'
make: *** [distcheck] Error 1
+ docker rmi mesos-1501187685-28589
Untagged: mesos-1501187685-28589:latest
Deleted: sha256:3c4626af84650538ba07173fa7f737f56bf78d7b90a355ad9d89cbc36327b925
Deleted: sha256:cb90d4056e803924e09dcfb99edc12895f435271d6504755aeb36b74b4eb26d1
Deleted: sha256:326cc438d27d63b56a045339c2cd4eb28affebf10ccbfa6b2dc19898c777243b
Deleted: sha256:5d6e2d412f1b225bb51338f73003568df80162d1a9f2725c573a65fde4df88d1
Deleted: sha256:c42535a07deb26faf3464975fef9bb7267fe4346151c3da16f241e6f7cc8e839
Deleted: sha256:4699b5cb404699bfe5741cae70cfcdf1b877044fcc9bdafbf6c49559da552f20
Deleted: sha256:ba03a73ef6931560c6756b77087e3593d8641e5637a14c3f24d8116fa7825ea5
Deleted: sha256:c430364750d29a6a48ebf45d4d7a53b0abb0b90b515fd968576613203ada8c7e
Deleted: sha256:1857f7728058bf06dd58cd8517bb6ee6880607f47d74df6b04569dde5be09571
Deleted: sha256:5fdaf5d8833fd708ad6b8904bdef2d219ed9509f70dbe6f6cbc2125722a9e39a
Deleted: sha256:a17dba973a9667184017f06854a8ae8c5697d9c15754b0aa8989d94a9906d92f
Deleted: sha256:b310879093a72d16762ac703c3a39d1045f732891176af51776b01ab43b6c712
Deleted: sha256:7b3fbfc0bc71a04bbf3cfb026237ed794e286837f8f7c5e606d46488c4ef83fb
Deleted: sha256:bc7f10d940da076ff38f9979a1e4d560815f9ba0aa532ffd5f68f4efd754dfb7
Deleted: sha256:b20db42836aaf6a5532a352a1470ce6bf0ef390f371940514a15193865a95124
Deleted: sha256:8a94dd04675c50d241ef85ce0fd4f1da27d468e3edc9fa686dd86226dea5c023
Deleted: sha256:3639fd2cd84d901a00233103b805951cd388da20345b6c880545db792b0fd8ac
Deleted: sha256:6f0bdf4f4bd959e210d612b5210c6e6a7b4eb0a629f6e7a124e336b721e0721e
Deleted: sha256:9200a1e778976731acf0f7edbe607ee8ed89a20ef0cad9956242c090867639ea
Deleted: sha256:c24cdee5df3563fe957ad210bf2e3aa20e94a45c551b383ef5983693f3f95cc7
Deleted: sha256:6a5c587aff6f3f4aac2a9e3ceae76980ca7ba135292390e7daabe60d1de41146
Deleted: sha256:70871dc23992cb86e26d591f4ff6a54464e9e357310df3c65699a51f8bbd08c7
Deleted: sha256:093a38827cb02dcdb87285bb88ed14f148f2ac72b0540917f887473caeea078d
Deleted: sha256:6dd3fa74b98adf70ffafb4480e3b2c47ebb8ebf74ee3d92bb416488b09420298
Build step 'Execute shell' marked build as failure

Mime
View raw message