mesos-builds mailing list archives

Site index · List index
Message view « Date » · « Thread »
Top « Date » · « Thread »
From Apache Jenkins Server <jenk...@builds.apache.org>
Subject Build failed in Jenkins: Mesos-Buildbot » cmake,gcc,--verbose --enable-libevent --enable-ssl,GLOG_v=1 MESOS_VERBOSE=1,centos:7,(ubuntu)&&(!ubuntu-us1)&&(!ubuntu-eu2) #3922
Date Mon, 17 Jul 2017 22:24:14 GMT
See <https://builds.apache.org/job/Mesos-Buildbot/BUILDTOOL=cmake,COMPILER=gcc,CONFIGURATION=--verbose%20--enable-libevent%20--enable-ssl,ENVIRONMENT=GLOG_v=1%20MESOS_VERBOSE=1,OS=centos%3A7,label_exp=(ubuntu)&&(!ubuntu-us1)&&(!ubuntu-eu2)/3922/display/redirect?page=changes>

Changes:

[yujie.jay] Added resource provider ID to calls.

------------------------------------------
[...truncated 1.84 MB...]
I0717 22:23:59.793506 32495 process.cpp:3820] Handling HTTP event for process 'help' with
path: '/help'
I0717 22:23:59.802388 32491 process.cpp:3820] Handling HTTP event for process 'help' with
path: '/help/(76)/body'
I0717 22:23:59.811456 32496 process.cpp:3820] Handling HTTP event for process 'help' with
path: '/help/(76)/a/b/c'
[       OK ] Scheme/HTTPTest.EndpointsHelp/0 (783 ms)
[ RUN      ] Scheme/HTTPTest.EndpointsHelp/1
I0717 22:23:59.818395 31697 process.cpp:1314] libprocess is initialized on 172.17.0.3:57144
with 16 worker threads
I0717 22:23:59.820286 32508 process.cpp:3820] Handling HTTP event for process 'help' with
path: '/help'
I0717 22:23:59.823508 32508 process.cpp:3820] Handling HTTP event for process 'help' with
path: '/help'
I0717 22:23:59.827083 32500 process.cpp:3820] Handling HTTP event for process 'help' with
path: '/help/(77)/body'
I0717 22:23:59.829722 32507 process.cpp:3820] Handling HTTP event for process 'help' with
path: '/help/(77)/a/b/c'
[       OK ] Scheme/HTTPTest.EndpointsHelp/1 (17 ms)
[ RUN      ] Scheme/HTTPTest.EndpointsHelpRemoval/0
I0717 22:24:00.205835 31697 openssl.cpp:419] CA file path is unspecified! NOTE: Set CA file
path with LIBPROCESS_SSL_CA_FILE=<filepath>
I0717 22:24:00.205848 31697 openssl.cpp:424] CA directory path unspecified! NOTE: Set CA directory
path with LIBPROCESS_SSL_CA_DIR=<dirpath>
I0717 22:24:00.205852 31697 openssl.cpp:429] Will not verify peer certificate!
NOTE: Set LIBPROCESS_SSL_VERIFY_CERT=1 to enable peer certificate verification
I0717 22:24:00.205855 31697 openssl.cpp:435] Will only verify peer certificate if presented!
NOTE: Set LIBPROCESS_SSL_REQUIRE_CERT=1 to require peer certificate verification
I0717 22:24:00.206310 32514 process.cpp:993] Failed to accept socket: future discarded
I0717 22:24:00.209575 31697 process.cpp:1314] libprocess is initialized on 172.17.0.3:40799
with 16 worker threads
I0717 22:24:00.215836 32526 process.cpp:3820] Handling HTTP event for process 'help' with
path: '/help/(78)/body'
I0717 22:24:00.223330 32522 process.cpp:3820] Handling HTTP event for process 'help' with
path: '/help/(78)/bogus'
[       OK ] Scheme/HTTPTest.EndpointsHelpRemoval/0 (394 ms)
[ RUN      ] Scheme/HTTPTest.EndpointsHelpRemoval/1
I0717 22:24:00.230048 31697 process.cpp:1314] libprocess is initialized on 172.17.0.3:57652
with 16 worker threads
I0717 22:24:00.232244 32532 process.cpp:3820] Handling HTTP event for process 'help' with
path: '/help/(79)/body'
I0717 22:24:00.236197 32541 process.cpp:3820] Handling HTTP event for process 'help' with
path: '/help/(79)/bogus'
[       OK ] Scheme/HTTPTest.EndpointsHelpRemoval/1 (13 ms)
[ RUN      ] Scheme/HTTPTest.PipeEOF/0
I0717 22:24:00.944629 31697 openssl.cpp:419] CA file path is unspecified! NOTE: Set CA file
path with LIBPROCESS_SSL_CA_FILE=<filepath>
I0717 22:24:00.944643 31697 openssl.cpp:424] CA directory path unspecified! NOTE: Set CA directory
path with LIBPROCESS_SSL_CA_DIR=<dirpath>
I0717 22:24:00.944648 31697 openssl.cpp:429] Will not verify peer certificate!
NOTE: Set LIBPROCESS_SSL_VERIFY_CERT=1 to enable peer certificate verification
I0717 22:24:00.944650 31697 openssl.cpp:435] Will only verify peer certificate if presented!
NOTE: Set LIBPROCESS_SSL_REQUIRE_CERT=1 to require peer certificate verification
I0717 22:24:00.945056 32548 process.cpp:993] Failed to accept socket: future discarded
I0717 22:24:00.947675 31697 process.cpp:1314] libprocess is initialized on 172.17.0.3:50922
with 16 worker threads
[       OK ] Scheme/HTTPTest.PipeEOF/0 (716 ms)
[ RUN      ] Scheme/HTTPTest.PipeEOF/1
I0717 22:24:00.958459 31697 process.cpp:1314] libprocess is initialized on 172.17.0.3:35445
with 16 worker threads
[       OK ] Scheme/HTTPTest.PipeEOF/1 (5 ms)
[ RUN      ] Scheme/HTTPTest.PipeFailure/0
I0717 22:24:01.059708 31697 openssl.cpp:419] CA file path is unspecified! NOTE: Set CA file
path with LIBPROCESS_SSL_CA_FILE=<filepath>
I0717 22:24:01.059722 31697 openssl.cpp:424] CA directory path unspecified! NOTE: Set CA directory
path with LIBPROCESS_SSL_CA_DIR=<dirpath>
I0717 22:24:01.059726 31697 openssl.cpp:429] Will not verify peer certificate!
NOTE: Set LIBPROCESS_SSL_VERIFY_CERT=1 to enable peer certificate verification
I0717 22:24:01.059729 31697 openssl.cpp:435] Will only verify peer certificate if presented!
NOTE: Set LIBPROCESS_SSL_REQUIRE_CERT=1 to require peer certificate verification
I0717 22:24:01.060281 32582 process.cpp:993] Failed to accept socket: future discarded
I0717 22:24:01.062882 31697 process.cpp:1314] libprocess is initialized on 172.17.0.3:53039
with 16 worker threads
[       OK ] Scheme/HTTPTest.PipeFailure/0 (104 ms)
[ RUN      ] Scheme/HTTPTest.PipeFailure/1
I0717 22:24:01.069828 31697 process.cpp:1314] libprocess is initialized on 172.17.0.3:60772
with 16 worker threads
[       OK ] Scheme/HTTPTest.PipeFailure/1 (7 ms)
[ RUN      ] Scheme/HTTPTest.PipeReaderCloses/0
I0717 22:24:01.331606 31697 openssl.cpp:419] CA file path is unspecified! NOTE: Set CA file
path with LIBPROCESS_SSL_CA_FILE=<filepath>
I0717 22:24:01.331620 31697 openssl.cpp:424] CA directory path unspecified! NOTE: Set CA directory
path with LIBPROCESS_SSL_CA_DIR=<dirpath>
I0717 22:24:01.331624 31697 openssl.cpp:429] Will not verify peer certificate!
NOTE: Set LIBPROCESS_SSL_VERIFY_CERT=1 to enable peer certificate verification
I0717 22:24:01.331627 31697 openssl.cpp:435] Will only verify peer certificate if presented!
NOTE: Set LIBPROCESS_SSL_REQUIRE_CERT=1 to require peer certificate verification
I0717 22:24:01.332330 32616 process.cpp:993] Failed to accept socket: future discarded
I0717 22:24:01.334878 31697 process.cpp:1314] libprocess is initialized on 172.17.0.3:53680
with 16 worker threads
[       OK ] Scheme/HTTPTest.PipeReaderCloses/0 (265 ms)
[ RUN      ] Scheme/HTTPTest.PipeReaderCloses/1
I0717 22:24:01.338928 31697 process.cpp:1314] libprocess is initialized on 172.17.0.3:60632
with 16 worker threads
[       OK ] Scheme/HTTPTest.PipeReaderCloses/1 (4 ms)
[ RUN      ] Scheme/HTTPTest.Encode/0
I0717 22:24:01.894202 31697 openssl.cpp:419] CA file path is unspecified! NOTE: Set CA file
path with LIBPROCESS_SSL_CA_FILE=<filepath>
I0717 22:24:01.894217 31697 openssl.cpp:424] CA directory path unspecified! NOTE: Set CA directory
path with LIBPROCESS_SSL_CA_DIR=<dirpath>
I0717 22:24:01.894222 31697 openssl.cpp:429] Will not verify peer certificate!
NOTE: Set LIBPROCESS_SSL_VERIFY_CERT=1 to enable peer certificate verification
I0717 22:24:01.894224 31697 openssl.cpp:435] Will only verify peer certificate if presented!
NOTE: Set LIBPROCESS_SSL_REQUIRE_CERT=1 to require peer certificate verification
I0717 22:24:01.894656 32650 process.cpp:993] Failed to accept socket: future discarded
I0717 22:24:01.897182 31697 process.cpp:1314] libprocess is initialized on 172.17.0.3:54442
with 16 worker threads
[       OK ] Scheme/HTTPTest.Encode/0 (558 ms)
[ RUN      ] Scheme/HTTPTest.Encode/1
I0717 22:24:01.900491 31697 process.cpp:1314] libprocess is initialized on 172.17.0.3:58095
with 16 worker threads
[       OK ] Scheme/HTTPTest.Encode/1 (3 ms)
[ RUN      ] Scheme/HTTPTest.PathParse/0
I0717 22:24:02.144906 31697 openssl.cpp:419] CA file path is unspecified! NOTE: Set CA file
path with LIBPROCESS_SSL_CA_FILE=<filepath>
I0717 22:24:02.144918 31697 openssl.cpp:424] CA directory path unspecified! NOTE: Set CA directory
path with LIBPROCESS_SSL_CA_DIR=<dirpath>
I0717 22:24:02.144922 31697 openssl.cpp:429] Will not verify peer certificate!
NOTE: Set LIBPROCESS_SSL_VERIFY_CERT=1 to enable peer certificate verification
I0717 22:24:02.144925 31697 openssl.cpp:435] Will only verify peer certificate if presented!
NOTE: Set LIBPROCESS_SSL_REQUIRE_CERT=1 to require peer certificate verification
I0717 22:24:02.145334 32684 process.cpp:993] Failed to accept socket: future discarded
I0717 22:24:02.148036 31697 process.cpp:1314] libprocess is initialized on 172.17.0.3:59640
with 16 worker threads
[       OK ] Scheme/HTTPTest.PathParse/0 (248 ms)
[ RUN      ] Scheme/HTTPTest.PathParse/1
I0717 22:24:02.151582 31697 process.cpp:1314] libprocess is initialized on 172.17.0.3:34910
with 16 worker threads
[       OK ] Scheme/HTTPTest.PathParse/1 (3 ms)
[ RUN      ] Scheme/HTTPTest.Get/0
I0717 22:24:02.432646 31697 openssl.cpp:419] CA file path is unspecified! NOTE: Set CA file
path with LIBPROCESS_SSL_CA_FILE=<filepath>
I0717 22:24:02.432660 31697 openssl.cpp:424] CA directory path unspecified! NOTE: Set CA directory
path with LIBPROCESS_SSL_CA_DIR=<dirpath>
I0717 22:24:02.432664 31697 openssl.cpp:429] Will not verify peer certificate!
NOTE: Set LIBPROCESS_SSL_VERIFY_CERT=1 to enable peer certificate verification
I0717 22:24:02.432668 31697 openssl.cpp:435] Will only verify peer certificate if presented!
NOTE: Set LIBPROCESS_SSL_REQUIRE_CERT=1 to require peer certificate verification
I0717 22:24:02.433085 32718 process.cpp:993] Failed to accept socket: future discarded
I0717 22:24:02.435494 31697 process.cpp:1314] libprocess is initialized on 172.17.0.3:38291
with 16 worker threads
I0717 22:24:02.441164 32726 process.cpp:3820] Handling HTTP event for process '(80)' with
path: '/(80)/get'
I0717 22:24:02.447307 32720 process.cpp:3820] Handling HTTP event for process '(80)' with
path: '/(80)/get'
[       OK ] Scheme/HTTPTest.Get/0 (298 ms)
[ RUN      ] Scheme/HTTPTest.Get/1
I0717 22:24:02.452430 31697 process.cpp:1314] libprocess is initialized on 172.17.0.3:46177
with 16 worker threads
I0717 22:24:02.453570 32742 process.cpp:3820] Handling HTTP event for process '(81)' with
path: '/(81)/get'
I0717 22:24:02.456154 32740 process.cpp:3820] Handling HTTP event for process '(81)' with
path: '/(81)/get'
[       OK ] Scheme/HTTPTest.Get/1 (8 ms)
[ RUN      ] Scheme/HTTPTest.NestedGet/0
I0717 22:24:02.696873 31697 openssl.cpp:419] CA file path is unspecified! NOTE: Set CA file
path with LIBPROCESS_SSL_CA_FILE=<filepath>
I0717 22:24:02.696887 31697 openssl.cpp:424] CA directory path unspecified! NOTE: Set CA directory
path with LIBPROCESS_SSL_CA_DIR=<dirpath>
I0717 22:24:02.696890 31697 openssl.cpp:429] Will not verify peer certificate!
NOTE: Set LIBPROCESS_SSL_VERIFY_CERT=1 to enable peer certificate verification
I0717 22:24:02.696893 31697 openssl.cpp:435] Will only verify peer certificate if presented!
NOTE: Set LIBPROCESS_SSL_REQUIRE_CERT=1 to require peer certificate verification
I0717 22:24:02.697304 32752 process.cpp:993] Failed to accept socket: future discarded
I0717 22:24:02.699753 31697 process.cpp:1314] libprocess is initialized on 172.17.0.3:59585
with 16 worker threads
I0717 22:24:02.705452 32753 process.cpp:3820] Handling HTTP event for process '(82)' with
path: '/(82)//a/b/c'
I0717 22:24:02.712119 32766 process.cpp:3820] Handling HTTP event for process '(82)' with
path: '/(82)//a/b'
[       OK ] Scheme/HTTPTest.NestedGet/0 (257 ms)
[ RUN      ] Scheme/HTTPTest.NestedGet/1
I0717 22:24:02.721871 31697 process.cpp:1314] libprocess is initialized on 172.17.0.3:55326
with 16 worker threads
I0717 22:24:02.723413   307 process.cpp:3820] Handling HTTP event for process '(83)' with
path: '/(83)//a/b/c'
I0717 22:24:02.726063   309 process.cpp:3820] Handling HTTP event for process '(83)' with
path: '/(83)//a/b'
[       OK ] Scheme/HTTPTest.NestedGet/1 (13 ms)
[ RUN      ] Scheme/HTTPTest.StreamingGetComplete/0
I0717 22:24:02.975883 31697 openssl.cpp:419] CA file path is unspecified! NOTE: Set CA file
path with LIBPROCESS_SSL_CA_FILE=<filepath>
I0717 22:24:02.975898 31697 openssl.cpp:424] CA directory path unspecified! NOTE: Set CA directory
path with LIBPROCESS_SSL_CA_DIR=<dirpath>
I0717 22:24:02.975901 31697 openssl.cpp:429] Will not verify peer certificate!
NOTE: Set LIBPROCESS_SSL_VERIFY_CERT=1 to enable peer certificate verification
I0717 22:24:02.975904 31697 openssl.cpp:435] Will only verify peer certificate if presented!
NOTE: Set LIBPROCESS_SSL_REQUIRE_CERT=1 to require peer certificate verification
I0717 22:24:02.976354   318 process.cpp:993] Failed to accept socket: future discarded
I0717 22:24:02.978904 31697 process.cpp:1314] libprocess is initialized on 172.17.0.3:60650
with 16 worker threads
I0717 22:24:02.985090   330 process.cpp:3820] Handling HTTP event for process '(84)' with
path: '/(84)/pipe'
[       OK ] Scheme/HTTPTest.StreamingGetComplete/0 (300 ms)
[ RUN      ] Scheme/HTTPTest.StreamingGetComplete/1
I0717 22:24:03.031627 31697 process.cpp:1314] libprocess is initialized on 172.17.0.3:45514
with 16 worker threads
I0717 22:24:03.033515   348 process.cpp:3820] Handling HTTP event for process '(85)' with
path: '/(85)/pipe'
[       OK ] Scheme/HTTPTest.StreamingGetComplete/1 (11 ms)
[ RUN      ] Scheme/HTTPTest.StreamingGetFailure/0
I0717 22:24:03.454432 31697 openssl.cpp:419] CA file path is unspecified! NOTE: Set CA file
path with LIBPROCESS_SSL_CA_FILE=<filepath>
I0717 22:24:03.454447 31697 openssl.cpp:424] CA directory path unspecified! NOTE: Set CA directory
path with LIBPROCESS_SSL_CA_DIR=<dirpath>
I0717 22:24:03.454453 31697 openssl.cpp:429] Will not verify peer certificate!
NOTE: Set LIBPROCESS_SSL_VERIFY_CERT=1 to enable peer certificate verification
I0717 22:24:03.454459 31697 openssl.cpp:435] Will only verify peer certificate if presented!
NOTE: Set LIBPROCESS_SSL_REQUIRE_CERT=1 to require peer certificate verification
I0717 22:24:03.454883   352 process.cpp:993] Failed to accept socket: future discarded
I0717 22:24:03.457589 31697 process.cpp:1314] libprocess is initialized on 172.17.0.3:36735
with 16 worker threads
I0717 22:24:03.463393   363 process.cpp:3820] Handling HTTP event for process '(86)' with
path: '/(86)/pipe'
I0717 22:24:03.505137   366 process.cpp:1678] Failed to read from stream: oops
[       OK ] Scheme/HTTPTest.StreamingGetFailure/0 (468 ms)
[ RUN      ] Scheme/HTTPTest.StreamingGetFailure/1
I0717 22:24:03.510210 31697 process.cpp:1314] libprocess is initialized on 172.17.0.3:42238
with 16 worker threads
I0717 22:24:03.512061   375 process.cpp:3820] Handling HTTP event for process '(87)' with
path: '/(87)/pipe'
I0717 22:24:03.515226   370 process.cpp:1678] Failed to read from stream: oops
[       OK ] Scheme/HTTPTest.StreamingGetFailure/1 (10 ms)
[ RUN      ] Scheme/HTTPTest.PipeEquality/0
I0717 22:24:03.734084 31697 openssl.cpp:419] CA file path is unspecified! NOTE: Set CA file
path with LIBPROCESS_SSL_CA_FILE=<filepath>
I0717 22:24:03.734098 31697 openssl.cpp:424] CA directory path unspecified! NOTE: Set CA directory
path with LIBPROCESS_SSL_CA_DIR=<dirpath>
I0717 22:24:03.734102 31697 openssl.cpp:429] Will not verify peer certificate!
NOTE: Set LIBPROCESS_SSL_VERIFY_CERT=1 to enable peer certificate verification
I0717 22:24:03.734105 31697 openssl.cpp:435] Will only verify peer certificate if presented!
NOTE: Set LIBPROCESS_SSL_REQUIRE_CERT=1 to require peer certificate verification
I0717 22:24:03.734545   386 process.cpp:993] Failed to accept socket: future discarded
I0717 22:24:03.737139 31697 process.cpp:1314] libprocess is initialized on 172.17.0.3:39518
with 16 worker threads
[       OK ] Scheme/HTTPTest.PipeEquality/0 (221 ms)
[ RUN      ] Scheme/HTTPTest.PipeEquality/1
I0717 22:24:03.740522 31697 process.cpp:1314] libprocess is initialized on 172.17.0.3:49819
with 16 worker threads
[       OK ] Scheme/HTTPTest.PipeEquality/1 (3 ms)
[ RUN      ] Scheme/HTTPTest.Post/0
I0717 22:24:04.138520 31697 openssl.cpp:419] CA file path is unspecified! NOTE: Set CA file
path with LIBPROCESS_SSL_CA_FILE=<filepath>
I0717 22:24:04.138533 31697 openssl.cpp:424] CA directory path unspecified! NOTE: Set CA directory
path with LIBPROCESS_SSL_CA_DIR=<dirpath>
I0717 22:24:04.138537 31697 openssl.cpp:429] Will not verify peer certificate!
NOTE: Set LIBPROCESS_SSL_VERIFY_CERT=1 to enable peer certificate verification
I0717 22:24:04.138540 31697 openssl.cpp:435] Will only verify peer certificate if presented!
NOTE: Set LIBPROCESS_SSL_REQUIRE_CERT=1 to require peer certificate verification
I0717 22:24:04.139003   420 process.cpp:993] Failed to accept socket: future discarded
I0717 22:24:04.141414 31697 process.cpp:1314] libprocess is initialized on 172.17.0.3:36117
with 16 worker threads
I0717 22:24:04.147543   423 process.cpp:3820] Handling HTTP event for process '(88)' with
path: '/(88)/post'
I0717 22:24:04.192982   424 process.cpp:3820] Handling HTTP event for process '(88)' with
path: '/(88)/post'
[       OK ] Scheme/HTTPTest.Post/0 (494 ms)
[ RUN      ] Scheme/HTTPTest.Post/1
*** Aborted at 1500330244 (unix time) try "date -d @1500330244" if you are using GNU date
***
I0717 22:24:04.238915 31697 process.cpp:1314] libprocess is initialized on 172.17.0.3:37088
with 16 worker threads
I0717 22:24:04.240813   450 process.cpp:3820] Handling HTTP event for process '(89)' with
path: '/(89)/post'
I0717 22:24:04.244454   442 process.cpp:3820] Handling HTTP event for process '(89)' with
path: '/(89)/post'
[       OK ] Scheme/HTTPTest.Post/1 (13 ms)
[ RUN      ] Scheme/HTTPTest.Delete/0
PC: @     0x7ff3a7808c86 __memcpy_ssse3_back
*** SIGSEGV (@0x3b9e288) received by PID 31697 (TID 0x7ff39e484700) from PID 62513800; stack
trace: ***
    @     0x7ff3a82af370 (unknown)
    @     0x7ff3a7808c86 __memcpy_ssse3_back
    @     0x7ff3a80558e0 (unknown)
    @     0x7ff3a8055f8c (unknown)
    @           0xaf4898 process::UPID::UPID()
    @     0x7ff3aaf7572a process::DispatchEvent::DispatchEvent()
    @     0x7ff3aaf6d4a8 process::internal::dispatch()
    @     0x7ff3aaf8d1cf process::dispatch<>()
    @     0x7ff3aaf6c4cf process::ProcessBase::route()
    @     0x7ff3aadf9640 process::ProcessBase::route<>()
    @     0x7ff3aadf5513 process::Help::initialize()
    @     0x7ff3aaf65f8e process::ProcessManager::resume()
    @     0x7ff3aaf6245a _ZZN7process14ProcessManager12init_threadsEvENKUt_clEv
    @     0x7ff3aaf73b9e _ZNSt12_Bind_simpleIFZN7process14ProcessManager12init_threadsEvEUt_vEE9_M_invokeIIEEEvSt12_Index_tupleIIXspT_EEE
    @     0x7ff3aaf73af5 _ZNSt12_Bind_simpleIFZN7process14ProcessManager12init_threadsEvEUt_vEEclEv
    @     0x7ff3aaf73a8e _ZNSt6thread5_ImplISt12_Bind_simpleIFZN7process14ProcessManager12init_threadsEvEUt_vEEE6_M_runEv
    @     0x7ff3a804c230 (unknown)
    @     0x7ff3a82a7dc5 start_thread
    @     0x7ff3a77b576d __clone
make[3]: *** [CMakeFiles/check] Segmentation fault
make[3]: Leaving directory `/mesos/build'
make[2]: *** [CMakeFiles/check.dir/all] Error 2
make[2]: Leaving directory `/mesos/build'
make[1]: *** [CMakeFiles/check.dir/rule] Error 2
make[1]: Leaving directory `/mesos/build'
make: *** [check] Error 2
+ docker rmi mesos-1500327812-20257
Untagged: mesos-1500327812-20257:latest
Deleted: sha256:d24dfd5e717d6ea4a753a37eea60a4a1e03f85a1b6c6bebe6dba3f31012a515d
Deleted: sha256:15cdd0399808f1c7ad5fcb4a26b0a8ecedca48aff8f47694aab2115ab42a0652
Deleted: sha256:b1f3b1fd20f2f9917f23f9fa9d4278456e20fdeb4ce4f9d4ed2a10dbfe9ede63
Deleted: sha256:7150769fe67cf54a0ffd618d020a57a1af1eee6187c8bfca13758ad26b21380d
Deleted: sha256:e30ccc16f62908796980705389f70969c8c2b37aa9699e8450a81e9e937e13cd
Deleted: sha256:f6509b24bbe685902ed1ca5e3b054aaf7551a662363d293b688f498e420ba883
Deleted: sha256:ae6216107c4b727a66a1955d4ae8fe441d24ce6fe27f6e103ab1c519976cee52
Deleted: sha256:30537045645c9cf1f081a91a017a80182eb0327487445f6238ec47798f20ba5e
Deleted: sha256:ed2dc62c1ad3288597981497ad5b2bf73c457c11d55531b5df68af133390ee28
Deleted: sha256:a743c97cff226c117231731e3ad8aee84abcc1e7e604c64cdaf083e0e7bc90e2
Deleted: sha256:31c19e37332d3737dbf9479ef26ab47b1e30fb0d6173cfa0920bd8bd2be7f65a
Deleted: sha256:b0794a647735eb16d61aef363710c197453935bd4fd4eea709543bfccdfbd4e1
Deleted: sha256:7dede598f9d08e3677713966907c4029068af8d47001d211df98712c866f6f27
Deleted: sha256:3f32bc2f61d2eda069abe50710c2736dd6d8cc7723bc90fdf851c2bc1ed331f4
Deleted: sha256:17a0036855fe89b5a25695a4d86fbd6289fcc2a6e237345d5af38db5da56d436
Deleted: sha256:acb78f6b49c26617f56bcbe6faebbf130abcd065f895af1bdfc7ec73ea89386a
Deleted: sha256:067bf422fa280bcb88b83b41c90d3aa1e942db5b5bbb7f831d6f8856ac444380
Deleted: sha256:f76dd83dd35260262f61e88c1e6b731f9cad503cd7e67f93894bc1995e079a41
Deleted: sha256:08c782440798ae6720f61cffa161cf53f948e6d767485bdbf4639c53fc345145
Deleted: sha256:964d661a3004d72cbe67645bb105abd1bb7d92a1f65325bf97c89fc7e88a936f
Deleted: sha256:b6276e8c9c0ecdaa17bacfd07bce9fdbbe9285d2016dda45082b9c1a7fd0ac9e
Deleted: sha256:c59d8428095fcabe07bdd48aa20138edd6dfdd34b3dd5335ce781b5a5d7f385d
Deleted: sha256:034486a22382ded6b885a2af27b6c15b84a0768baa20859bbbd2e92c742e5911
Deleted: sha256:042c48e8b86fb5959f38d1fae8d232252d30b34e6111aa8c8a6fb181a1006bfc
Deleted: sha256:d5bc7f91f427a230386786bc6bf3f8d23ed7d4a39ec660e978d498a51fcc9354
Build step 'Execute shell' marked build as failure
Not sending mail to unregistered user xujyan@apple.com
Not sending mail to unregistered user yujie.jay@gmail.com

Mime
View raw message